1 | 2025-03-10T23:09:15.596Z | INFO | phd-runner: phd_runner
file = phd-tests/runner/src/main.rs
line = 35
runner_args = ProcessArgs { command: Run(RunOptions { propolis_server_cmd: "/work/phd-test/propolis-server", base_propolis_branch: Some("master"), base_propolis_commit: None, base_propolis_cmd: None, crucible_downstairs_cmd: None, crucible_downstairs_commit: Some(Auto), tmp_directory: "/tmp/propolis-phd", artifact_directory: Some("/phd-artifacts"), server_logging_mode: TmpFile, default_guest_cpus: 2, default_guest_memory_mib: 512, artifact_toml_path: "/work/phd-test/artifacts.toml", default_guest_artifact: "alpine", default_bootrom_artifact: "ovmf", include_filter: ["phd_tests::migrate::from_base"], exclude_filter: [], max_buildomat_wait_secs: 1200 }), disable_ansi: false, emit_bunyan: true }
target = phd_runner
|
2 | 2025-03-10T23:09:15.599Z | DEBG | phd-runner: Created new artifact store from manifest
file = phd-tests/framework/src/artifacts/store.rs
line = 221
store = Store { local_dir: "/phd-artifacts", artifacts: {"alpine": Mutex { data: StoredArtifact { description: Artifact { filename: "alpine.iso", kind: GuestOs(Alpine), source: RemoteServer { sha256: "ba8007f74f9b54fbae3b2520da577831b4834778a498d732f091260c61aa7ca1" }, untar: None }, cached_path: None } }, "ovmf": Mutex { data: StoredArtifact { description: Artifact { filename: "OVMF_CODE.fd", kind: Bootrom, source: Buildomat(BuildomatArtifact { repo: Repo("oxidecomputer/edk2"), series: Series("image_debug"), commit: Commit("6d92acf0a22718dd4175d7c64dbcf7aaec3740bd"), sha256: "29813374b58e3b77fb665f2d95cb3bab37d44fdd2c4fce2a70de9d76a3512a4f" }), untar: None }, cached_path: None } }}, downloader: DownloadConfig { timeout: 600s, buildomat_backoff: ExponentialBackoff { current_interval: 1s, initial_interval: 1s, randomization_factor: 0.5, multiplier: 1.5, max_interval: 60s, start_time: Instant { tv_sec: 2305, tv_nsec: 22890648 }, max_elapsed_time: Some(1200s), clock: SystemClock }, remote_server_uris: ["https://oxide-omicron-build.s3.amazonaws.com"] } }
target = phd_framework::artifacts::store
|
3 | 2025-03-10T23:09:15.599Z | INFO | phd-runner: Adding Propolis server from local command
file = phd-tests/framework/src/artifacts/store.rs
line = 229
propolis_server_cmd = /work/phd-test/propolis-server
target = phd_framework::artifacts::store
|
4 | 2025-03-10T23:09:15.599Z | INFO | phd-runner: Adding crucible-downstairs from Buildomat Git revision
commit = d2d8f8ad449df7e2befb7ee2723a442dd74b9b72
file = phd-tests/framework/src/artifacts/store.rs
line = 313
target = phd_framework::artifacts::store
|
5 | 2025-03-10T23:09:15.599Z | DEBG | phd-runner: Downloading file from Buildomat...
file = phd-tests/framework/src/artifacts/buildomat.rs
line = 215
target = phd_framework::artifacts::buildomat
timeout = 600s
uri = https://buildomat.eng.oxide.computer/public/file/oxidecomputer/crucible/nightly-image/d2d8f8ad449df7e2befb7ee2723a442dd74b9b72/crucible-nightly.sha256.txt
|
6 | 2025-03-10T23:09:15.742Z | INFO | phd-runner: Adding 'current' Propolis server from Buildomat Git branch 'master'
file = phd-tests/framework/src/artifacts/store.rs
line = 250
target = phd_framework::artifacts::store
|
7 | 2025-03-10T23:09:16.167Z | DEBG | phd-runner: Downloading file from Buildomat...
file = phd-tests/framework/src/artifacts/buildomat.rs
line = 215
target = phd_framework::artifacts::buildomat
timeout = 600s
uri = https://buildomat.eng.oxide.computer/public/file/oxidecomputer/propolis/phd_build/9ee2e1f5f8d7cc3543b6985af36c0df7f81498c5/propolis-server.sha256.txt
|
8 | 2025-03-10T23:09:16.272Z | INFO | phd-runner: [EXECUTION_SETUP - START]
file = phd-tests/runner/src/fixtures.rs
line = 25
target = phd_runner::fixtures
|
9 | 2025-03-10T23:09:16.272Z | INFO | phd-runner: [EXECUTION_SETUP - END]
elapsed_milliseconds = 0
file = phd-tests/runner/src/fixtures.rs
line = 25
target = phd_runner::fixtures
|
10 | 2025-03-10T23:09:16.272Z | INFO | phd-runner: Running 3 test(s)
file = phd-tests/runner/src/execute.rs
line = 82
target = phd_runner::execute
|
11 | 2025-03-10T23:09:16.272Z | INFO | phd-runner: Starting test phd_tests::migrate::from_base::migration_from_base_and_back
file = phd-tests/runner/src/execute.rs
line = 90
target = phd_runner::execute
|
12 | 2025-03-10T23:09:16.272Z | INFO | phd-runner: [TEST_SETUP - START]
file = phd-tests/runner/src/fixtures.rs
line = 41
target = phd_runner::fixtures
|
13 | 2025-03-10T23:09:16.272Z | INFO | phd-runner: [TEST_SETUP - END]
elapsed_milliseconds = 0
file = phd-tests/runner/src/fixtures.rs
line = 41
target = phd_runner::fixtures
|
14 | 2025-03-10T23:09:16.272Z | INFO | phd-runner: [TEST - START]
file = phd-tests/tests/src/migrate.rs
line = 52
path = phd_tests::migrate::from_base::migration_from_base_and_back
target = phd_tests::migrate::from_base
|
15 | 2025-03-10T23:09:16.272Z | DEBG | phd-runner: [TEST - EVENT] checking for existing copy of artifact
file = phd-tests/framework/src/artifacts/store.rs
line = 89
maybe_path = /phd-artifacts/29813374b58e3b77fb665f2d95cb3bab37d44fdd2c4fce2a70de9d76a3512a4f/OVMF_CODE.fd
path = phd_tests::migrate::from_base::migration_from_base_and_back
target = phd_framework::artifacts::store
|
16 | 2025-03-10T23:09:16.273Z | DEBG | phd-runner: [TEST - EVENT] Downloading file from Buildomat...
file = phd-tests/framework/src/artifacts/buildomat.rs
line = 215
path = phd_tests::migrate::from_base::migration_from_base_and_back
target = phd_framework::artifacts::buildomat
timeout = 600s
uri = https://buildomat.eng.oxide.computer/public/file/oxidecomputer/edk2/image_debug/6d92acf0a22718dd4175d7c64dbcf7aaec3740bd/OVMF_CODE.fd
|
17 | 2025-03-10T23:09:16.858Z | DEBG | phd-runner: [TEST - EVENT] checking for existing copy of artifact
file = phd-tests/framework/src/artifacts/store.rs
line = 89
maybe_path = /phd-artifacts/ba8007f74f9b54fbae3b2520da577831b4834778a498d732f091260c61aa7ca1/alpine.iso
path = phd_tests::migrate::from_base::migration_from_base_and_back
target = phd_framework::artifacts::store
|
18 | 2025-03-10T23:09:16.858Z | DEBG | phd-runner: [TEST - EVENT] Downloading alpine.iso from https://oxide-omicron-build.s3.amazonaws.com/alpine.iso
file = phd-tests/framework/src/artifacts/store.rs
line = 621
path = phd_tests::migrate::from_base::migration_from_base_and_back
target = phd_framework::artifacts::store
timeout = 600s
|
19 | 2025-03-10T23:09:51.030Z | DEBG | phd-runner: [TEST - EVENT] Verified artifact already exists
file = phd-tests/framework/src/artifacts/store.rs
line = 45
path = /phd-artifacts/ba8007f74f9b54fbae3b2520da577831b4834778a498d732f091260c61aa7ca1/alpine.iso
target = phd_framework::artifacts::store
|
20 | 2025-03-10T23:09:51.030Z | DEBG | phd-runner: [TEST - EVENT] executing ZFS command
args = ["/phd-artifacts/ba8007f74f9b54fbae3b2520da577831b4834778a498d732f091260c61aa7ca1/alpine.iso"]
file = phd-tests/framework/src/zfs.rs
line = 304
path = phd_tests::migrate::from_base::migration_from_base_and_back
target = phd_framework::zfs
verb = list
|
21 | 2025-03-10T23:09:51.055Z | DEBG | phd-runner: [TEST - EVENT] parsing zfs list output
file = phd-tests/framework/src/zfs.rs
line = 238
path = phd_tests::migrate::from_base::migration_from_base_and_back
stdout = NAME USED AVAIL REFER MOUNTPOINT\nphd-artifacts 2M 1.80T 1.91M /phd-artifacts\n
target = phd_framework::zfs
|
22 | 2025-03-10T23:09:51.056Z | DEBG | phd-runner: [TEST - EVENT] executing ZFS command
args = ["phd-artifacts@phd-4ff0d69b-8e0d-47df-bfcd-4b28b7590ca5"]
file = phd-tests/framework/src/zfs.rs
line = 304
path = phd_tests::migrate::from_base::migration_from_base_and_back
target = phd_framework::zfs
verb = snapshot
|
23 | 2025-03-10T23:09:51.111Z | DEBG | phd-runner: [TEST - EVENT] executing ZFS command
args = ["phd-artifacts@phd-4ff0d69b-8e0d-47df-bfcd-4b28b7590ca5", "phd-artifacts/phd-clone-28318da7-b1bd-4847-ba88-9fa5c098f3fb"]
file = phd-tests/framework/src/zfs.rs
line = 304
path = phd_tests::migrate::from_base::migration_from_base_and_back
target = phd_framework::zfs
verb = clone
|
24 | 2025-03-10T23:09:51.132Z | DEBG | phd-runner: [TEST - EVENT] executing ZFS command
args = ["phd-artifacts/phd-clone-28318da7-b1bd-4847-ba88-9fa5c098f3fb"]
file = phd-tests/framework/src/zfs.rs
line = 304
path = phd_tests::migrate::from_base::migration_from_base_and_back
target = phd_framework::zfs
verb = list
|
25 | 2025-03-10T23:09:51.144Z | DEBG | phd-runner: [TEST - EVENT] parsing zfs list output
file = phd-tests/framework/src/zfs.rs
line = 238
path = phd_tests::migrate::from_base::migration_from_base_and_back
stdout = NAME USED AVAIL REFER MOUNTPOINT\nphd-artifacts/phd-clone-28318da7-b1bd-4847-ba88-9fa5c098f3fb 0B 1.80T 48.9M /phd-artifacts/phd-clone-28318da7-b1bd-4847-ba88-9fa5c098f3fb\n
target = phd_framework::zfs
|
26 | 2025-03-10T23:09:51.145Z | INFO | phd-runner: [NEW - START]
file = phd-tests/framework/src/test_vm/mod.rs
line = 193
path = phd_tests::migrate::from_base::migration_from_base_and_back
target = phd_framework::test_vm
|
27 | 2025-03-10T23:09:51.145Z | INFO | phd-runner: [NEW - EVENT] phd_framework::test_vm
environment = EnvironmentSpec { location: Local, propolis_artifact: "__BASE_PROPOLIS" }
file = phd-tests/framework/src/test_vm/mod.rs
guest_os_kind = Alpine
line = 211
path = phd_tests::migrate::from_base::migration_from_base_and_back
target = phd_framework::test_vm
vm_name = migration_from_base_and_back
|
28 | 2025-03-10T23:09:51.145Z | DEBG | phd-runner: [NEW - EVENT] checking for existing copy of artifact
file = phd-tests/framework/src/artifacts/store.rs
line = 89
maybe_path = /phd-artifacts/699c2d2c5e97e63733ab85fce044388baefe882761373e5c02190990dd286770/propolis-server.tar.gz
path = phd_tests::migrate::from_base::migration_from_base_and_back
target = phd_framework::artifacts::store
|
29 | 2025-03-10T23:09:51.145Z | DEBG | phd-runner: [NEW - EVENT] Downloading file from Buildomat...
file = phd-tests/framework/src/artifacts/buildomat.rs
line = 215
path = phd_tests::migrate::from_base::migration_from_base_and_back
target = phd_framework::artifacts::buildomat
timeout = 600s
uri = https://buildomat.eng.oxide.computer/public/file/oxidecomputer/propolis/phd_build/9ee2e1f5f8d7cc3543b6985af36c0df7f81498c5/propolis-server.tar.gz
|
30 | 2025-03-10T23:10:16.242Z | DEBG | phd-runner: [NEW - EVENT] Extracting artifact from tarball
extracted_path = /phd-artifacts/699c2d2c5e97e63733ab85fce044388baefe882761373e5c02190990dd286770/propolis-server
file = phd-tests/framework/src/artifacts/store.rs
line = 162
path = phd_tests::migrate::from_base::migration_from_base_and_back
target = phd_framework::artifacts::store
untar_path = propolis-server
|
31 | 2025-03-10T23:10:16.242Z | DEBG | phd-runner: [NEW - EVENT] Extracting gzipped tarball...
file = phd-tests/framework/src/artifacts/store.rs
line = 521
path = phd_tests::migrate::from_base::migration_from_base_and_back
target = phd_framework::artifacts::store
|
32 | 2025-03-10T23:10:29.235Z | INFO | phd-runner: [NEW - EVENT] Launching Propolis server
bootrom_path = "/phd-artifacts/29813374b58e3b77fb665f2d95cb3bab37d44fdd2c4fce2a70de9d76a3512a4f/OVMF_CODE.fd"
file = phd-tests/framework/src/test_vm/server.rs
line = 55
path = phd_tests::migrate::from_base::migration_from_base_and_back
server_addr = 127.0.0.1:9000
server_path = "/phd-artifacts/699c2d2c5e97e63733ab85fce044388baefe882761373e5c02190990dd286770/propolis-server"
target = phd_framework::test_vm::server
|
33 | 2025-03-10T23:10:29.235Z | INFO | phd-runner: [NEW - EVENT] Opening server log files
file = phd-tests/framework/src/server_log_mode.rs
line = 64
path = phd_tests::migrate::from_base::migration_from_base_and_back
stderr_path = "/tmp/propolis-phd/migration_from_base_and_back.stderr.log"
stdout_path = "/tmp/propolis-phd/migration_from_base_and_back.stdout.log"
target = phd_framework::server_log_mode
|
34 | 2025-03-10T23:10:29.285Z | INFO | phd-runner: [NEW - EVENT] Launched server with pid 868
file = phd-tests/framework/src/test_vm/server.rs
line = 107
path = phd_tests::migrate::from_base::migration_from_base_and_back
target = phd_framework::test_vm::server
|
35 | 2025-03-10T23:10:29.286Z | INFO | phd-runner: [NEW - END]
elapsed_milliseconds = 38140
file = phd-tests/framework/src/test_vm/mod.rs
line = 193
path = phd_tests::migrate::from_base::migration_from_base_and_back
target = phd_framework::test_vm
|
36 | 2025-03-10T23:10:29.286Z | INFO | phd-runner: [INSTANCE_ENSURE_INTERNAL - START]
file = phd-tests/framework/src/test_vm/mod.rs
line = 276
path = phd_tests::migrate::from_base::migration_from_base_and_back
target = phd_framework::test_vm
vm = migration_from_base_and_back
vm_id = 9b3b3d9f-4f77-40a9-847b-5c1dc09e4a65
|
37 | 2025-03-10T23:10:29.287Z | INFO | phd-runner: [INSTANCE_ENSURE_INTERNAL - EVENT] retriable error from instance_spec_ensure
e = Communication Error: error sending request for url (http://127.0.0.1:9000/instance)
file = phd-tests/framework/src/test_vm/mod.rs
line = 320
path = phd_tests::migrate::from_base::migration_from_base_and_back
target = phd_framework::test_vm
vm = migration_from_base_and_back
vm_id = 9b3b3d9f-4f77-40a9-847b-5c1dc09e4a65
|
38 | 2025-03-10T23:10:29.778Z | INFO | phd-runner: [SERIAL CONSOLE TASK - START]
file = phd-tests/framework/src/serial/mod.rs
line = 200
target = phd_framework::serial
|
39 | 2025-03-10T23:10:29.780Z | INFO | phd-runner: [INSTANCE_ENSURE_INTERNAL - EVENT] Started instance
file = phd-tests/framework/src/test_vm/mod.rs
instance_description.instance = Instance { properties: InstanceProperties { description: "Pheidippides-managed VM", id: 9b3b3d9f-4f77-40a9-847b-5c1dc09e4a65, metadata: InstanceMetadata { project_id: 15ba45b8-4f53-4512-950f-e62eb49080da, silo_id: f1211c9e-be87-4d22-acc5-5eda13de6d8a, sled_id: 6e9c2fd6-6d7b-4eea-a308-0434a685251e, sled_model: "pheidippes", sled_revision: 1, sled_serial: "6e9c2fd6-6d7b-4eea-a308-0434a685251e" }, name: "phd-vm-9b3b3d9f-4f77-40a9-847b-5c1dc09e4a65" }, state: Creating }
line = 379
path = phd_tests::migrate::from_base::migration_from_base_and_back
target = phd_framework::test_vm
vm = migration_from_base_and_back
vm_id = 9b3b3d9f-4f77-40a9-847b-5c1dc09e4a65
|
40 | 2025-03-10T23:10:29.780Z | INFO | phd-runner: [INSTANCE_ENSURE_INTERNAL - END]
elapsed_milliseconds = 493
file = phd-tests/framework/src/test_vm/mod.rs
line = 276
path = phd_tests::migrate::from_base::migration_from_base_and_back
target = phd_framework::test_vm
vm = migration_from_base_and_back
vm_id = 9b3b3d9f-4f77-40a9-847b-5c1dc09e4a65
|
41 | 2025-03-10T23:10:29.780Z | INFO | phd-runner: [PUT_INSTANCE_STATE - START]
file = phd-tests/framework/src/test_vm/mod.rs
line = 440
path = phd_tests::migrate::from_base::migration_from_base_and_back
target = phd_framework::test_vm
vm = migration_from_base_and_back
vm_id = 9b3b3d9f-4f77-40a9-847b-5c1dc09e4a65
|
42 | 2025-03-10T23:10:29.780Z | INFO | phd-runner: [PUT_INSTANCE_STATE - EVENT] Requesting instance state change
file = phd-tests/framework/src/test_vm/mod.rs
line = 445
path = phd_tests::migrate::from_base::migration_from_base_and_back
state = Run
target = phd_framework::test_vm
vm = migration_from_base_and_back
vm_id = 9b3b3d9f-4f77-40a9-847b-5c1dc09e4a65
|
43 | 2025-03-10T23:10:29.781Z | INFO | phd-runner: [PUT_INSTANCE_STATE - END]
elapsed_milliseconds = 0
file = phd-tests/framework/src/test_vm/mod.rs
line = 440
path = phd_tests::migrate::from_base::migration_from_base_and_back
target = phd_framework::test_vm
vm = migration_from_base_and_back
vm_id = 9b3b3d9f-4f77-40a9-847b-5c1dc09e4a65
|
44 | 2025-03-10T23:10:29.781Z | INFO | phd-runner: [WAIT_TO_BOOT - START]
file = phd-tests/framework/src/test_vm/mod.rs
line = 757
path = phd_tests::migrate::from_base::migration_from_base_and_back
target = phd_framework::test_vm
|
45 | 2025-03-10T23:10:29.781Z | INFO | phd-runner: [WAIT_TO_BOOT - EVENT] waiting for guest to boot
file = phd-tests/framework/src/test_vm/mod.rs
line = 706
path = phd_tests::migrate::from_base::migration_from_base_and_back
target = phd_framework::test_vm
timeout_duration = 300s
vm = migration_from_base_and_back
vm_id = 9b3b3d9f-4f77-40a9-847b-5c1dc09e4a65
|
46 | 2025-03-10T23:10:29.781Z | DEBG | phd-runner: [WAIT_TO_BOOT - EVENT] executing command in boot sequence
file = phd-tests/framework/src/test_vm/mod.rs
line = 714
path = phd_tests::migrate::from_base::migration_from_base_and_back
step = WaitFor("localhost login: ")
target = phd_framework::test_vm
|
47 | 2025-03-10T23:10:29.781Z | INFO | phd-runner: [WAIT_FOR_SERIAL_OUTPUT - START]
file = phd-tests/framework/src/test_vm/mod.rs
line = 772
path = phd_tests::migrate::from_base::migration_from_base_and_back
target = phd_framework::test_vm
vm = migration_from_base_and_back
vm_id = 9b3b3d9f-4f77-40a9-847b-5c1dc09e4a65
|
48 | 2025-03-10T23:10:29.781Z | INFO | phd-runner: [WAIT_FOR_SERIAL_OUTPUT - EVENT] Waiting for output on serial console
file = phd-tests/framework/src/test_vm/mod.rs
line = 779
path = phd_tests::migrate::from_base::migration_from_base_and_back
target = phd_framework::test_vm
timeout_duration = CallerTimeout
vm = migration_from_base_and_back
vm_id = 9b3b3d9f-4f77-40a9-847b-5c1dc09e4a65
|
49 | 2025-03-10T23:10:34.068Z | INFO | phd-runner: [WAIT_FOR_SERIAL_OUTPUT - END]
elapsed_milliseconds = 4286
file = phd-tests/framework/src/test_vm/mod.rs
line = 772
path = phd_tests::migrate::from_base::migration_from_base_and_back
target = phd_framework::test_vm
vm = migration_from_base_and_back
vm_id = 9b3b3d9f-4f77-40a9-847b-5c1dc09e4a65
|
50 | 2025-03-10T23:10:34.068Z | DEBG | phd-runner: [WAIT_TO_BOOT - EVENT] executing command in boot sequence
file = phd-tests/framework/src/test_vm/mod.rs
line = 714
path = phd_tests::migrate::from_base::migration_from_base_and_back
step = WriteStr("root")
target = phd_framework::test_vm
|
51 | 2025-03-10T23:10:34.068Z | DEBG | phd-runner: [WAIT_TO_BOOT - EVENT] executing command in boot sequence
file = phd-tests/framework/src/test_vm/mod.rs
line = 714
path = phd_tests::migrate::from_base::migration_from_base_and_back
step = WaitFor("localhost:~#")
target = phd_framework::test_vm
|
52 | 2025-03-10T23:10:34.068Z | INFO | phd-runner: [WAIT_FOR_SERIAL_OUTPUT - START]
file = phd-tests/framework/src/test_vm/mod.rs
line = 772
path = phd_tests::migrate::from_base::migration_from_base_and_back
target = phd_framework::test_vm
vm = migration_from_base_and_back
vm_id = 9b3b3d9f-4f77-40a9-847b-5c1dc09e4a65
|
53 | 2025-03-10T23:10:34.068Z | INFO | phd-runner: [WAIT_FOR_SERIAL_OUTPUT - EVENT] Waiting for output on serial console
file = phd-tests/framework/src/test_vm/mod.rs
line = 779
path = phd_tests::migrate::from_base::migration_from_base_and_back
target = phd_framework::test_vm
timeout_duration = CallerTimeout
vm = migration_from_base_and_back
vm_id = 9b3b3d9f-4f77-40a9-847b-5c1dc09e4a65
|
54 | 2025-03-10T23:10:34.086Z | INFO | phd-runner: [WAIT_FOR_SERIAL_OUTPUT - END]
elapsed_milliseconds = 17
file = phd-tests/framework/src/test_vm/mod.rs
line = 772
path = phd_tests::migrate::from_base::migration_from_base_and_back
target = phd_framework::test_vm
vm = migration_from_base_and_back
vm_id = 9b3b3d9f-4f77-40a9-847b-5c1dc09e4a65
|
55 | 2025-03-10T23:10:34.086Z | DEBG | phd-runner: [WAIT_TO_BOOT - EVENT] executing command in boot sequence
file = phd-tests/framework/src/test_vm/mod.rs
line = 714
path = phd_tests::migrate::from_base::migration_from_base_and_back
step = WriteStr("stty -F `tty` cols 9999")
target = phd_framework::test_vm
|
56 | 2025-03-10T23:10:34.086Z | DEBG | phd-runner: [WAIT_TO_BOOT - EVENT] executing command in boot sequence
file = phd-tests/framework/src/test_vm/mod.rs
line = 714
path = phd_tests::migrate::from_base::migration_from_base_and_back
step = WaitFor("localhost:~#")
target = phd_framework::test_vm
|
57 | 2025-03-10T23:10:34.086Z | INFO | phd-runner: [WAIT_FOR_SERIAL_OUTPUT - START]
file = phd-tests/framework/src/test_vm/mod.rs
line = 772
path = phd_tests::migrate::from_base::migration_from_base_and_back
target = phd_framework::test_vm
vm = migration_from_base_and_back
vm_id = 9b3b3d9f-4f77-40a9-847b-5c1dc09e4a65
|
58 | 2025-03-10T23:10:34.086Z | INFO | phd-runner: [WAIT_FOR_SERIAL_OUTPUT - EVENT] Waiting for output on serial console
file = phd-tests/framework/src/test_vm/mod.rs
line = 779
path = phd_tests::migrate::from_base::migration_from_base_and_back
target = phd_framework::test_vm
timeout_duration = CallerTimeout
vm = migration_from_base_and_back
vm_id = 9b3b3d9f-4f77-40a9-847b-5c1dc09e4a65
|
59 | 2025-03-10T23:10:34.119Z | INFO | phd-runner: [WAIT_FOR_SERIAL_OUTPUT - END]
elapsed_milliseconds = 32
file = phd-tests/framework/src/test_vm/mod.rs
line = 772
path = phd_tests::migrate::from_base::migration_from_base_and_back
target = phd_framework::test_vm
vm = migration_from_base_and_back
vm_id = 9b3b3d9f-4f77-40a9-847b-5c1dc09e4a65
|
60 | 2025-03-10T23:10:34.119Z | INFO | phd-runner: [WAIT_TO_BOOT - EVENT] Guest has booted
file = phd-tests/framework/src/test_vm/mod.rs
line = 754
path = phd_tests::migrate::from_base::migration_from_base_and_back
target = phd_framework::test_vm
|
61 | 2025-03-10T23:10:34.119Z | INFO | phd-runner: [WAIT_TO_BOOT - END]
elapsed_milliseconds = 4338
file = phd-tests/framework/src/test_vm/mod.rs
line = 757
path = phd_tests::migrate::from_base::migration_from_base_and_back
target = phd_framework::test_vm
|
62 | 2025-03-10T23:10:34.119Z | INFO | phd-runner: [WAIT_FOR_SERIAL_OUTPUT - START]
file = phd-tests/framework/src/test_vm/mod.rs
line = 772
path = phd_tests::migrate::from_base::migration_from_base_and_back
target = phd_framework::test_vm
vm = migration_from_base_and_back
vm_id = 9b3b3d9f-4f77-40a9-847b-5c1dc09e4a65
|
63 | 2025-03-10T23:10:34.120Z | INFO | phd-runner: [WAIT_FOR_SERIAL_OUTPUT - EVENT] Waiting for output on serial console
file = phd-tests/framework/src/test_vm/mod.rs
line = 779
path = phd_tests::migrate::from_base::migration_from_base_and_back
target = phd_framework::test_vm
timeout_duration = Explicit(15s)
vm = migration_from_base_and_back
vm_id = 9b3b3d9f-4f77-40a9-847b-5c1dc09e4a65
|
64 | 2025-03-10T23:10:34.131Z | INFO | phd-runner: [WAIT_FOR_SERIAL_OUTPUT - END]
elapsed_milliseconds = 11
file = phd-tests/framework/src/test_vm/mod.rs
line = 772
path = phd_tests::migrate::from_base::migration_from_base_and_back
target = phd_framework::test_vm
vm = migration_from_base_and_back
vm_id = 9b3b3d9f-4f77-40a9-847b-5c1dc09e4a65
|
65 | 2025-03-10T23:10:34.131Z | INFO | phd-runner: [WAIT_FOR_SERIAL_OUTPUT - START]
file = phd-tests/framework/src/test_vm/mod.rs
line = 772
path = phd_tests::migrate::from_base::migration_from_base_and_back
target = phd_framework::test_vm
vm = migration_from_base_and_back
vm_id = 9b3b3d9f-4f77-40a9-847b-5c1dc09e4a65
|
66 | 2025-03-10T23:10:34.131Z | INFO | phd-runner: [WAIT_FOR_SERIAL_OUTPUT - EVENT] Waiting for output on serial console
file = phd-tests/framework/src/test_vm/mod.rs
line = 779
path = phd_tests::migrate::from_base::migration_from_base_and_back
target = phd_framework::test_vm
timeout_duration = Explicit(300s)
vm = migration_from_base_and_back
vm_id = 9b3b3d9f-4f77-40a9-847b-5c1dc09e4a65
|
67 | 2025-03-10T23:10:34.153Z | INFO | phd-runner: [WAIT_FOR_SERIAL_OUTPUT - END]
elapsed_milliseconds = 21
file = phd-tests/framework/src/test_vm/mod.rs
line = 772
path = phd_tests::migrate::from_base::migration_from_base_and_back
target = phd_framework::test_vm
vm = migration_from_base_and_back
vm_id = 9b3b3d9f-4f77-40a9-847b-5c1dc09e4a65
|
68 | 2025-03-10T23:10:34.153Z | INFO | phd-runner: [WAIT_FOR_SERIAL_OUTPUT - START]
file = phd-tests/framework/src/test_vm/mod.rs
line = 772
path = phd_tests::migrate::from_base::migration_from_base_and_back
target = phd_framework::test_vm
vm = migration_from_base_and_back
vm_id = 9b3b3d9f-4f77-40a9-847b-5c1dc09e4a65
|
69 | 2025-03-10T23:10:34.153Z | INFO | phd-runner: [WAIT_FOR_SERIAL_OUTPUT - EVENT] Waiting for output on serial console
file = phd-tests/framework/src/test_vm/mod.rs
line = 779
path = phd_tests::migrate::from_base::migration_from_base_and_back
target = phd_framework::test_vm
timeout_duration = Explicit(15s)
vm = migration_from_base_and_back
vm_id = 9b3b3d9f-4f77-40a9-847b-5c1dc09e4a65
|
70 | 2025-03-10T23:10:34.164Z | INFO | phd-runner: [WAIT_FOR_SERIAL_OUTPUT - END]
elapsed_milliseconds = 10
file = phd-tests/framework/src/test_vm/mod.rs
line = 772
path = phd_tests::migrate::from_base::migration_from_base_and_back
target = phd_framework::test_vm
vm = migration_from_base_and_back
vm_id = 9b3b3d9f-4f77-40a9-847b-5c1dc09e4a65
|
71 | 2025-03-10T23:10:34.164Z | INFO | phd-runner: [WAIT_FOR_SERIAL_OUTPUT - START]
file = phd-tests/framework/src/test_vm/mod.rs
line = 772
path = phd_tests::migrate::from_base::migration_from_base_and_back
target = phd_framework::test_vm
vm = migration_from_base_and_back
vm_id = 9b3b3d9f-4f77-40a9-847b-5c1dc09e4a65
|
72 | 2025-03-10T23:10:34.164Z | INFO | phd-runner: [WAIT_FOR_SERIAL_OUTPUT - EVENT] Waiting for output on serial console
file = phd-tests/framework/src/test_vm/mod.rs
line = 779
path = phd_tests::migrate::from_base::migration_from_base_and_back
target = phd_framework::test_vm
timeout_duration = Explicit(300s)
vm = migration_from_base_and_back
vm_id = 9b3b3d9f-4f77-40a9-847b-5c1dc09e4a65
|
73 | 2025-03-10T23:10:34.197Z | INFO | phd-runner: [WAIT_FOR_SERIAL_OUTPUT - END]
elapsed_milliseconds = 32
file = phd-tests/framework/src/test_vm/mod.rs
line = 772
path = phd_tests::migrate::from_base::migration_from_base_and_back
target = phd_framework::test_vm
vm = migration_from_base_and_back
vm_id = 9b3b3d9f-4f77-40a9-847b-5c1dc09e4a65
|
74 | 2025-03-10T23:10:34.197Z | INFO | phd-runner: [WAIT_FOR_SERIAL_OUTPUT - START]
file = phd-tests/framework/src/test_vm/mod.rs
line = 772
path = phd_tests::migrate::from_base::migration_from_base_and_back
target = phd_framework::test_vm
vm = migration_from_base_and_back
vm_id = 9b3b3d9f-4f77-40a9-847b-5c1dc09e4a65
|
75 | 2025-03-10T23:10:34.197Z | INFO | phd-runner: [WAIT_FOR_SERIAL_OUTPUT - EVENT] Waiting for output on serial console
file = phd-tests/framework/src/test_vm/mod.rs
line = 779
path = phd_tests::migrate::from_base::migration_from_base_and_back
target = phd_framework::test_vm
timeout_duration = Explicit(15s)
vm = migration_from_base_and_back
vm_id = 9b3b3d9f-4f77-40a9-847b-5c1dc09e4a65
|
76 | 2025-03-10T23:10:34.207Z | INFO | phd-runner: [WAIT_FOR_SERIAL_OUTPUT - END]
elapsed_milliseconds = 10
file = phd-tests/framework/src/test_vm/mod.rs
line = 772
path = phd_tests::migrate::from_base::migration_from_base_and_back
target = phd_framework::test_vm
vm = migration_from_base_and_back
vm_id = 9b3b3d9f-4f77-40a9-847b-5c1dc09e4a65
|
77 | 2025-03-10T23:10:34.207Z | INFO | phd-runner: [WAIT_FOR_SERIAL_OUTPUT - START]
file = phd-tests/framework/src/test_vm/mod.rs
line = 772
path = phd_tests::migrate::from_base::migration_from_base_and_back
target = phd_framework::test_vm
vm = migration_from_base_and_back
vm_id = 9b3b3d9f-4f77-40a9-847b-5c1dc09e4a65
|
78 | 2025-03-10T23:10:34.207Z | INFO | phd-runner: [WAIT_FOR_SERIAL_OUTPUT - EVENT] Waiting for output on serial console
file = phd-tests/framework/src/test_vm/mod.rs
line = 779
path = phd_tests::migrate::from_base::migration_from_base_and_back
target = phd_framework::test_vm
timeout_duration = Explicit(300s)
vm = migration_from_base_and_back
vm_id = 9b3b3d9f-4f77-40a9-847b-5c1dc09e4a65
|
79 | 2025-03-10T23:10:34.230Z | INFO | phd-runner: [WAIT_FOR_SERIAL_OUTPUT - END]
elapsed_milliseconds = 22
file = phd-tests/framework/src/test_vm/mod.rs
line = 772
path = phd_tests::migrate::from_base::migration_from_base_and_back
target = phd_framework::test_vm
vm = migration_from_base_and_back
vm_id = 9b3b3d9f-4f77-40a9-847b-5c1dc09e4a65
|
80 | 2025-03-10T23:10:34.230Z | INFO | phd-runner: [TEST - EVENT] migrating to new Propolis artifact for lifecycle test
file = phd-tests/framework/src/lifecycle.rs
line = 73
path = phd_tests::migrate::from_base::migration_from_base_and_back
propolis_artifact = __DEFAULT_PROPOLIS
target = phd_framework::lifecycle
vm_name = migration_from_base_and_back
|
81 | 2025-03-10T23:10:34.230Z | INFO | phd-runner: [NEW - START]
file = phd-tests/framework/src/test_vm/mod.rs
line = 193
path = phd_tests::migrate::from_base::migration_from_base_and_back
target = phd_framework::test_vm
|
82 | 2025-03-10T23:10:34.230Z | INFO | phd-runner: [NEW - EVENT] phd_framework::test_vm
environment = EnvironmentSpec { location: Local, propolis_artifact: "__DEFAULT_PROPOLIS" }
file = phd-tests/framework/src/test_vm/mod.rs
guest_os_kind = Alpine
line = 211
path = phd_tests::migrate::from_base::migration_from_base_and_back
target = phd_framework::test_vm
vm_name = migration_from_base_and_back_lifecycle_0
|
83 | 2025-03-10T23:10:34.230Z | DEBG | phd-runner: [NEW - EVENT] Examining locally-sourced artifact
file = phd-tests/framework/src/artifacts/store.rs
line = 56
path = /work/phd-test/propolis-server
sha256 = None
target = phd_framework::artifacts::store
|
84 | 2025-03-10T23:10:34.231Z | DEBG | phd-runner: [NEW - EVENT] Locally-sourced artifact is valid, caching its path
file = phd-tests/framework/src/artifacts/store.rs
line = 69
path = /work/phd-test/propolis-server
target = phd_framework::artifacts::store
|
85 | 2025-03-10T23:10:34.231Z | INFO | phd-runner: [NEW - EVENT] Launching Propolis server
bootrom_path = "/phd-artifacts/29813374b58e3b77fb665f2d95cb3bab37d44fdd2c4fce2a70de9d76a3512a4f/OVMF_CODE.fd"
file = phd-tests/framework/src/test_vm/server.rs
line = 55
path = phd_tests::migrate::from_base::migration_from_base_and_back
server_addr = 127.0.0.1:9002
server_path = "/work/phd-test/propolis-server"
target = phd_framework::test_vm::server
|
86 | 2025-03-10T23:10:34.231Z | INFO | phd-runner: [NEW - EVENT] Opening server log files
file = phd-tests/framework/src/server_log_mode.rs
line = 64
path = phd_tests::migrate::from_base::migration_from_base_and_back
stderr_path = "/tmp/propolis-phd/migration_from_base_and_back_lifecycle_0.stderr.log"
stdout_path = "/tmp/propolis-phd/migration_from_base_and_back_lifecycle_0.stdout.log"
target = phd_framework::server_log_mode
|
87 | 2025-03-10T23:10:34.247Z | INFO | phd-runner: [NEW - EVENT] Launched server with pid 869
file = phd-tests/framework/src/test_vm/server.rs
line = 107
path = phd_tests::migrate::from_base::migration_from_base_and_back
target = phd_framework::test_vm::server
|
88 | 2025-03-10T23:10:34.247Z | INFO | phd-runner: [NEW - END]
elapsed_milliseconds = 17
file = phd-tests/framework/src/test_vm/mod.rs
line = 193
path = phd_tests::migrate::from_base::migration_from_base_and_back
target = phd_framework::test_vm
|
89 | 2025-03-10T23:10:34.248Z | INFO | phd-runner: [MIGRATE_FROM - START]
file = phd-tests/framework/src/test_vm/mod.rs
line = 474
path = phd_tests::migrate::from_base::migration_from_base_and_back
source = migration_from_base_and_back
source_id = 9b3b3d9f-4f77-40a9-847b-5c1dc09e4a65
target = phd_framework::test_vm
target_id = c5af77a0-13e2-4664-a9c1-7a757bc3c83b
|
90 | 2025-03-10T23:10:34.248Z | INFO | phd-runner: [MIGRATE_FROM - EVENT] Migrating from source at address 127.0.0.1:9000
file = phd-tests/framework/src/test_vm/mod.rs
line = 507
migration_id = 7b1591da-2b1e-4fff-899b-fd6e6c36d903
path = phd_tests::migrate::from_base::migration_from_base_and_back
source = migration_from_base_and_back
source_id = 9b3b3d9f-4f77-40a9-847b-5c1dc09e4a65
target = phd_framework::test_vm
target_id = c5af77a0-13e2-4664-a9c1-7a757bc3c83b
timeout_duration = 45s
|
91 | 2025-03-10T23:10:34.248Z | INFO | phd-runner: [INSTANCE_ENSURE_INTERNAL - START]
file = phd-tests/framework/src/test_vm/mod.rs
line = 276
path = phd_tests::migrate::from_base::migration_from_base_and_back
source = migration_from_base_and_back
source_id = 9b3b3d9f-4f77-40a9-847b-5c1dc09e4a65
target = phd_framework::test_vm
target_id = c5af77a0-13e2-4664-a9c1-7a757bc3c83b
vm = migration_from_base_and_back_lifecycle_0
vm_id = c5af77a0-13e2-4664-a9c1-7a757bc3c83b
|
92 | 2025-03-10T23:10:34.248Z | INFO | phd-runner: [INSTANCE_ENSURE_INTERNAL - EVENT] retriable error from instance_spec_ensure
e = Communication Error: error sending request for url (http://127.0.0.1:9002/instance)
file = phd-tests/framework/src/test_vm/mod.rs
line = 320
path = phd_tests::migrate::from_base::migration_from_base_and_back
source = migration_from_base_and_back
source_id = 9b3b3d9f-4f77-40a9-847b-5c1dc09e4a65
target = phd_framework::test_vm
target_id = c5af77a0-13e2-4664-a9c1-7a757bc3c83b
vm = migration_from_base_and_back_lifecycle_0
vm_id = c5af77a0-13e2-4664-a9c1-7a757bc3c83b
|
93 | 2025-03-10T23:10:34.787Z | INFO | phd-runner: [INSTANCE_ENSURE_INTERNAL - EVENT] Started instance
file = phd-tests/framework/src/test_vm/mod.rs
instance_description.instance = Instance { properties: InstanceProperties { description: "Pheidippides-managed VM", id: c5af77a0-13e2-4664-a9c1-7a757bc3c83b, metadata: InstanceMetadata { project_id: 15ba45b8-4f53-4512-950f-e62eb49080da, silo_id: f1211c9e-be87-4d22-acc5-5eda13de6d8a, sled_id: c95f1ca2-5aa6-4356-afa9-b6c09ee0d8f8, sled_model: "pheidippes", sled_revision: 1, sled_serial: "c95f1ca2-5aa6-4356-afa9-b6c09ee0d8f8" }, name: "phd-vm-c5af77a0-13e2-4664-a9c1-7a757bc3c83b" }, state: Migrating }
line = 379
path = phd_tests::migrate::from_base::migration_from_base_and_back
source = migration_from_base_and_back
source_id = 9b3b3d9f-4f77-40a9-847b-5c1dc09e4a65
target = phd_framework::test_vm
target_id = c5af77a0-13e2-4664-a9c1-7a757bc3c83b
vm = migration_from_base_and_back_lifecycle_0
vm_id = c5af77a0-13e2-4664-a9c1-7a757bc3c83b
|
94 | 2025-03-10T23:10:34.787Z | INFO | phd-runner: [INSTANCE_ENSURE_INTERNAL - END]
elapsed_milliseconds = 539
file = phd-tests/framework/src/test_vm/mod.rs
line = 276
path = phd_tests::migrate::from_base::migration_from_base_and_back
source = migration_from_base_and_back
source_id = 9b3b3d9f-4f77-40a9-847b-5c1dc09e4a65
target = phd_framework::test_vm
target_id = c5af77a0-13e2-4664-a9c1-7a757bc3c83b
vm = migration_from_base_and_back_lifecycle_0
vm_id = c5af77a0-13e2-4664-a9c1-7a757bc3c83b
|
95 | 2025-03-10T23:10:34.787Z | INFO | phd-runner: [MIGRATE - START]
file = phd-tests/framework/src/test_vm/mod.rs
line = 528
migration_id = 7b1591da-2b1e-4fff-899b-fd6e6c36d903
path = phd_tests::migrate::from_base::migration_from_base_and_back
source = migration_from_base_and_back
source_id = 9b3b3d9f-4f77-40a9-847b-5c1dc09e4a65
target = phd_framework::test_vm
target_id = c5af77a0-13e2-4664-a9c1-7a757bc3c83b
|
96 | 2025-03-10T23:10:37.250Z | INFO | phd-runner: [SERIAL CONSOLE TASK - EVENT] serial socket control message
file = phd-tests/framework/src/serial/mod.rs
line = 275
s = {"Migrating":{"destination":"127.0.0.1:9002","from_start":7760}}
target = phd_framework::serial
|
97 | 2025-03-10T23:10:37.934Z | INFO | phd-runner: [MIGRATE_FROM - EVENT] Migration completed successfully
file = phd-tests/framework/src/test_vm/mod.rs
line = 541
path = phd_tests::migrate::from_base::migration_from_base_and_back
source = migration_from_base_and_back
source_id = 9b3b3d9f-4f77-40a9-847b-5c1dc09e4a65
target = phd_framework::test_vm
target_id = c5af77a0-13e2-4664-a9c1-7a757bc3c83b
|
98 | 2025-03-10T23:10:37.934Z | INFO | phd-runner: [MIGRATE - END]
elapsed_milliseconds = 3147
file = phd-tests/framework/src/test_vm/mod.rs
line = 528
migration_id = 7b1591da-2b1e-4fff-899b-fd6e6c36d903
path = phd_tests::migrate::from_base::migration_from_base_and_back
source = migration_from_base_and_back
source_id = 9b3b3d9f-4f77-40a9-847b-5c1dc09e4a65
target = phd_framework::test_vm
target_id = c5af77a0-13e2-4664-a9c1-7a757bc3c83b
|
99 | 2025-03-10T23:10:37.934Z | INFO | phd-runner: [MIGRATE_FROM - END]
elapsed_milliseconds = 3686
file = phd-tests/framework/src/test_vm/mod.rs
line = 474
path = phd_tests::migrate::from_base::migration_from_base_and_back
source = migration_from_base_and_back
source_id = 9b3b3d9f-4f77-40a9-847b-5c1dc09e4a65
target = phd_framework::test_vm
target_id = c5af77a0-13e2-4664-a9c1-7a757bc3c83b
|
100 | 2025-03-10T23:10:37.936Z | INFO | phd-runner: [VM CLEANUP - START]
file = phd-tests/framework/src/test_vm/mod.rs
line = 1029
path = phd_tests::migrate::from_base::migration_from_base_and_back
target = phd_framework::test_vm
vm = migration_from_base_and_back
vm_id = 9b3b3d9f-4f77-40a9-847b-5c1dc09e4a65
|
101 | 2025-03-10T23:10:37.936Z | INFO | phd-runner: [WAIT_FOR_SERIAL_OUTPUT - START]
file = phd-tests/framework/src/test_vm/mod.rs
line = 772
path = phd_tests::migrate::from_base::migration_from_base_and_back
target = phd_framework::test_vm
vm = migration_from_base_and_back_lifecycle_0
vm_id = c5af77a0-13e2-4664-a9c1-7a757bc3c83b
|
102 | 2025-03-10T23:10:37.936Z | INFO | phd-runner: [WAIT_FOR_SERIAL_OUTPUT - EVENT] Waiting for output on serial console
file = phd-tests/framework/src/test_vm/mod.rs
line = 779
path = phd_tests::migrate::from_base::migration_from_base_and_back
target = phd_framework::test_vm
timeout_duration = Explicit(15s)
vm = migration_from_base_and_back_lifecycle_0
vm_id = c5af77a0-13e2-4664-a9c1-7a757bc3c83b
|
103 | 2025-03-10T23:10:37.937Z | DEBG | phd-runner: [VM CLEANUP - EVENT] Killing Propolis server process
file = phd-tests/framework/src/test_vm/server.rs
line = 125
path = phd_tests::migrate::from_base::migration_from_base_and_back
self.address = 127.0.0.1:9000
target = phd_framework::test_vm::server
vm = migration_from_base_and_back
vm_id = 9b3b3d9f-4f77-40a9-847b-5c1dc09e4a65
|
104 | 2025-03-10T23:10:38.040Z | INFO | phd-runner: [VM CLEANUP - END]
elapsed_milliseconds = 103
file = phd-tests/framework/src/test_vm/mod.rs
line = 1029
path = phd_tests::migrate::from_base::migration_from_base_and_back
target = phd_framework::test_vm
vm = migration_from_base_and_back
vm_id = 9b3b3d9f-4f77-40a9-847b-5c1dc09e4a65
|
105 | 2025-03-10T23:10:38.040Z | INFO | phd-runner: [WAIT_FOR_SERIAL_OUTPUT - END]
elapsed_milliseconds = 103
file = phd-tests/framework/src/test_vm/mod.rs
line = 772
path = phd_tests::migrate::from_base::migration_from_base_and_back
target = phd_framework::test_vm
vm = migration_from_base_and_back_lifecycle_0
vm_id = c5af77a0-13e2-4664-a9c1-7a757bc3c83b
|
106 | 2025-03-10T23:10:38.040Z | INFO | phd-runner: [WAIT_FOR_SERIAL_OUTPUT - START]
file = phd-tests/framework/src/test_vm/mod.rs
line = 772
path = phd_tests::migrate::from_base::migration_from_base_and_back
target = phd_framework::test_vm
vm = migration_from_base_and_back_lifecycle_0
vm_id = c5af77a0-13e2-4664-a9c1-7a757bc3c83b
|
107 | 2025-03-10T23:10:38.040Z | INFO | phd-runner: [WAIT_FOR_SERIAL_OUTPUT - EVENT] Waiting for output on serial console
file = phd-tests/framework/src/test_vm/mod.rs
line = 779
path = phd_tests::migrate::from_base::migration_from_base_and_back
target = phd_framework::test_vm
timeout_duration = Explicit(300s)
vm = migration_from_base_and_back_lifecycle_0
vm_id = c5af77a0-13e2-4664-a9c1-7a757bc3c83b
|
108 | 2025-03-10T23:10:38.063Z | INFO | phd-runner: [WAIT_FOR_SERIAL_OUTPUT - END]
elapsed_milliseconds = 22
file = phd-tests/framework/src/test_vm/mod.rs
line = 772
path = phd_tests::migrate::from_base::migration_from_base_and_back
target = phd_framework::test_vm
vm = migration_from_base_and_back_lifecycle_0
vm_id = c5af77a0-13e2-4664-a9c1-7a757bc3c83b
|
109 | 2025-03-10T23:10:38.063Z | INFO | phd-runner: [TEST - EVENT] migrating to new Propolis artifact for lifecycle test
file = phd-tests/framework/src/lifecycle.rs
line = 73
path = phd_tests::migrate::from_base::migration_from_base_and_back
propolis_artifact = __BASE_PROPOLIS
target = phd_framework::lifecycle
vm_name = migration_from_base_and_back
|
110 | 2025-03-10T23:10:38.063Z | INFO | phd-runner: [NEW - START]
file = phd-tests/framework/src/test_vm/mod.rs
line = 193
path = phd_tests::migrate::from_base::migration_from_base_and_back
target = phd_framework::test_vm
|
111 | 2025-03-10T23:10:38.063Z | INFO | phd-runner: [NEW - EVENT] phd_framework::test_vm
environment = EnvironmentSpec { location: Local, propolis_artifact: "__BASE_PROPOLIS" }
file = phd-tests/framework/src/test_vm/mod.rs
guest_os_kind = Alpine
line = 211
path = phd_tests::migrate::from_base::migration_from_base_and_back
target = phd_framework::test_vm
vm_name = migration_from_base_and_back_lifecycle_1
|
112 | 2025-03-10T23:10:38.063Z | DEBG | phd-runner: [NEW - EVENT] Verified artifact already exists
file = phd-tests/framework/src/artifacts/store.rs
line = 45
path = /phd-artifacts/699c2d2c5e97e63733ab85fce044388baefe882761373e5c02190990dd286770/propolis-server
target = phd_framework::artifacts::store
|
113 | 2025-03-10T23:10:38.064Z | INFO | phd-runner: [NEW - EVENT] Launching Propolis server
bootrom_path = "/phd-artifacts/29813374b58e3b77fb665f2d95cb3bab37d44fdd2c4fce2a70de9d76a3512a4f/OVMF_CODE.fd"
file = phd-tests/framework/src/test_vm/server.rs
line = 55
path = phd_tests::migrate::from_base::migration_from_base_and_back
server_addr = 127.0.0.1:9004
server_path = "/phd-artifacts/699c2d2c5e97e63733ab85fce044388baefe882761373e5c02190990dd286770/propolis-server"
target = phd_framework::test_vm::server
|
114 | 2025-03-10T23:10:38.064Z | INFO | phd-runner: [NEW - EVENT] Opening server log files
file = phd-tests/framework/src/server_log_mode.rs
line = 64
path = phd_tests::migrate::from_base::migration_from_base_and_back
stderr_path = "/tmp/propolis-phd/migration_from_base_and_back_lifecycle_1.stderr.log"
stdout_path = "/tmp/propolis-phd/migration_from_base_and_back_lifecycle_1.stdout.log"
target = phd_framework::server_log_mode
|
115 | 2025-03-10T23:10:38.078Z | INFO | phd-runner: [NEW - EVENT] Launched server with pid 871
file = phd-tests/framework/src/test_vm/server.rs
line = 107
path = phd_tests::migrate::from_base::migration_from_base_and_back
target = phd_framework::test_vm::server
|
116 | 2025-03-10T23:10:38.078Z | INFO | phd-runner: [NEW - END]
elapsed_milliseconds = 14
file = phd-tests/framework/src/test_vm/mod.rs
line = 193
path = phd_tests::migrate::from_base::migration_from_base_and_back
target = phd_framework::test_vm
|
117 | 2025-03-10T23:10:38.078Z | INFO | phd-runner: [MIGRATE_FROM - START]
file = phd-tests/framework/src/test_vm/mod.rs
line = 474
path = phd_tests::migrate::from_base::migration_from_base_and_back
source = migration_from_base_and_back_lifecycle_0
source_id = c5af77a0-13e2-4664-a9c1-7a757bc3c83b
target = phd_framework::test_vm
target_id = 335f4b7a-3418-417a-8e57-cabce35da6a6
|
118 | 2025-03-10T23:10:38.078Z | INFO | phd-runner: [MIGRATE_FROM - EVENT] Migrating from source at address 127.0.0.1:9002
file = phd-tests/framework/src/test_vm/mod.rs
line = 507
migration_id = c52b8e0a-5abc-452e-a5cc-f3b45c87cbec
path = phd_tests::migrate::from_base::migration_from_base_and_back
source = migration_from_base_and_back_lifecycle_0
source_id = c5af77a0-13e2-4664-a9c1-7a757bc3c83b
target = phd_framework::test_vm
target_id = 335f4b7a-3418-417a-8e57-cabce35da6a6
timeout_duration = 45s
|
119 | 2025-03-10T23:10:38.079Z | INFO | phd-runner: [INSTANCE_ENSURE_INTERNAL - START]
file = phd-tests/framework/src/test_vm/mod.rs
line = 276
path = phd_tests::migrate::from_base::migration_from_base_and_back
source = migration_from_base_and_back_lifecycle_0
source_id = c5af77a0-13e2-4664-a9c1-7a757bc3c83b
target = phd_framework::test_vm
target_id = 335f4b7a-3418-417a-8e57-cabce35da6a6
vm = migration_from_base_and_back_lifecycle_1
vm_id = 335f4b7a-3418-417a-8e57-cabce35da6a6
|
120 | 2025-03-10T23:10:38.079Z | INFO | phd-runner: [INSTANCE_ENSURE_INTERNAL - EVENT] retriable error from instance_spec_ensure
e = Communication Error: error sending request for url (http://127.0.0.1:9004/instance)
file = phd-tests/framework/src/test_vm/mod.rs
line = 320
path = phd_tests::migrate::from_base::migration_from_base_and_back
source = migration_from_base_and_back_lifecycle_0
source_id = c5af77a0-13e2-4664-a9c1-7a757bc3c83b
target = phd_framework::test_vm
target_id = 335f4b7a-3418-417a-8e57-cabce35da6a6
vm = migration_from_base_and_back_lifecycle_1
vm_id = 335f4b7a-3418-417a-8e57-cabce35da6a6
|
121 | 2025-03-10T23:10:38.617Z | INFO | phd-runner: [INSTANCE_ENSURE_INTERNAL - EVENT] Started instance
file = phd-tests/framework/src/test_vm/mod.rs
instance_description.instance = Instance { properties: InstanceProperties { description: "Pheidippides-managed VM", id: 335f4b7a-3418-417a-8e57-cabce35da6a6, metadata: InstanceMetadata { project_id: 15ba45b8-4f53-4512-950f-e62eb49080da, silo_id: f1211c9e-be87-4d22-acc5-5eda13de6d8a, sled_id: 6b4e6775-cc19-4cf0-a875-68def212d1de, sled_model: "pheidippes", sled_revision: 1, sled_serial: "6b4e6775-cc19-4cf0-a875-68def212d1de" }, name: "phd-vm-335f4b7a-3418-417a-8e57-cabce35da6a6" }, state: Migrating }
line = 379
path = phd_tests::migrate::from_base::migration_from_base_and_back
source = migration_from_base_and_back_lifecycle_0
source_id = c5af77a0-13e2-4664-a9c1-7a757bc3c83b
target = phd_framework::test_vm
target_id = 335f4b7a-3418-417a-8e57-cabce35da6a6
vm = migration_from_base_and_back_lifecycle_1
vm_id = 335f4b7a-3418-417a-8e57-cabce35da6a6
|
122 | 2025-03-10T23:10:38.617Z | INFO | phd-runner: [INSTANCE_ENSURE_INTERNAL - END]
elapsed_milliseconds = 538
file = phd-tests/framework/src/test_vm/mod.rs
line = 276
path = phd_tests::migrate::from_base::migration_from_base_and_back
source = migration_from_base_and_back_lifecycle_0
source_id = c5af77a0-13e2-4664-a9c1-7a757bc3c83b
target = phd_framework::test_vm
target_id = 335f4b7a-3418-417a-8e57-cabce35da6a6
vm = migration_from_base_and_back_lifecycle_1
vm_id = 335f4b7a-3418-417a-8e57-cabce35da6a6
|
123 | 2025-03-10T23:10:38.617Z | INFO | phd-runner: [MIGRATE - START]
file = phd-tests/framework/src/test_vm/mod.rs
line = 528
migration_id = c52b8e0a-5abc-452e-a5cc-f3b45c87cbec
path = phd_tests::migrate::from_base::migration_from_base_and_back
source = migration_from_base_and_back_lifecycle_0
source_id = c5af77a0-13e2-4664-a9c1-7a757bc3c83b
target = phd_framework::test_vm
target_id = 335f4b7a-3418-417a-8e57-cabce35da6a6
|
124 | 2025-03-10T23:10:41.156Z | INFO | phd-runner: [SERIAL CONSOLE TASK - EVENT] serial socket control message
file = phd-tests/framework/src/serial/mod.rs
line = 275
s = {"Migrating":{"destination":"127.0.0.1:9004","from_start":7807}}
target = phd_framework::serial
|
125 | 2025-03-10T23:10:42.653Z | INFO | phd-runner: [MIGRATE_FROM - EVENT] Migration completed successfully
file = phd-tests/framework/src/test_vm/mod.rs
line = 541
path = phd_tests::migrate::from_base::migration_from_base_and_back
source = migration_from_base_and_back_lifecycle_0
source_id = c5af77a0-13e2-4664-a9c1-7a757bc3c83b
target = phd_framework::test_vm
target_id = 335f4b7a-3418-417a-8e57-cabce35da6a6
|
126 | 2025-03-10T23:10:42.654Z | INFO | phd-runner: [MIGRATE - END]
elapsed_milliseconds = 4036
file = phd-tests/framework/src/test_vm/mod.rs
line = 528
migration_id = c52b8e0a-5abc-452e-a5cc-f3b45c87cbec
path = phd_tests::migrate::from_base::migration_from_base_and_back
source = migration_from_base_and_back_lifecycle_0
source_id = c5af77a0-13e2-4664-a9c1-7a757bc3c83b
target = phd_framework::test_vm
target_id = 335f4b7a-3418-417a-8e57-cabce35da6a6
|
127 | 2025-03-10T23:10:42.654Z | INFO | phd-runner: [MIGRATE_FROM - END]
elapsed_milliseconds = 4575
file = phd-tests/framework/src/test_vm/mod.rs
line = 474
path = phd_tests::migrate::from_base::migration_from_base_and_back
source = migration_from_base_and_back_lifecycle_0
source_id = c5af77a0-13e2-4664-a9c1-7a757bc3c83b
target = phd_framework::test_vm
target_id = 335f4b7a-3418-417a-8e57-cabce35da6a6
|
128 | 2025-03-10T23:10:42.655Z | INFO | phd-runner: [VM CLEANUP - START]
file = phd-tests/framework/src/test_vm/mod.rs
line = 1029
path = phd_tests::migrate::from_base::migration_from_base_and_back
target = phd_framework::test_vm
vm = migration_from_base_and_back_lifecycle_0
vm_id = c5af77a0-13e2-4664-a9c1-7a757bc3c83b
|
129 | 2025-03-10T23:10:42.655Z | INFO | phd-runner: [WAIT_FOR_SERIAL_OUTPUT - START]
file = phd-tests/framework/src/test_vm/mod.rs
line = 772
path = phd_tests::migrate::from_base::migration_from_base_and_back
target = phd_framework::test_vm
vm = migration_from_base_and_back_lifecycle_1
vm_id = 335f4b7a-3418-417a-8e57-cabce35da6a6
|
130 | 2025-03-10T23:10:42.655Z | INFO | phd-runner: [WAIT_FOR_SERIAL_OUTPUT - EVENT] Waiting for output on serial console
file = phd-tests/framework/src/test_vm/mod.rs
line = 779
path = phd_tests::migrate::from_base::migration_from_base_and_back
target = phd_framework::test_vm
timeout_duration = Explicit(15s)
vm = migration_from_base_and_back_lifecycle_1
vm_id = 335f4b7a-3418-417a-8e57-cabce35da6a6
|
131 | 2025-03-10T23:10:42.656Z | DEBG | phd-runner: [VM CLEANUP - EVENT] Killing Propolis server process
file = phd-tests/framework/src/test_vm/server.rs
line = 125
path = phd_tests::migrate::from_base::migration_from_base_and_back
self.address = 127.0.0.1:9002
target = phd_framework::test_vm::server
vm = migration_from_base_and_back_lifecycle_0
vm_id = c5af77a0-13e2-4664-a9c1-7a757bc3c83b
|
132 | 2025-03-10T23:10:42.760Z | INFO | phd-runner: [VM CLEANUP - END]
elapsed_milliseconds = 104
file = phd-tests/framework/src/test_vm/mod.rs
line = 1029
path = phd_tests::migrate::from_base::migration_from_base_and_back
target = phd_framework::test_vm
vm = migration_from_base_and_back_lifecycle_0
vm_id = c5af77a0-13e2-4664-a9c1-7a757bc3c83b
|
133 | 2025-03-10T23:10:42.760Z | INFO | phd-runner: [WAIT_FOR_SERIAL_OUTPUT - END]
elapsed_milliseconds = 104
file = phd-tests/framework/src/test_vm/mod.rs
line = 772
path = phd_tests::migrate::from_base::migration_from_base_and_back
target = phd_framework::test_vm
vm = migration_from_base_and_back_lifecycle_1
vm_id = 335f4b7a-3418-417a-8e57-cabce35da6a6
|
134 | 2025-03-10T23:10:42.760Z | INFO | phd-runner: [WAIT_FOR_SERIAL_OUTPUT - START]
file = phd-tests/framework/src/test_vm/mod.rs
line = 772
path = phd_tests::migrate::from_base::migration_from_base_and_back
target = phd_framework::test_vm
vm = migration_from_base_and_back_lifecycle_1
vm_id = 335f4b7a-3418-417a-8e57-cabce35da6a6
|
135 | 2025-03-10T23:10:42.760Z | INFO | phd-runner: [WAIT_FOR_SERIAL_OUTPUT - EVENT] Waiting for output on serial console
file = phd-tests/framework/src/test_vm/mod.rs
line = 779
path = phd_tests::migrate::from_base::migration_from_base_and_back
target = phd_framework::test_vm
timeout_duration = Explicit(300s)
vm = migration_from_base_and_back_lifecycle_1
vm_id = 335f4b7a-3418-417a-8e57-cabce35da6a6
|
136 | 2025-03-10T23:10:42.783Z | INFO | phd-runner: [WAIT_FOR_SERIAL_OUTPUT - END]
elapsed_milliseconds = 22
file = phd-tests/framework/src/test_vm/mod.rs
line = 772
path = phd_tests::migrate::from_base::migration_from_base_and_back
target = phd_framework::test_vm
vm = migration_from_base_and_back_lifecycle_1
vm_id = 335f4b7a-3418-417a-8e57-cabce35da6a6
|
137 | 2025-03-10T23:10:42.783Z | INFO | phd-runner: [TEST - EVENT] migrating to new Propolis artifact for lifecycle test
file = phd-tests/framework/src/lifecycle.rs
line = 73
path = phd_tests::migrate::from_base::migration_from_base_and_back
propolis_artifact = __DEFAULT_PROPOLIS
target = phd_framework::lifecycle
vm_name = migration_from_base_and_back
|
138 | 2025-03-10T23:10:42.783Z | INFO | phd-runner: [NEW - START]
file = phd-tests/framework/src/test_vm/mod.rs
line = 193
path = phd_tests::migrate::from_base::migration_from_base_and_back
target = phd_framework::test_vm
|
139 | 2025-03-10T23:10:42.783Z | INFO | phd-runner: [NEW - EVENT] phd_framework::test_vm
environment = EnvironmentSpec { location: Local, propolis_artifact: "__DEFAULT_PROPOLIS" }
file = phd-tests/framework/src/test_vm/mod.rs
guest_os_kind = Alpine
line = 211
path = phd_tests::migrate::from_base::migration_from_base_and_back
target = phd_framework::test_vm
vm_name = migration_from_base_and_back_lifecycle_2
|
140 | 2025-03-10T23:10:42.783Z | DEBG | phd-runner: [NEW - EVENT] Verified artifact already exists
file = phd-tests/framework/src/artifacts/store.rs
line = 45
path = /work/phd-test/propolis-server
target = phd_framework::artifacts::store
|
141 | 2025-03-10T23:10:42.783Z | INFO | phd-runner: [NEW - EVENT] Launching Propolis server
bootrom_path = "/phd-artifacts/29813374b58e3b77fb665f2d95cb3bab37d44fdd2c4fce2a70de9d76a3512a4f/OVMF_CODE.fd"
file = phd-tests/framework/src/test_vm/server.rs
line = 55
path = phd_tests::migrate::from_base::migration_from_base_and_back
server_addr = 127.0.0.1:9006
server_path = "/work/phd-test/propolis-server"
target = phd_framework::test_vm::server
|
142 | 2025-03-10T23:10:42.783Z | INFO | phd-runner: [NEW - EVENT] Opening server log files
file = phd-tests/framework/src/server_log_mode.rs
line = 64
path = phd_tests::migrate::from_base::migration_from_base_and_back
stderr_path = "/tmp/propolis-phd/migration_from_base_and_back_lifecycle_2.stderr.log"
stdout_path = "/tmp/propolis-phd/migration_from_base_and_back_lifecycle_2.stdout.log"
target = phd_framework::server_log_mode
|
143 | 2025-03-10T23:10:42.800Z | INFO | phd-runner: [NEW - EVENT] Launched server with pid 873
file = phd-tests/framework/src/test_vm/server.rs
line = 107
path = phd_tests::migrate::from_base::migration_from_base_and_back
target = phd_framework::test_vm::server
|
144 | 2025-03-10T23:10:42.800Z | INFO | phd-runner: [NEW - END]
elapsed_milliseconds = 16
file = phd-tests/framework/src/test_vm/mod.rs
line = 193
path = phd_tests::migrate::from_base::migration_from_base_and_back
target = phd_framework::test_vm
|
145 | 2025-03-10T23:10:42.800Z | INFO | phd-runner: [MIGRATE_FROM - START]
file = phd-tests/framework/src/test_vm/mod.rs
line = 474
path = phd_tests::migrate::from_base::migration_from_base_and_back
source = migration_from_base_and_back_lifecycle_1
source_id = 335f4b7a-3418-417a-8e57-cabce35da6a6
target = phd_framework::test_vm
target_id = 32d900ff-dea5-407f-bbd7-9d95ea20fc1f
|
146 | 2025-03-10T23:10:42.800Z | INFO | phd-runner: [MIGRATE_FROM - EVENT] Migrating from source at address 127.0.0.1:9004
file = phd-tests/framework/src/test_vm/mod.rs
line = 507
migration_id = 2b4eec07-6ba1-4f99-9d70-aba6d9b6dde7
path = phd_tests::migrate::from_base::migration_from_base_and_back
source = migration_from_base_and_back_lifecycle_1
source_id = 335f4b7a-3418-417a-8e57-cabce35da6a6
target = phd_framework::test_vm
target_id = 32d900ff-dea5-407f-bbd7-9d95ea20fc1f
timeout_duration = 45s
|
147 | 2025-03-10T23:10:42.800Z | INFO | phd-runner: [INSTANCE_ENSURE_INTERNAL - START]
file = phd-tests/framework/src/test_vm/mod.rs
line = 276
path = phd_tests::migrate::from_base::migration_from_base_and_back
source = migration_from_base_and_back_lifecycle_1
source_id = 335f4b7a-3418-417a-8e57-cabce35da6a6
target = phd_framework::test_vm
target_id = 32d900ff-dea5-407f-bbd7-9d95ea20fc1f
vm = migration_from_base_and_back_lifecycle_2
vm_id = 32d900ff-dea5-407f-bbd7-9d95ea20fc1f
|
148 | 2025-03-10T23:10:42.801Z | INFO | phd-runner: [INSTANCE_ENSURE_INTERNAL - EVENT] retriable error from instance_spec_ensure
e = Communication Error: error sending request for url (http://127.0.0.1:9006/instance)
file = phd-tests/framework/src/test_vm/mod.rs
line = 320
path = phd_tests::migrate::from_base::migration_from_base_and_back
source = migration_from_base_and_back_lifecycle_1
source_id = 335f4b7a-3418-417a-8e57-cabce35da6a6
target = phd_framework::test_vm
target_id = 32d900ff-dea5-407f-bbd7-9d95ea20fc1f
vm = migration_from_base_and_back_lifecycle_2
vm_id = 32d900ff-dea5-407f-bbd7-9d95ea20fc1f
|
149 | 2025-03-10T23:10:43.084Z | INFO | phd-runner: [INSTANCE_ENSURE_INTERNAL - EVENT] Started instance
file = phd-tests/framework/src/test_vm/mod.rs
instance_description.instance = Instance { properties: InstanceProperties { description: "Pheidippides-managed VM", id: 32d900ff-dea5-407f-bbd7-9d95ea20fc1f, metadata: InstanceMetadata { project_id: 15ba45b8-4f53-4512-950f-e62eb49080da, silo_id: f1211c9e-be87-4d22-acc5-5eda13de6d8a, sled_id: c84d43f0-c66e-4a47-abc7-473ac218fb34, sled_model: "pheidippes", sled_revision: 1, sled_serial: "c84d43f0-c66e-4a47-abc7-473ac218fb34" }, name: "phd-vm-32d900ff-dea5-407f-bbd7-9d95ea20fc1f" }, state: Migrating }
line = 379
path = phd_tests::migrate::from_base::migration_from_base_and_back
source = migration_from_base_and_back_lifecycle_1
source_id = 335f4b7a-3418-417a-8e57-cabce35da6a6
target = phd_framework::test_vm
target_id = 32d900ff-dea5-407f-bbd7-9d95ea20fc1f
vm = migration_from_base_and_back_lifecycle_2
vm_id = 32d900ff-dea5-407f-bbd7-9d95ea20fc1f
|
150 | 2025-03-10T23:10:43.084Z | INFO | phd-runner: [INSTANCE_ENSURE_INTERNAL - END]
elapsed_milliseconds = 284
file = phd-tests/framework/src/test_vm/mod.rs
line = 276
path = phd_tests::migrate::from_base::migration_from_base_and_back
source = migration_from_base_and_back_lifecycle_1
source_id = 335f4b7a-3418-417a-8e57-cabce35da6a6
target = phd_framework::test_vm
target_id = 32d900ff-dea5-407f-bbd7-9d95ea20fc1f
vm = migration_from_base_and_back_lifecycle_2
vm_id = 32d900ff-dea5-407f-bbd7-9d95ea20fc1f
|
151 | 2025-03-10T23:10:43.084Z | INFO | phd-runner: [MIGRATE - START]
file = phd-tests/framework/src/test_vm/mod.rs
line = 528
migration_id = 2b4eec07-6ba1-4f99-9d70-aba6d9b6dde7
path = phd_tests::migrate::from_base::migration_from_base_and_back
source = migration_from_base_and_back_lifecycle_1
source_id = 335f4b7a-3418-417a-8e57-cabce35da6a6
target = phd_framework::test_vm
target_id = 32d900ff-dea5-407f-bbd7-9d95ea20fc1f
|
152 | 2025-03-10T23:10:45.543Z | INFO | phd-runner: [SERIAL CONSOLE TASK - EVENT] serial socket control message
file = phd-tests/framework/src/serial/mod.rs
line = 275
s = {"Migrating":{"destination":"127.0.0.1:9006","from_start":7854}}
target = phd_framework::serial
|
153 | 2025-03-10T23:10:45.891Z | INFO | phd-runner: [MIGRATE_FROM - EVENT] Migration completed successfully
file = phd-tests/framework/src/test_vm/mod.rs
line = 541
path = phd_tests::migrate::from_base::migration_from_base_and_back
source = migration_from_base_and_back_lifecycle_1
source_id = 335f4b7a-3418-417a-8e57-cabce35da6a6
target = phd_framework::test_vm
target_id = 32d900ff-dea5-407f-bbd7-9d95ea20fc1f
|
154 | 2025-03-10T23:10:45.891Z | INFO | phd-runner: [MIGRATE - END]
elapsed_milliseconds = 2806
file = phd-tests/framework/src/test_vm/mod.rs
line = 528
migration_id = 2b4eec07-6ba1-4f99-9d70-aba6d9b6dde7
path = phd_tests::migrate::from_base::migration_from_base_and_back
source = migration_from_base_and_back_lifecycle_1
source_id = 335f4b7a-3418-417a-8e57-cabce35da6a6
target = phd_framework::test_vm
target_id = 32d900ff-dea5-407f-bbd7-9d95ea20fc1f
|
155 | 2025-03-10T23:10:45.891Z | INFO | phd-runner: [MIGRATE_FROM - END]
elapsed_milliseconds = 3090
file = phd-tests/framework/src/test_vm/mod.rs
line = 474
path = phd_tests::migrate::from_base::migration_from_base_and_back
source = migration_from_base_and_back_lifecycle_1
source_id = 335f4b7a-3418-417a-8e57-cabce35da6a6
target = phd_framework::test_vm
target_id = 32d900ff-dea5-407f-bbd7-9d95ea20fc1f
|
156 | 2025-03-10T23:10:45.892Z | INFO | phd-runner: [VM CLEANUP - START]
file = phd-tests/framework/src/test_vm/mod.rs
line = 1029
path = phd_tests::migrate::from_base::migration_from_base_and_back
target = phd_framework::test_vm
vm = migration_from_base_and_back_lifecycle_1
vm_id = 335f4b7a-3418-417a-8e57-cabce35da6a6
|
157 | 2025-03-10T23:10:45.892Z | INFO | phd-runner: [WAIT_FOR_SERIAL_OUTPUT - START]
file = phd-tests/framework/src/test_vm/mod.rs
line = 772
path = phd_tests::migrate::from_base::migration_from_base_and_back
target = phd_framework::test_vm
vm = migration_from_base_and_back_lifecycle_2
vm_id = 32d900ff-dea5-407f-bbd7-9d95ea20fc1f
|
158 | 2025-03-10T23:10:45.892Z | INFO | phd-runner: [WAIT_FOR_SERIAL_OUTPUT - EVENT] Waiting for output on serial console
file = phd-tests/framework/src/test_vm/mod.rs
line = 779
path = phd_tests::migrate::from_base::migration_from_base_and_back
target = phd_framework::test_vm
timeout_duration = Explicit(15s)
vm = migration_from_base_and_back_lifecycle_2
vm_id = 32d900ff-dea5-407f-bbd7-9d95ea20fc1f
|
159 | 2025-03-10T23:10:45.893Z | DEBG | phd-runner: [VM CLEANUP - EVENT] Killing Propolis server process
file = phd-tests/framework/src/test_vm/server.rs
line = 125
path = phd_tests::migrate::from_base::migration_from_base_and_back
self.address = 127.0.0.1:9004
target = phd_framework::test_vm::server
vm = migration_from_base_and_back_lifecycle_1
vm_id = 335f4b7a-3418-417a-8e57-cabce35da6a6
|
160 | 2025-03-10T23:10:45.994Z | INFO | phd-runner: [VM CLEANUP - END]
elapsed_milliseconds = 102
file = phd-tests/framework/src/test_vm/mod.rs
line = 1029
path = phd_tests::migrate::from_base::migration_from_base_and_back
target = phd_framework::test_vm
vm = migration_from_base_and_back_lifecycle_1
vm_id = 335f4b7a-3418-417a-8e57-cabce35da6a6
|
161 | 2025-03-10T23:10:45.995Z | INFO | phd-runner: [WAIT_FOR_SERIAL_OUTPUT - END]
elapsed_milliseconds = 102
file = phd-tests/framework/src/test_vm/mod.rs
line = 772
path = phd_tests::migrate::from_base::migration_from_base_and_back
target = phd_framework::test_vm
vm = migration_from_base_and_back_lifecycle_2
vm_id = 32d900ff-dea5-407f-bbd7-9d95ea20fc1f
|
162 | 2025-03-10T23:10:45.995Z | INFO | phd-runner: [WAIT_FOR_SERIAL_OUTPUT - START]
file = phd-tests/framework/src/test_vm/mod.rs
line = 772
path = phd_tests::migrate::from_base::migration_from_base_and_back
target = phd_framework::test_vm
vm = migration_from_base_and_back_lifecycle_2
vm_id = 32d900ff-dea5-407f-bbd7-9d95ea20fc1f
|
163 | 2025-03-10T23:10:45.995Z | INFO | phd-runner: [WAIT_FOR_SERIAL_OUTPUT - EVENT] Waiting for output on serial console
file = phd-tests/framework/src/test_vm/mod.rs
line = 779
path = phd_tests::migrate::from_base::migration_from_base_and_back
target = phd_framework::test_vm
timeout_duration = Explicit(300s)
vm = migration_from_base_and_back_lifecycle_2
vm_id = 32d900ff-dea5-407f-bbd7-9d95ea20fc1f
|
164 | 2025-03-10T23:10:46.018Z | INFO | phd-runner: [WAIT_FOR_SERIAL_OUTPUT - END]
elapsed_milliseconds = 22
file = phd-tests/framework/src/test_vm/mod.rs
line = 772
path = phd_tests::migrate::from_base::migration_from_base_and_back
target = phd_framework::test_vm
vm = migration_from_base_and_back_lifecycle_2
vm_id = 32d900ff-dea5-407f-bbd7-9d95ea20fc1f
|
165 | 2025-03-10T23:10:46.018Z | INFO | phd-runner: [VM CLEANUP - START]
file = phd-tests/framework/src/test_vm/mod.rs
line = 1029
path = phd_tests::migrate::from_base::migration_from_base_and_back
target = phd_framework::test_vm
vm = migration_from_base_and_back_lifecycle_2
vm_id = 32d900ff-dea5-407f-bbd7-9d95ea20fc1f
|
166 | 2025-03-10T23:10:46.018Z | DEBG | phd-runner: [SERIAL CONSOLE TASK - EVENT] serial console command channel was closed
file = phd-tests/framework/src/serial/mod.rs
line = 213
target = phd_framework::serial
|
167 | 2025-03-10T23:10:46.018Z | INFO | phd-runner: [SERIAL CONSOLE TASK - END]
elapsed_milliseconds = 16239
file = phd-tests/framework/src/serial/mod.rs
line = 200
target = phd_framework::serial
|
168 | 2025-03-10T23:10:46.018Z | INFO | phd-runner: test phd_tests::migrate::from_base::migration_from_base_and_back ... ok
file = phd-tests/runner/src/execute.rs
line = 129
target = phd_runner::execute
|
169 | 2025-03-10T23:10:46.018Z | INFO | phd-runner: [TEST_CLEANUP - START]
file = phd-tests/runner/src/fixtures.rs
line = 51
target = phd_runner::fixtures
|
170 | 2025-03-10T23:10:46.019Z | DEBG | phd-runner: [VM CLEANUP - EVENT] trying to ensure Propolis server VM is destroyed
file = phd-tests/framework/src/test_vm/mod.rs
line = 1052
path = phd_tests::migrate::from_base::migration_from_base_and_back
target = phd_framework::test_vm
vm = migration_from_base_and_back_lifecycle_2
vm_id = 32d900ff-dea5-407f-bbd7-9d95ea20fc1f
|
171 | 2025-03-10T23:10:46.594Z | DEBG | phd-runner: [VM CLEANUP - EVENT] Killing Propolis server process
file = phd-tests/framework/src/test_vm/server.rs
line = 125
path = phd_tests::migrate::from_base::migration_from_base_and_back
self.address = 127.0.0.1:9006
target = phd_framework::test_vm::server
vm = migration_from_base_and_back_lifecycle_2
vm_id = 32d900ff-dea5-407f-bbd7-9d95ea20fc1f
|
172 | 2025-03-10T23:10:46.697Z | DEBG | phd-runner: [VM CLEANUP - EVENT] zfs clone dropped
file = phd-tests/framework/src/zfs.rs
line = 83
path = phd_tests::migrate::from_base::migration_from_base_and_back
target = phd_framework::zfs
vm = migration_from_base_and_back_lifecycle_2
vm_id = 32d900ff-dea5-407f-bbd7-9d95ea20fc1f
|
173 | 2025-03-10T23:10:46.697Z | DEBG | phd-runner: [VM CLEANUP - EVENT] executing ZFS command
args = ["phd-artifacts/phd-clone-28318da7-b1bd-4847-ba88-9fa5c098f3fb"]
file = phd-tests/framework/src/zfs.rs
line = 304
path = phd_tests::migrate::from_base::migration_from_base_and_back
target = phd_framework::zfs
verb = destroy
vm = migration_from_base_and_back_lifecycle_2
vm_id = 32d900ff-dea5-407f-bbd7-9d95ea20fc1f
|
174 | 2025-03-10T23:10:46.732Z | DEBG | phd-runner: [VM CLEANUP - EVENT] zfs snapshot dropped
file = phd-tests/framework/src/zfs.rs
line = 57
path = phd_tests::migrate::from_base::migration_from_base_and_back
target = phd_framework::zfs
vm = migration_from_base_and_back_lifecycle_2
vm_id = 32d900ff-dea5-407f-bbd7-9d95ea20fc1f
|
175 | 2025-03-10T23:10:46.732Z | DEBG | phd-runner: [VM CLEANUP - EVENT] executing ZFS command
args = ["phd-artifacts@phd-4ff0d69b-8e0d-47df-bfcd-4b28b7590ca5"]
file = phd-tests/framework/src/zfs.rs
line = 304
path = phd_tests::migrate::from_base::migration_from_base_and_back
target = phd_framework::zfs
verb = destroy
vm = migration_from_base_and_back_lifecycle_2
vm_id = 32d900ff-dea5-407f-bbd7-9d95ea20fc1f
|
176 | 2025-03-10T23:10:46.758Z | INFO | phd-runner: [VM CLEANUP - END]
elapsed_milliseconds = 740
file = phd-tests/framework/src/test_vm/mod.rs
line = 1029
path = phd_tests::migrate::from_base::migration_from_base_and_back
target = phd_framework::test_vm
vm = migration_from_base_and_back_lifecycle_2
vm_id = 32d900ff-dea5-407f-bbd7-9d95ea20fc1f
|
177 | 2025-03-10T23:10:46.758Z | INFO | phd-runner: [TEST - END]
elapsed_milliseconds = 90485
file = phd-tests/tests/src/migrate.rs
line = 52
path = phd_tests::migrate::from_base::migration_from_base_and_back
target = phd_tests::migrate::from_base
|
178 | 2025-03-10T23:10:46.758Z | INFO | phd-runner: [TEST_CLEANUP - END]
elapsed_milliseconds = 740
file = phd-tests/runner/src/fixtures.rs
line = 51
target = phd_runner::fixtures
|
179 | 2025-03-10T23:10:46.758Z | INFO | phd-runner: Starting test phd_tests::migrate::from_base::serial_history
file = phd-tests/runner/src/execute.rs
line = 90
target = phd_runner::execute
|
180 | 2025-03-10T23:10:46.758Z | INFO | phd-runner: [TEST_SETUP - START]
file = phd-tests/runner/src/fixtures.rs
line = 41
target = phd_runner::fixtures
|
181 | 2025-03-10T23:10:46.758Z | INFO | phd-runner: [TEST_SETUP - END]
elapsed_milliseconds = 0
file = phd-tests/runner/src/fixtures.rs
line = 41
target = phd_runner::fixtures
|
182 | 2025-03-10T23:10:46.759Z | INFO | phd-runner: [TEST - START]
file = phd-tests/tests/src/migrate.rs
line = 40
path = phd_tests::migrate::from_base::serial_history
target = phd_tests::migrate::from_base
|
183 | 2025-03-10T23:10:46.759Z | DEBG | phd-runner: [TEST - EVENT] Verified artifact already exists
file = phd-tests/framework/src/artifacts/store.rs
line = 45
path = /phd-artifacts/29813374b58e3b77fb665f2d95cb3bab37d44fdd2c4fce2a70de9d76a3512a4f/OVMF_CODE.fd
target = phd_framework::artifacts::store
|
184 | 2025-03-10T23:10:46.759Z | DEBG | phd-runner: [TEST - EVENT] Verified artifact already exists
file = phd-tests/framework/src/artifacts/store.rs
line = 45
path = /phd-artifacts/ba8007f74f9b54fbae3b2520da577831b4834778a498d732f091260c61aa7ca1/alpine.iso
target = phd_framework::artifacts::store
|
185 | 2025-03-10T23:10:46.759Z | DEBG | phd-runner: [TEST - EVENT] Verified artifact already exists
file = phd-tests/framework/src/artifacts/store.rs
line = 45
path = /phd-artifacts/ba8007f74f9b54fbae3b2520da577831b4834778a498d732f091260c61aa7ca1/alpine.iso
target = phd_framework::artifacts::store
|
186 | 2025-03-10T23:10:46.759Z | DEBG | phd-runner: [TEST - EVENT] executing ZFS command
args = ["/phd-artifacts/ba8007f74f9b54fbae3b2520da577831b4834778a498d732f091260c61aa7ca1/alpine.iso"]
file = phd-tests/framework/src/zfs.rs
line = 304
path = phd_tests::migrate::from_base::serial_history
target = phd_framework::zfs
verb = list
|
187 | 2025-03-10T23:10:46.779Z | DEBG | phd-runner: [TEST - EVENT] parsing zfs list output
file = phd-tests/framework/src/zfs.rs
line = 238
path = phd_tests::migrate::from_base::serial_history
stdout = NAME USED AVAIL REFER MOUNTPOINT\nphd-artifacts 687M 1.80T 687M /phd-artifacts\n
target = phd_framework::zfs
|
188 | 2025-03-10T23:10:46.779Z | DEBG | phd-runner: [TEST - EVENT] executing ZFS command
args = ["phd-artifacts@phd-357362d9-4558-4215-bb17-8fce2ffe4ea5"]
file = phd-tests/framework/src/zfs.rs
line = 304
path = phd_tests::migrate::from_base::serial_history
target = phd_framework::zfs
verb = snapshot
|
189 | 2025-03-10T23:10:46.805Z | DEBG | phd-runner: [TEST - EVENT] executing ZFS command
args = ["phd-artifacts@phd-357362d9-4558-4215-bb17-8fce2ffe4ea5", "phd-artifacts/phd-clone-bc022440-3bec-4648-bfff-1da654245650"]
file = phd-tests/framework/src/zfs.rs
line = 304
path = phd_tests::migrate::from_base::serial_history
target = phd_framework::zfs
verb = clone
|
190 | 2025-03-10T23:10:46.830Z | DEBG | phd-runner: [TEST - EVENT] executing ZFS command
args = ["phd-artifacts/phd-clone-bc022440-3bec-4648-bfff-1da654245650"]
file = phd-tests/framework/src/zfs.rs
line = 304
path = phd_tests::migrate::from_base::serial_history
target = phd_framework::zfs
verb = list
|
191 | 2025-03-10T23:10:46.848Z | DEBG | phd-runner: [TEST - EVENT] parsing zfs list output
file = phd-tests/framework/src/zfs.rs
line = 238
path = phd_tests::migrate::from_base::serial_history
stdout = NAME USED AVAIL REFER MOUNTPOINT\nphd-artifacts/phd-clone-bc022440-3bec-4648-bfff-1da654245650 0B 1.80T 687M /phd-artifacts/phd-clone-bc022440-3bec-4648-bfff-1da654245650\n
target = phd_framework::zfs
|
192 | 2025-03-10T23:10:46.849Z | INFO | phd-runner: [NEW - START]
file = phd-tests/framework/src/test_vm/mod.rs
line = 193
path = phd_tests::migrate::from_base::serial_history
target = phd_framework::test_vm
|
193 | 2025-03-10T23:10:46.849Z | INFO | phd-runner: [NEW - EVENT] phd_framework::test_vm
environment = EnvironmentSpec { location: Local, propolis_artifact: "__BASE_PROPOLIS" }
file = phd-tests/framework/src/test_vm/mod.rs
guest_os_kind = Alpine
line = 211
path = phd_tests::migrate::from_base::serial_history
target = phd_framework::test_vm
vm_name = migration_serial_history_base
|
194 | 2025-03-10T23:10:46.849Z | DEBG | phd-runner: [NEW - EVENT] Verified artifact already exists
file = phd-tests/framework/src/artifacts/store.rs
line = 45
path = /phd-artifacts/699c2d2c5e97e63733ab85fce044388baefe882761373e5c02190990dd286770/propolis-server
target = phd_framework::artifacts::store
|
195 | 2025-03-10T23:10:46.849Z | INFO | phd-runner: [NEW - EVENT] Launching Propolis server
bootrom_path = "/phd-artifacts/29813374b58e3b77fb665f2d95cb3bab37d44fdd2c4fce2a70de9d76a3512a4f/OVMF_CODE.fd"
file = phd-tests/framework/src/test_vm/server.rs
line = 55
path = phd_tests::migrate::from_base::serial_history
server_addr = 127.0.0.1:9000
server_path = "/phd-artifacts/699c2d2c5e97e63733ab85fce044388baefe882761373e5c02190990dd286770/propolis-server"
target = phd_framework::test_vm::server
|
196 | 2025-03-10T23:10:46.849Z | INFO | phd-runner: [NEW - EVENT] Opening server log files
file = phd-tests/framework/src/server_log_mode.rs
line = 64
path = phd_tests::migrate::from_base::serial_history
stderr_path = "/tmp/propolis-phd/migration_serial_history_base.stderr.log"
stdout_path = "/tmp/propolis-phd/migration_serial_history_base.stdout.log"
target = phd_framework::server_log_mode
|
197 | 2025-03-10T23:10:46.860Z | INFO | phd-runner: [NEW - EVENT] Launched server with pid 882
file = phd-tests/framework/src/test_vm/server.rs
line = 107
path = phd_tests::migrate::from_base::serial_history
target = phd_framework::test_vm::server
|
198 | 2025-03-10T23:10:46.860Z | INFO | phd-runner: [NEW - END]
elapsed_milliseconds = 11
file = phd-tests/framework/src/test_vm/mod.rs
line = 193
path = phd_tests::migrate::from_base::serial_history
target = phd_framework::test_vm
|
199 | 2025-03-10T23:10:46.861Z | INFO | phd-runner: [INSTANCE_ENSURE_INTERNAL - START]
file = phd-tests/framework/src/test_vm/mod.rs
line = 276
path = phd_tests::migrate::from_base::serial_history
target = phd_framework::test_vm
vm = migration_serial_history_base
vm_id = 8580f384-0656-44ae-9e46-0f9fbcfd931e
|
200 | 2025-03-10T23:10:46.861Z | INFO | phd-runner: [INSTANCE_ENSURE_INTERNAL - EVENT] retriable error from instance_spec_ensure
e = Communication Error: error sending request for url (http://127.0.0.1:9000/instance)
file = phd-tests/framework/src/test_vm/mod.rs
line = 320
path = phd_tests::migrate::from_base::serial_history
target = phd_framework::test_vm
vm = migration_serial_history_base
vm_id = 8580f384-0656-44ae-9e46-0f9fbcfd931e
|
201 | 2025-03-10T23:10:47.426Z | INFO | phd-runner: [SERIAL CONSOLE TASK - START]
file = phd-tests/framework/src/serial/mod.rs
line = 200
target = phd_framework::serial
|
202 | 2025-03-10T23:10:47.426Z | INFO | phd-runner: [INSTANCE_ENSURE_INTERNAL - EVENT] Started instance
file = phd-tests/framework/src/test_vm/mod.rs
instance_description.instance = Instance { properties: InstanceProperties { description: "Pheidippides-managed VM", id: 8580f384-0656-44ae-9e46-0f9fbcfd931e, metadata: InstanceMetadata { project_id: 77166572-3e09-4bd0-bcca-d12dc789ef7d, silo_id: fd0d540b-82c5-4335-a14a-44ba3985a8a9, sled_id: 339a02c0-061d-49db-b394-9f47a6b303d0, sled_model: "pheidippes", sled_revision: 1, sled_serial: "339a02c0-061d-49db-b394-9f47a6b303d0" }, name: "phd-vm-8580f384-0656-44ae-9e46-0f9fbcfd931e" }, state: Creating }
line = 379
path = phd_tests::migrate::from_base::serial_history
target = phd_framework::test_vm
vm = migration_serial_history_base
vm_id = 8580f384-0656-44ae-9e46-0f9fbcfd931e
|
203 | 2025-03-10T23:10:47.426Z | INFO | phd-runner: [INSTANCE_ENSURE_INTERNAL - END]
elapsed_milliseconds = 565
file = phd-tests/framework/src/test_vm/mod.rs
line = 276
path = phd_tests::migrate::from_base::serial_history
target = phd_framework::test_vm
vm = migration_serial_history_base
vm_id = 8580f384-0656-44ae-9e46-0f9fbcfd931e
|
204 | 2025-03-10T23:10:47.426Z | INFO | phd-runner: [PUT_INSTANCE_STATE - START]
file = phd-tests/framework/src/test_vm/mod.rs
line = 440
path = phd_tests::migrate::from_base::serial_history
target = phd_framework::test_vm
vm = migration_serial_history_base
vm_id = 8580f384-0656-44ae-9e46-0f9fbcfd931e
|
205 | 2025-03-10T23:10:47.427Z | INFO | phd-runner: [PUT_INSTANCE_STATE - EVENT] Requesting instance state change
file = phd-tests/framework/src/test_vm/mod.rs
line = 445
path = phd_tests::migrate::from_base::serial_history
state = Run
target = phd_framework::test_vm
vm = migration_serial_history_base
vm_id = 8580f384-0656-44ae-9e46-0f9fbcfd931e
|
206 | 2025-03-10T23:10:47.427Z | INFO | phd-runner: [PUT_INSTANCE_STATE - END]
elapsed_milliseconds = 0
file = phd-tests/framework/src/test_vm/mod.rs
line = 440
path = phd_tests::migrate::from_base::serial_history
target = phd_framework::test_vm
vm = migration_serial_history_base
vm_id = 8580f384-0656-44ae-9e46-0f9fbcfd931e
|
207 | 2025-03-10T23:10:47.427Z | INFO | phd-runner: [WAIT_TO_BOOT - START]
file = phd-tests/framework/src/test_vm/mod.rs
line = 757
path = phd_tests::migrate::from_base::serial_history
target = phd_framework::test_vm
|
208 | 2025-03-10T23:10:47.427Z | INFO | phd-runner: [WAIT_TO_BOOT - EVENT] waiting for guest to boot
file = phd-tests/framework/src/test_vm/mod.rs
line = 706
path = phd_tests::migrate::from_base::serial_history
target = phd_framework::test_vm
timeout_duration = 300s
vm = migration_serial_history_base
vm_id = 8580f384-0656-44ae-9e46-0f9fbcfd931e
|
209 | 2025-03-10T23:10:47.427Z | DEBG | phd-runner: [WAIT_TO_BOOT - EVENT] executing command in boot sequence
file = phd-tests/framework/src/test_vm/mod.rs
line = 714
path = phd_tests::migrate::from_base::serial_history
step = WaitFor("localhost login: ")
target = phd_framework::test_vm
|
210 | 2025-03-10T23:10:47.427Z | INFO | phd-runner: [WAIT_FOR_SERIAL_OUTPUT - START]
file = phd-tests/framework/src/test_vm/mod.rs
line = 772
path = phd_tests::migrate::from_base::serial_history
target = phd_framework::test_vm
vm = migration_serial_history_base
vm_id = 8580f384-0656-44ae-9e46-0f9fbcfd931e
|
211 | 2025-03-10T23:10:47.427Z | INFO | phd-runner: [WAIT_FOR_SERIAL_OUTPUT - EVENT] Waiting for output on serial console
file = phd-tests/framework/src/test_vm/mod.rs
line = 779
path = phd_tests::migrate::from_base::serial_history
target = phd_framework::test_vm
timeout_duration = CallerTimeout
vm = migration_serial_history_base
vm_id = 8580f384-0656-44ae-9e46-0f9fbcfd931e
|
212 | 2025-03-10T23:10:51.572Z | INFO | phd-runner: [WAIT_FOR_SERIAL_OUTPUT - END]
elapsed_milliseconds = 4145
file = phd-tests/framework/src/test_vm/mod.rs
line = 772
path = phd_tests::migrate::from_base::serial_history
target = phd_framework::test_vm
vm = migration_serial_history_base
vm_id = 8580f384-0656-44ae-9e46-0f9fbcfd931e
|
213 | 2025-03-10T23:10:51.572Z | DEBG | phd-runner: [WAIT_TO_BOOT - EVENT] executing command in boot sequence
file = phd-tests/framework/src/test_vm/mod.rs
line = 714
path = phd_tests::migrate::from_base::serial_history
step = WriteStr("root")
target = phd_framework::test_vm
|
214 | 2025-03-10T23:10:51.573Z | DEBG | phd-runner: [WAIT_TO_BOOT - EVENT] executing command in boot sequence
file = phd-tests/framework/src/test_vm/mod.rs
line = 714
path = phd_tests::migrate::from_base::serial_history
step = WaitFor("localhost:~#")
target = phd_framework::test_vm
|
215 | 2025-03-10T23:10:51.573Z | INFO | phd-runner: [WAIT_FOR_SERIAL_OUTPUT - START]
file = phd-tests/framework/src/test_vm/mod.rs
line = 772
path = phd_tests::migrate::from_base::serial_history
target = phd_framework::test_vm
vm = migration_serial_history_base
vm_id = 8580f384-0656-44ae-9e46-0f9fbcfd931e
|
216 | 2025-03-10T23:10:51.573Z | INFO | phd-runner: [WAIT_FOR_SERIAL_OUTPUT - EVENT] Waiting for output on serial console
file = phd-tests/framework/src/test_vm/mod.rs
line = 779
path = phd_tests::migrate::from_base::serial_history
target = phd_framework::test_vm
timeout_duration = CallerTimeout
vm = migration_serial_history_base
vm_id = 8580f384-0656-44ae-9e46-0f9fbcfd931e
|
217 | 2025-03-10T23:10:51.590Z | INFO | phd-runner: [WAIT_FOR_SERIAL_OUTPUT - END]
elapsed_milliseconds = 17
file = phd-tests/framework/src/test_vm/mod.rs
line = 772
path = phd_tests::migrate::from_base::serial_history
target = phd_framework::test_vm
vm = migration_serial_history_base
vm_id = 8580f384-0656-44ae-9e46-0f9fbcfd931e
|
218 | 2025-03-10T23:10:51.591Z | DEBG | phd-runner: [WAIT_TO_BOOT - EVENT] executing command in boot sequence
file = phd-tests/framework/src/test_vm/mod.rs
line = 714
path = phd_tests::migrate::from_base::serial_history
step = WriteStr("stty -F `tty` cols 9999")
target = phd_framework::test_vm
|
219 | 2025-03-10T23:10:51.591Z | DEBG | phd-runner: [WAIT_TO_BOOT - EVENT] executing command in boot sequence
file = phd-tests/framework/src/test_vm/mod.rs
line = 714
path = phd_tests::migrate::from_base::serial_history
step = WaitFor("localhost:~#")
target = phd_framework::test_vm
|
220 | 2025-03-10T23:10:51.591Z | INFO | phd-runner: [WAIT_FOR_SERIAL_OUTPUT - START]
file = phd-tests/framework/src/test_vm/mod.rs
line = 772
path = phd_tests::migrate::from_base::serial_history
target = phd_framework::test_vm
vm = migration_serial_history_base
vm_id = 8580f384-0656-44ae-9e46-0f9fbcfd931e
|
221 | 2025-03-10T23:10:51.591Z | INFO | phd-runner: [WAIT_FOR_SERIAL_OUTPUT - EVENT] Waiting for output on serial console
file = phd-tests/framework/src/test_vm/mod.rs
line = 779
path = phd_tests::migrate::from_base::serial_history
target = phd_framework::test_vm
timeout_duration = CallerTimeout
vm = migration_serial_history_base
vm_id = 8580f384-0656-44ae-9e46-0f9fbcfd931e
|
222 | 2025-03-10T23:10:51.624Z | INFO | phd-runner: [WAIT_FOR_SERIAL_OUTPUT - END]
elapsed_milliseconds = 32
file = phd-tests/framework/src/test_vm/mod.rs
line = 772
path = phd_tests::migrate::from_base::serial_history
target = phd_framework::test_vm
vm = migration_serial_history_base
vm_id = 8580f384-0656-44ae-9e46-0f9fbcfd931e
|
223 | 2025-03-10T23:10:51.624Z | INFO | phd-runner: [WAIT_TO_BOOT - EVENT] Guest has booted
file = phd-tests/framework/src/test_vm/mod.rs
line = 754
path = phd_tests::migrate::from_base::serial_history
target = phd_framework::test_vm
|
224 | 2025-03-10T23:10:51.624Z | INFO | phd-runner: [WAIT_TO_BOOT - END]
elapsed_milliseconds = 4196
file = phd-tests/framework/src/test_vm/mod.rs
line = 757
path = phd_tests::migrate::from_base::serial_history
target = phd_framework::test_vm
|
225 | 2025-03-10T23:10:51.624Z | INFO | phd-runner: [WAIT_FOR_SERIAL_OUTPUT - START]
file = phd-tests/framework/src/test_vm/mod.rs
line = 772
path = phd_tests::migrate::from_base::serial_history
target = phd_framework::test_vm
vm = migration_serial_history_base
vm_id = 8580f384-0656-44ae-9e46-0f9fbcfd931e
|
226 | 2025-03-10T23:10:51.624Z | INFO | phd-runner: [WAIT_FOR_SERIAL_OUTPUT - EVENT] Waiting for output on serial console
file = phd-tests/framework/src/test_vm/mod.rs
line = 779
path = phd_tests::migrate::from_base::serial_history
target = phd_framework::test_vm
timeout_duration = Explicit(15s)
vm = migration_serial_history_base
vm_id = 8580f384-0656-44ae-9e46-0f9fbcfd931e
|
227 | 2025-03-10T23:10:51.634Z | INFO | phd-runner: [WAIT_FOR_SERIAL_OUTPUT - END]
elapsed_milliseconds = 10
file = phd-tests/framework/src/test_vm/mod.rs
line = 772
path = phd_tests::migrate::from_base::serial_history
target = phd_framework::test_vm
vm = migration_serial_history_base
vm_id = 8580f384-0656-44ae-9e46-0f9fbcfd931e
|
228 | 2025-03-10T23:10:51.634Z | INFO | phd-runner: [WAIT_FOR_SERIAL_OUTPUT - START]
file = phd-tests/framework/src/test_vm/mod.rs
line = 772
path = phd_tests::migrate::from_base::serial_history
target = phd_framework::test_vm
vm = migration_serial_history_base
vm_id = 8580f384-0656-44ae-9e46-0f9fbcfd931e
|
229 | 2025-03-10T23:10:51.635Z | INFO | phd-runner: [WAIT_FOR_SERIAL_OUTPUT - EVENT] Waiting for output on serial console
file = phd-tests/framework/src/test_vm/mod.rs
line = 779
path = phd_tests::migrate::from_base::serial_history
target = phd_framework::test_vm
timeout_duration = Explicit(300s)
vm = migration_serial_history_base
vm_id = 8580f384-0656-44ae-9e46-0f9fbcfd931e
|
230 | 2025-03-10T23:10:51.667Z | INFO | phd-runner: [WAIT_FOR_SERIAL_OUTPUT - END]
elapsed_milliseconds = 32
file = phd-tests/framework/src/test_vm/mod.rs
line = 772
path = phd_tests::migrate::from_base::serial_history
target = phd_framework::test_vm
vm = migration_serial_history_base
vm_id = 8580f384-0656-44ae-9e46-0f9fbcfd931e
|
231 | 2025-03-10T23:10:51.672Z | INFO | phd-runner: [TEST - EVENT] migrating to new Propolis artifact for lifecycle test
file = phd-tests/framework/src/lifecycle.rs
line = 73
path = phd_tests::migrate::from_base::serial_history
propolis_artifact = __DEFAULT_PROPOLIS
target = phd_framework::lifecycle
vm_name = migration_serial_history_base
|
232 | 2025-03-10T23:10:51.672Z | INFO | phd-runner: [NEW - START]
file = phd-tests/framework/src/test_vm/mod.rs
line = 193
path = phd_tests::migrate::from_base::serial_history
target = phd_framework::test_vm
|
233 | 2025-03-10T23:10:51.672Z | INFO | phd-runner: [NEW - EVENT] phd_framework::test_vm
environment = EnvironmentSpec { location: Local, propolis_artifact: "__DEFAULT_PROPOLIS" }
file = phd-tests/framework/src/test_vm/mod.rs
guest_os_kind = Alpine
line = 211
path = phd_tests::migrate::from_base::serial_history
target = phd_framework::test_vm
vm_name = migration_serial_history_base_lifecycle_0
|
234 | 2025-03-10T23:10:51.672Z | DEBG | phd-runner: [NEW - EVENT] Verified artifact already exists
file = phd-tests/framework/src/artifacts/store.rs
line = 45
path = /work/phd-test/propolis-server
target = phd_framework::artifacts::store
|
235 | 2025-03-10T23:10:51.672Z | INFO | phd-runner: [NEW - EVENT] Launching Propolis server
bootrom_path = "/phd-artifacts/29813374b58e3b77fb665f2d95cb3bab37d44fdd2c4fce2a70de9d76a3512a4f/OVMF_CODE.fd"
file = phd-tests/framework/src/test_vm/server.rs
line = 55
path = phd_tests::migrate::from_base::serial_history
server_addr = 127.0.0.1:9002
server_path = "/work/phd-test/propolis-server"
target = phd_framework::test_vm::server
|
236 | 2025-03-10T23:10:51.672Z | INFO | phd-runner: [NEW - EVENT] Opening server log files
file = phd-tests/framework/src/server_log_mode.rs
line = 64
path = phd_tests::migrate::from_base::serial_history
stderr_path = "/tmp/propolis-phd/migration_serial_history_base_lifecycle_0.stderr.log"
stdout_path = "/tmp/propolis-phd/migration_serial_history_base_lifecycle_0.stdout.log"
target = phd_framework::server_log_mode
|
237 | 2025-03-10T23:10:51.688Z | INFO | phd-runner: [NEW - EVENT] Launched server with pid 883
file = phd-tests/framework/src/test_vm/server.rs
line = 107
path = phd_tests::migrate::from_base::serial_history
target = phd_framework::test_vm::server
|
238 | 2025-03-10T23:10:51.688Z | INFO | phd-runner: [NEW - END]
elapsed_milliseconds = 16
file = phd-tests/framework/src/test_vm/mod.rs
line = 193
path = phd_tests::migrate::from_base::serial_history
target = phd_framework::test_vm
|
239 | 2025-03-10T23:10:51.688Z | INFO | phd-runner: [MIGRATE_FROM - START]
file = phd-tests/framework/src/test_vm/mod.rs
line = 474
path = phd_tests::migrate::from_base::serial_history
source = migration_serial_history_base
source_id = 8580f384-0656-44ae-9e46-0f9fbcfd931e
target = phd_framework::test_vm
target_id = 3feddb34-bc83-45a4-b7ff-abb31b49b419
|
240 | 2025-03-10T23:10:51.688Z | INFO | phd-runner: [MIGRATE_FROM - EVENT] Migrating from source at address 127.0.0.1:9000
file = phd-tests/framework/src/test_vm/mod.rs
line = 507
migration_id = 0d2d7829-fa4b-414f-aed2-d0d5e917154a
path = phd_tests::migrate::from_base::serial_history
source = migration_serial_history_base
source_id = 8580f384-0656-44ae-9e46-0f9fbcfd931e
target = phd_framework::test_vm
target_id = 3feddb34-bc83-45a4-b7ff-abb31b49b419
timeout_duration = 45s
|
241 | 2025-03-10T23:10:51.688Z | INFO | phd-runner: [INSTANCE_ENSURE_INTERNAL - START]
file = phd-tests/framework/src/test_vm/mod.rs
line = 276
path = phd_tests::migrate::from_base::serial_history
source = migration_serial_history_base
source_id = 8580f384-0656-44ae-9e46-0f9fbcfd931e
target = phd_framework::test_vm
target_id = 3feddb34-bc83-45a4-b7ff-abb31b49b419
vm = migration_serial_history_base_lifecycle_0
vm_id = 3feddb34-bc83-45a4-b7ff-abb31b49b419
|
242 | 2025-03-10T23:10:51.689Z | INFO | phd-runner: [INSTANCE_ENSURE_INTERNAL - EVENT] retriable error from instance_spec_ensure
e = Communication Error: error sending request for url (http://127.0.0.1:9002/instance)
file = phd-tests/framework/src/test_vm/mod.rs
line = 320
path = phd_tests::migrate::from_base::serial_history
source = migration_serial_history_base
source_id = 8580f384-0656-44ae-9e46-0f9fbcfd931e
target = phd_framework::test_vm
target_id = 3feddb34-bc83-45a4-b7ff-abb31b49b419
vm = migration_serial_history_base_lifecycle_0
vm_id = 3feddb34-bc83-45a4-b7ff-abb31b49b419
|
243 | 2025-03-10T23:10:52.133Z | INFO | phd-runner: [INSTANCE_ENSURE_INTERNAL - EVENT] Started instance
file = phd-tests/framework/src/test_vm/mod.rs
instance_description.instance = Instance { properties: InstanceProperties { description: "Pheidippides-managed VM", id: 3feddb34-bc83-45a4-b7ff-abb31b49b419, metadata: InstanceMetadata { project_id: 77166572-3e09-4bd0-bcca-d12dc789ef7d, silo_id: fd0d540b-82c5-4335-a14a-44ba3985a8a9, sled_id: 1b36ecb9-b84c-45e2-8abf-577ac0de6687, sled_model: "pheidippes", sled_revision: 1, sled_serial: "1b36ecb9-b84c-45e2-8abf-577ac0de6687" }, name: "phd-vm-3feddb34-bc83-45a4-b7ff-abb31b49b419" }, state: Migrating }
line = 379
path = phd_tests::migrate::from_base::serial_history
source = migration_serial_history_base
source_id = 8580f384-0656-44ae-9e46-0f9fbcfd931e
target = phd_framework::test_vm
target_id = 3feddb34-bc83-45a4-b7ff-abb31b49b419
vm = migration_serial_history_base_lifecycle_0
vm_id = 3feddb34-bc83-45a4-b7ff-abb31b49b419
|
244 | 2025-03-10T23:10:52.133Z | INFO | phd-runner: [INSTANCE_ENSURE_INTERNAL - END]
elapsed_milliseconds = 444
file = phd-tests/framework/src/test_vm/mod.rs
line = 276
path = phd_tests::migrate::from_base::serial_history
source = migration_serial_history_base
source_id = 8580f384-0656-44ae-9e46-0f9fbcfd931e
target = phd_framework::test_vm
target_id = 3feddb34-bc83-45a4-b7ff-abb31b49b419
vm = migration_serial_history_base_lifecycle_0
vm_id = 3feddb34-bc83-45a4-b7ff-abb31b49b419
|
245 | 2025-03-10T23:10:52.133Z | INFO | phd-runner: [MIGRATE - START]
file = phd-tests/framework/src/test_vm/mod.rs
line = 528
migration_id = 0d2d7829-fa4b-414f-aed2-d0d5e917154a
path = phd_tests::migrate::from_base::serial_history
source = migration_serial_history_base
source_id = 8580f384-0656-44ae-9e46-0f9fbcfd931e
target = phd_framework::test_vm
target_id = 3feddb34-bc83-45a4-b7ff-abb31b49b419
|
246 | 2025-03-10T23:10:54.608Z | INFO | phd-runner: [SERIAL CONSOLE TASK - EVENT] serial socket control message
file = phd-tests/framework/src/serial/mod.rs
line = 275
s = {"Migrating":{"destination":"127.0.0.1:9002","from_start":7727}}
target = phd_framework::serial
|
247 | 2025-03-10T23:10:56.297Z | INFO | phd-runner: [MIGRATE_FROM - EVENT] Migration completed successfully
file = phd-tests/framework/src/test_vm/mod.rs
line = 541
path = phd_tests::migrate::from_base::serial_history
source = migration_serial_history_base
source_id = 8580f384-0656-44ae-9e46-0f9fbcfd931e
target = phd_framework::test_vm
target_id = 3feddb34-bc83-45a4-b7ff-abb31b49b419
|
248 | 2025-03-10T23:10:56.297Z | INFO | phd-runner: [MIGRATE - END]
elapsed_milliseconds = 4163
file = phd-tests/framework/src/test_vm/mod.rs
line = 528
migration_id = 0d2d7829-fa4b-414f-aed2-d0d5e917154a
path = phd_tests::migrate::from_base::serial_history
source = migration_serial_history_base
source_id = 8580f384-0656-44ae-9e46-0f9fbcfd931e
target = phd_framework::test_vm
target_id = 3feddb34-bc83-45a4-b7ff-abb31b49b419
|
249 | 2025-03-10T23:10:56.297Z | INFO | phd-runner: [MIGRATE_FROM - END]
elapsed_milliseconds = 4608
file = phd-tests/framework/src/test_vm/mod.rs
line = 474
path = phd_tests::migrate::from_base::serial_history
source = migration_serial_history_base
source_id = 8580f384-0656-44ae-9e46-0f9fbcfd931e
target = phd_framework::test_vm
target_id = 3feddb34-bc83-45a4-b7ff-abb31b49b419
|
250 | 2025-03-10T23:10:56.298Z | INFO | phd-runner: [VM CLEANUP - START]
file = phd-tests/framework/src/test_vm/mod.rs
line = 1029
path = phd_tests::migrate::from_base::serial_history
target = phd_framework::test_vm
vm = migration_serial_history_base
vm_id = 8580f384-0656-44ae-9e46-0f9fbcfd931e
|
251 | 2025-03-10T23:10:56.299Z | DEBG | phd-runner: [VM CLEANUP - EVENT] Killing Propolis server process
file = phd-tests/framework/src/test_vm/server.rs
line = 125
path = phd_tests::migrate::from_base::serial_history
self.address = 127.0.0.1:9000
target = phd_framework::test_vm::server
vm = migration_serial_history_base
vm_id = 8580f384-0656-44ae-9e46-0f9fbcfd931e
|
252 | 2025-03-10T23:10:56.399Z | INFO | phd-runner: [VM CLEANUP - END]
elapsed_milliseconds = 101
file = phd-tests/framework/src/test_vm/mod.rs
line = 1029
path = phd_tests::migrate::from_base::serial_history
target = phd_framework::test_vm
vm = migration_serial_history_base
vm_id = 8580f384-0656-44ae-9e46-0f9fbcfd931e
|
253 | 2025-03-10T23:10:56.402Z | INFO | phd-runner: [VM CLEANUP - START]
file = phd-tests/framework/src/test_vm/mod.rs
line = 1029
path = phd_tests::migrate::from_base::serial_history
target = phd_framework::test_vm
vm = migration_serial_history_base_lifecycle_0
vm_id = 3feddb34-bc83-45a4-b7ff-abb31b49b419
|
254 | 2025-03-10T23:10:56.402Z | DEBG | phd-runner: [SERIAL CONSOLE TASK - EVENT] serial console command channel was closed
file = phd-tests/framework/src/serial/mod.rs
line = 213
target = phd_framework::serial
|
255 | 2025-03-10T23:10:56.402Z | INFO | phd-runner: test phd_tests::migrate::from_base::serial_history ... ok
file = phd-tests/runner/src/execute.rs
line = 129
target = phd_runner::execute
|
256 | 2025-03-10T23:10:56.402Z | INFO | phd-runner: [TEST_CLEANUP - START]
file = phd-tests/runner/src/fixtures.rs
line = 51
target = phd_runner::fixtures
|
257 | 2025-03-10T23:10:56.403Z | INFO | phd-runner: [SERIAL CONSOLE TASK - END]
elapsed_milliseconds = 8976
file = phd-tests/framework/src/serial/mod.rs
line = 200
target = phd_framework::serial
|
258 | 2025-03-10T23:10:56.404Z | DEBG | phd-runner: [VM CLEANUP - EVENT] trying to ensure Propolis server VM is destroyed
file = phd-tests/framework/src/test_vm/mod.rs
line = 1052
path = phd_tests::migrate::from_base::serial_history
target = phd_framework::test_vm
vm = migration_serial_history_base_lifecycle_0
vm_id = 3feddb34-bc83-45a4-b7ff-abb31b49b419
|
259 | 2025-03-10T23:10:56.761Z | DEBG | phd-runner: [VM CLEANUP - EVENT] Killing Propolis server process
file = phd-tests/framework/src/test_vm/server.rs
line = 125
path = phd_tests::migrate::from_base::serial_history
self.address = 127.0.0.1:9002
target = phd_framework::test_vm::server
vm = migration_serial_history_base_lifecycle_0
vm_id = 3feddb34-bc83-45a4-b7ff-abb31b49b419
|
260 | 2025-03-10T23:10:56.866Z | DEBG | phd-runner: [VM CLEANUP - EVENT] zfs clone dropped
file = phd-tests/framework/src/zfs.rs
line = 83
path = phd_tests::migrate::from_base::serial_history
target = phd_framework::zfs
vm = migration_serial_history_base_lifecycle_0
vm_id = 3feddb34-bc83-45a4-b7ff-abb31b49b419
|
261 | 2025-03-10T23:10:56.866Z | DEBG | phd-runner: [VM CLEANUP - EVENT] executing ZFS command
args = ["phd-artifacts/phd-clone-bc022440-3bec-4648-bfff-1da654245650"]
file = phd-tests/framework/src/zfs.rs
line = 304
path = phd_tests::migrate::from_base::serial_history
target = phd_framework::zfs
verb = destroy
vm = migration_serial_history_base_lifecycle_0
vm_id = 3feddb34-bc83-45a4-b7ff-abb31b49b419
|
262 | 2025-03-10T23:10:56.901Z | DEBG | phd-runner: [VM CLEANUP - EVENT] zfs snapshot dropped
file = phd-tests/framework/src/zfs.rs
line = 57
path = phd_tests::migrate::from_base::serial_history
target = phd_framework::zfs
vm = migration_serial_history_base_lifecycle_0
vm_id = 3feddb34-bc83-45a4-b7ff-abb31b49b419
|
263 | 2025-03-10T23:10:56.901Z | DEBG | phd-runner: [VM CLEANUP - EVENT] executing ZFS command
args = ["phd-artifacts@phd-357362d9-4558-4215-bb17-8fce2ffe4ea5"]
file = phd-tests/framework/src/zfs.rs
line = 304
path = phd_tests::migrate::from_base::serial_history
target = phd_framework::zfs
verb = destroy
vm = migration_serial_history_base_lifecycle_0
vm_id = 3feddb34-bc83-45a4-b7ff-abb31b49b419
|
264 | 2025-03-10T23:10:56.927Z | INFO | phd-runner: [VM CLEANUP - END]
elapsed_milliseconds = 524
file = phd-tests/framework/src/test_vm/mod.rs
line = 1029
path = phd_tests::migrate::from_base::serial_history
target = phd_framework::test_vm
vm = migration_serial_history_base_lifecycle_0
vm_id = 3feddb34-bc83-45a4-b7ff-abb31b49b419
|
265 | 2025-03-10T23:10:56.927Z | INFO | phd-runner: [TEST - END]
elapsed_milliseconds = 10168
file = phd-tests/tests/src/migrate.rs
line = 40
path = phd_tests::migrate::from_base::serial_history
target = phd_tests::migrate::from_base
|
266 | 2025-03-10T23:10:56.928Z | INFO | phd-runner: [TEST_CLEANUP - END]
elapsed_milliseconds = 525
file = phd-tests/runner/src/fixtures.rs
line = 51
target = phd_runner::fixtures
|
267 | 2025-03-10T23:10:56.928Z | INFO | phd-runner: Starting test phd_tests::migrate::from_base::can_migrate_from_base
file = phd-tests/runner/src/execute.rs
line = 90
target = phd_runner::execute
|
268 | 2025-03-10T23:10:56.928Z | INFO | phd-runner: [TEST_SETUP - START]
file = phd-tests/runner/src/fixtures.rs
line = 41
target = phd_runner::fixtures
|
269 | 2025-03-10T23:10:56.928Z | INFO | phd-runner: [TEST_SETUP - END]
elapsed_milliseconds = 0
file = phd-tests/runner/src/fixtures.rs
line = 41
target = phd_runner::fixtures
|
270 | 2025-03-10T23:10:56.928Z | INFO | phd-runner: [TEST - START]
file = phd-tests/tests/src/migrate.rs
line = 34
path = phd_tests::migrate::from_base::can_migrate_from_base
target = phd_tests::migrate::from_base
|
271 | 2025-03-10T23:10:56.928Z | DEBG | phd-runner: [TEST - EVENT] Verified artifact already exists
file = phd-tests/framework/src/artifacts/store.rs
line = 45
path = /phd-artifacts/29813374b58e3b77fb665f2d95cb3bab37d44fdd2c4fce2a70de9d76a3512a4f/OVMF_CODE.fd
target = phd_framework::artifacts::store
|
272 | 2025-03-10T23:10:56.928Z | DEBG | phd-runner: [TEST - EVENT] Verified artifact already exists
file = phd-tests/framework/src/artifacts/store.rs
line = 45
path = /phd-artifacts/ba8007f74f9b54fbae3b2520da577831b4834778a498d732f091260c61aa7ca1/alpine.iso
target = phd_framework::artifacts::store
|
273 | 2025-03-10T23:10:56.928Z | DEBG | phd-runner: [TEST - EVENT] Verified artifact already exists
file = phd-tests/framework/src/artifacts/store.rs
line = 45
path = /phd-artifacts/ba8007f74f9b54fbae3b2520da577831b4834778a498d732f091260c61aa7ca1/alpine.iso
target = phd_framework::artifacts::store
|
274 | 2025-03-10T23:10:56.928Z | DEBG | phd-runner: [TEST - EVENT] executing ZFS command
args = ["/phd-artifacts/ba8007f74f9b54fbae3b2520da577831b4834778a498d732f091260c61aa7ca1/alpine.iso"]
file = phd-tests/framework/src/zfs.rs
line = 304
path = phd_tests::migrate::from_base::can_migrate_from_base
target = phd_framework::zfs
verb = list
|
275 | 2025-03-10T23:10:56.947Z | DEBG | phd-runner: [TEST - EVENT] parsing zfs list output
file = phd-tests/framework/src/zfs.rs
line = 238
path = phd_tests::migrate::from_base::can_migrate_from_base
stdout = NAME USED AVAIL REFER MOUNTPOINT\nphd-artifacts 688M 1.80T 687M /phd-artifacts\n
target = phd_framework::zfs
|
276 | 2025-03-10T23:10:56.947Z | DEBG | phd-runner: [TEST - EVENT] executing ZFS command
args = ["phd-artifacts@phd-7c7bf509-b8de-4337-b3d5-54a43c0edf9c"]
file = phd-tests/framework/src/zfs.rs
line = 304
path = phd_tests::migrate::from_base::can_migrate_from_base
target = phd_framework::zfs
verb = snapshot
|
277 | 2025-03-10T23:10:56.970Z | DEBG | phd-runner: [TEST - EVENT] executing ZFS command
args = ["phd-artifacts@phd-7c7bf509-b8de-4337-b3d5-54a43c0edf9c", "phd-artifacts/phd-clone-543c0442-0b98-4f5a-aa66-40da569a894a"]
file = phd-tests/framework/src/zfs.rs
line = 304
path = phd_tests::migrate::from_base::can_migrate_from_base
target = phd_framework::zfs
verb = clone
|
278 | 2025-03-10T23:10:56.991Z | DEBG | phd-runner: [TEST - EVENT] executing ZFS command
args = ["phd-artifacts/phd-clone-543c0442-0b98-4f5a-aa66-40da569a894a"]
file = phd-tests/framework/src/zfs.rs
line = 304
path = phd_tests::migrate::from_base::can_migrate_from_base
target = phd_framework::zfs
verb = list
|
279 | 2025-03-10T23:10:57.008Z | DEBG | phd-runner: [TEST - EVENT] parsing zfs list output
file = phd-tests/framework/src/zfs.rs
line = 238
path = phd_tests::migrate::from_base::can_migrate_from_base
stdout = NAME USED AVAIL REFER MOUNTPOINT\nphd-artifacts/phd-clone-543c0442-0b98-4f5a-aa66-40da569a894a 0B 1.80T 687M /phd-artifacts/phd-clone-543c0442-0b98-4f5a-aa66-40da569a894a\n
target = phd_framework::zfs
|
280 | 2025-03-10T23:10:57.009Z | INFO | phd-runner: [NEW - START]
file = phd-tests/framework/src/test_vm/mod.rs
line = 193
path = phd_tests::migrate::from_base::can_migrate_from_base
target = phd_framework::test_vm
|
281 | 2025-03-10T23:10:57.009Z | INFO | phd-runner: [NEW - EVENT] phd_framework::test_vm
environment = EnvironmentSpec { location: Local, propolis_artifact: "__BASE_PROPOLIS" }
file = phd-tests/framework/src/test_vm/mod.rs
guest_os_kind = Alpine
line = 211
path = phd_tests::migrate::from_base::can_migrate_from_base
target = phd_framework::test_vm
vm_name = migration_from_base
|
282 | 2025-03-10T23:10:57.009Z | DEBG | phd-runner: [NEW - EVENT] Verified artifact already exists
file = phd-tests/framework/src/artifacts/store.rs
line = 45
path = /phd-artifacts/699c2d2c5e97e63733ab85fce044388baefe882761373e5c02190990dd286770/propolis-server
target = phd_framework::artifacts::store
|
283 | 2025-03-10T23:10:57.009Z | INFO | phd-runner: [NEW - EVENT] Launching Propolis server
bootrom_path = "/phd-artifacts/29813374b58e3b77fb665f2d95cb3bab37d44fdd2c4fce2a70de9d76a3512a4f/OVMF_CODE.fd"
file = phd-tests/framework/src/test_vm/server.rs
line = 55
path = phd_tests::migrate::from_base::can_migrate_from_base
server_addr = 127.0.0.1:9000
server_path = "/phd-artifacts/699c2d2c5e97e63733ab85fce044388baefe882761373e5c02190990dd286770/propolis-server"
target = phd_framework::test_vm::server
|
284 | 2025-03-10T23:10:57.009Z | INFO | phd-runner: [NEW - EVENT] Opening server log files
file = phd-tests/framework/src/server_log_mode.rs
line = 64
path = phd_tests::migrate::from_base::can_migrate_from_base
stderr_path = "/tmp/propolis-phd/migration_from_base.stderr.log"
stdout_path = "/tmp/propolis-phd/migration_from_base.stdout.log"
target = phd_framework::server_log_mode
|
285 | 2025-03-10T23:10:57.020Z | INFO | phd-runner: [NEW - EVENT] Launched server with pid 892
file = phd-tests/framework/src/test_vm/server.rs
line = 107
path = phd_tests::migrate::from_base::can_migrate_from_base
target = phd_framework::test_vm::server
|
286 | 2025-03-10T23:10:57.020Z | INFO | phd-runner: [NEW - END]
elapsed_milliseconds = 10
file = phd-tests/framework/src/test_vm/mod.rs
line = 193
path = phd_tests::migrate::from_base::can_migrate_from_base
target = phd_framework::test_vm
|
287 | 2025-03-10T23:10:57.020Z | INFO | phd-runner: [INSTANCE_ENSURE_INTERNAL - START]
file = phd-tests/framework/src/test_vm/mod.rs
line = 276
path = phd_tests::migrate::from_base::can_migrate_from_base
target = phd_framework::test_vm
vm = migration_from_base
vm_id = 12a2ab03-0365-4de1-a299-311233471415
|
288 | 2025-03-10T23:10:57.020Z | INFO | phd-runner: [INSTANCE_ENSURE_INTERNAL - EVENT] retriable error from instance_spec_ensure
e = Communication Error: error sending request for url (http://127.0.0.1:9000/instance)
file = phd-tests/framework/src/test_vm/mod.rs
line = 320
path = phd_tests::migrate::from_base::can_migrate_from_base
target = phd_framework::test_vm
vm = migration_from_base
vm_id = 12a2ab03-0365-4de1-a299-311233471415
|
289 | 2025-03-10T23:10:57.781Z | INFO | phd-runner: [SERIAL CONSOLE TASK - START]
file = phd-tests/framework/src/serial/mod.rs
line = 200
target = phd_framework::serial
|
290 | 2025-03-10T23:10:57.782Z | INFO | phd-runner: [INSTANCE_ENSURE_INTERNAL - EVENT] Started instance
file = phd-tests/framework/src/test_vm/mod.rs
instance_description.instance = Instance { properties: InstanceProperties { description: "Pheidippides-managed VM", id: 12a2ab03-0365-4de1-a299-311233471415, metadata: InstanceMetadata { project_id: b51cfd82-859b-41d3-8cf1-c64a22b8bc2e, silo_id: b28dc360-1f77-4cb4-9cf9-c534106f9384, sled_id: df17d0c9-848e-412f-a6e6-deedf7a2e229, sled_model: "pheidippes", sled_revision: 1, sled_serial: "df17d0c9-848e-412f-a6e6-deedf7a2e229" }, name: "phd-vm-12a2ab03-0365-4de1-a299-311233471415" }, state: Creating }
line = 379
path = phd_tests::migrate::from_base::can_migrate_from_base
target = phd_framework::test_vm
vm = migration_from_base
vm_id = 12a2ab03-0365-4de1-a299-311233471415
|
291 | 2025-03-10T23:10:57.782Z | INFO | phd-runner: [INSTANCE_ENSURE_INTERNAL - END]
elapsed_milliseconds = 761
file = phd-tests/framework/src/test_vm/mod.rs
line = 276
path = phd_tests::migrate::from_base::can_migrate_from_base
target = phd_framework::test_vm
vm = migration_from_base
vm_id = 12a2ab03-0365-4de1-a299-311233471415
|
292 | 2025-03-10T23:10:57.782Z | INFO | phd-runner: [PUT_INSTANCE_STATE - START]
file = phd-tests/framework/src/test_vm/mod.rs
line = 440
path = phd_tests::migrate::from_base::can_migrate_from_base
target = phd_framework::test_vm
vm = migration_from_base
vm_id = 12a2ab03-0365-4de1-a299-311233471415
|
293 | 2025-03-10T23:10:57.782Z | INFO | phd-runner: [PUT_INSTANCE_STATE - EVENT] Requesting instance state change
file = phd-tests/framework/src/test_vm/mod.rs
line = 445
path = phd_tests::migrate::from_base::can_migrate_from_base
state = Run
target = phd_framework::test_vm
vm = migration_from_base
vm_id = 12a2ab03-0365-4de1-a299-311233471415
|
294 | 2025-03-10T23:10:57.782Z | INFO | phd-runner: [PUT_INSTANCE_STATE - END]
elapsed_milliseconds = 0
file = phd-tests/framework/src/test_vm/mod.rs
line = 440
path = phd_tests::migrate::from_base::can_migrate_from_base
target = phd_framework::test_vm
vm = migration_from_base
vm_id = 12a2ab03-0365-4de1-a299-311233471415
|
295 | 2025-03-10T23:10:57.782Z | INFO | phd-runner: [WAIT_TO_BOOT - START]
file = phd-tests/framework/src/test_vm/mod.rs
line = 757
path = phd_tests::migrate::from_base::can_migrate_from_base
target = phd_framework::test_vm
|
296 | 2025-03-10T23:10:57.782Z | INFO | phd-runner: [WAIT_TO_BOOT - EVENT] waiting for guest to boot
file = phd-tests/framework/src/test_vm/mod.rs
line = 706
path = phd_tests::migrate::from_base::can_migrate_from_base
target = phd_framework::test_vm
timeout_duration = 300s
vm = migration_from_base
vm_id = 12a2ab03-0365-4de1-a299-311233471415
|
297 | 2025-03-10T23:10:57.782Z | DEBG | phd-runner: [WAIT_TO_BOOT - EVENT] executing command in boot sequence
file = phd-tests/framework/src/test_vm/mod.rs
line = 714
path = phd_tests::migrate::from_base::can_migrate_from_base
step = WaitFor("localhost login: ")
target = phd_framework::test_vm
|
298 | 2025-03-10T23:10:57.782Z | INFO | phd-runner: [WAIT_FOR_SERIAL_OUTPUT - START]
file = phd-tests/framework/src/test_vm/mod.rs
line = 772
path = phd_tests::migrate::from_base::can_migrate_from_base
target = phd_framework::test_vm
vm = migration_from_base
vm_id = 12a2ab03-0365-4de1-a299-311233471415
|
299 | 2025-03-10T23:10:57.783Z | INFO | phd-runner: [WAIT_FOR_SERIAL_OUTPUT - EVENT] Waiting for output on serial console
file = phd-tests/framework/src/test_vm/mod.rs
line = 779
path = phd_tests::migrate::from_base::can_migrate_from_base
target = phd_framework::test_vm
timeout_duration = CallerTimeout
vm = migration_from_base
vm_id = 12a2ab03-0365-4de1-a299-311233471415
|
300 | 2025-03-10T23:11:01.980Z | INFO | phd-runner: [WAIT_FOR_SERIAL_OUTPUT - END]
elapsed_milliseconds = 4197
file = phd-tests/framework/src/test_vm/mod.rs
line = 772
path = phd_tests::migrate::from_base::can_migrate_from_base
target = phd_framework::test_vm
vm = migration_from_base
vm_id = 12a2ab03-0365-4de1-a299-311233471415
|
301 | 2025-03-10T23:11:01.980Z | DEBG | phd-runner: [WAIT_TO_BOOT - EVENT] executing command in boot sequence
file = phd-tests/framework/src/test_vm/mod.rs
line = 714
path = phd_tests::migrate::from_base::can_migrate_from_base
step = WriteStr("root")
target = phd_framework::test_vm
|
302 | 2025-03-10T23:11:01.980Z | DEBG | phd-runner: [WAIT_TO_BOOT - EVENT] executing command in boot sequence
file = phd-tests/framework/src/test_vm/mod.rs
line = 714
path = phd_tests::migrate::from_base::can_migrate_from_base
step = WaitFor("localhost:~#")
target = phd_framework::test_vm
|
303 | 2025-03-10T23:11:01.981Z | INFO | phd-runner: [WAIT_FOR_SERIAL_OUTPUT - START]
file = phd-tests/framework/src/test_vm/mod.rs
line = 772
path = phd_tests::migrate::from_base::can_migrate_from_base
target = phd_framework::test_vm
vm = migration_from_base
vm_id = 12a2ab03-0365-4de1-a299-311233471415
|
304 | 2025-03-10T23:11:01.981Z | INFO | phd-runner: [WAIT_FOR_SERIAL_OUTPUT - EVENT] Waiting for output on serial console
file = phd-tests/framework/src/test_vm/mod.rs
line = 779
path = phd_tests::migrate::from_base::can_migrate_from_base
target = phd_framework::test_vm
timeout_duration = CallerTimeout
vm = migration_from_base
vm_id = 12a2ab03-0365-4de1-a299-311233471415
|
305 | 2025-03-10T23:11:01.998Z | INFO | phd-runner: [WAIT_FOR_SERIAL_OUTPUT - END]
elapsed_milliseconds = 17
file = phd-tests/framework/src/test_vm/mod.rs
line = 772
path = phd_tests::migrate::from_base::can_migrate_from_base
target = phd_framework::test_vm
vm = migration_from_base
vm_id = 12a2ab03-0365-4de1-a299-311233471415
|
306 | 2025-03-10T23:11:01.999Z | DEBG | phd-runner: [WAIT_TO_BOOT - EVENT] executing command in boot sequence
file = phd-tests/framework/src/test_vm/mod.rs
line = 714
path = phd_tests::migrate::from_base::can_migrate_from_base
step = WriteStr("stty -F `tty` cols 9999")
target = phd_framework::test_vm
|
307 | 2025-03-10T23:11:01.999Z | DEBG | phd-runner: [WAIT_TO_BOOT - EVENT] executing command in boot sequence
file = phd-tests/framework/src/test_vm/mod.rs
line = 714
path = phd_tests::migrate::from_base::can_migrate_from_base
step = WaitFor("localhost:~#")
target = phd_framework::test_vm
|
308 | 2025-03-10T23:11:01.999Z | INFO | phd-runner: [WAIT_FOR_SERIAL_OUTPUT - START]
file = phd-tests/framework/src/test_vm/mod.rs
line = 772
path = phd_tests::migrate::from_base::can_migrate_from_base
target = phd_framework::test_vm
vm = migration_from_base
vm_id = 12a2ab03-0365-4de1-a299-311233471415
|
309 | 2025-03-10T23:11:01.999Z | INFO | phd-runner: [WAIT_FOR_SERIAL_OUTPUT - EVENT] Waiting for output on serial console
file = phd-tests/framework/src/test_vm/mod.rs
line = 779
path = phd_tests::migrate::from_base::can_migrate_from_base
target = phd_framework::test_vm
timeout_duration = CallerTimeout
vm = migration_from_base
vm_id = 12a2ab03-0365-4de1-a299-311233471415
|
310 | 2025-03-10T23:11:02.032Z | INFO | phd-runner: [WAIT_FOR_SERIAL_OUTPUT - END]
elapsed_milliseconds = 32
file = phd-tests/framework/src/test_vm/mod.rs
line = 772
path = phd_tests::migrate::from_base::can_migrate_from_base
target = phd_framework::test_vm
vm = migration_from_base
vm_id = 12a2ab03-0365-4de1-a299-311233471415
|
311 | 2025-03-10T23:11:02.032Z | INFO | phd-runner: [WAIT_TO_BOOT - EVENT] Guest has booted
file = phd-tests/framework/src/test_vm/mod.rs
line = 754
path = phd_tests::migrate::from_base::can_migrate_from_base
target = phd_framework::test_vm
|
312 | 2025-03-10T23:11:02.032Z | INFO | phd-runner: [WAIT_TO_BOOT - END]
elapsed_milliseconds = 4249
file = phd-tests/framework/src/test_vm/mod.rs
line = 757
path = phd_tests::migrate::from_base::can_migrate_from_base
target = phd_framework::test_vm
|
313 | 2025-03-10T23:11:02.032Z | INFO | phd-runner: [WAIT_FOR_SERIAL_OUTPUT - START]
file = phd-tests/framework/src/test_vm/mod.rs
line = 772
path = phd_tests::migrate::from_base::can_migrate_from_base
target = phd_framework::test_vm
vm = migration_from_base
vm_id = 12a2ab03-0365-4de1-a299-311233471415
|
314 | 2025-03-10T23:11:02.032Z | INFO | phd-runner: [WAIT_FOR_SERIAL_OUTPUT - EVENT] Waiting for output on serial console
file = phd-tests/framework/src/test_vm/mod.rs
line = 779
path = phd_tests::migrate::from_base::can_migrate_from_base
target = phd_framework::test_vm
timeout_duration = Explicit(15s)
vm = migration_from_base
vm_id = 12a2ab03-0365-4de1-a299-311233471415
|
315 | 2025-03-10T23:11:02.042Z | INFO | phd-runner: [WAIT_FOR_SERIAL_OUTPUT - END]
elapsed_milliseconds = 10
file = phd-tests/framework/src/test_vm/mod.rs
line = 772
path = phd_tests::migrate::from_base::can_migrate_from_base
target = phd_framework::test_vm
vm = migration_from_base
vm_id = 12a2ab03-0365-4de1-a299-311233471415
|
316 | 2025-03-10T23:11:02.043Z | INFO | phd-runner: [WAIT_FOR_SERIAL_OUTPUT - START]
file = phd-tests/framework/src/test_vm/mod.rs
line = 772
path = phd_tests::migrate::from_base::can_migrate_from_base
target = phd_framework::test_vm
vm = migration_from_base
vm_id = 12a2ab03-0365-4de1-a299-311233471415
|
317 | 2025-03-10T23:11:02.043Z | INFO | phd-runner: [WAIT_FOR_SERIAL_OUTPUT - EVENT] Waiting for output on serial console
file = phd-tests/framework/src/test_vm/mod.rs
line = 779
path = phd_tests::migrate::from_base::can_migrate_from_base
target = phd_framework::test_vm
timeout_duration = Explicit(300s)
vm = migration_from_base
vm_id = 12a2ab03-0365-4de1-a299-311233471415
|
318 | 2025-03-10T23:11:02.064Z | INFO | phd-runner: [WAIT_FOR_SERIAL_OUTPUT - END]
elapsed_milliseconds = 21
file = phd-tests/framework/src/test_vm/mod.rs
line = 772
path = phd_tests::migrate::from_base::can_migrate_from_base
target = phd_framework::test_vm
vm = migration_from_base
vm_id = 12a2ab03-0365-4de1-a299-311233471415
|
319 | 2025-03-10T23:11:02.064Z | INFO | phd-runner: [WAIT_FOR_SERIAL_OUTPUT - START]
file = phd-tests/framework/src/test_vm/mod.rs
line = 772
path = phd_tests::migrate::from_base::can_migrate_from_base
target = phd_framework::test_vm
vm = migration_from_base
vm_id = 12a2ab03-0365-4de1-a299-311233471415
|
320 | 2025-03-10T23:11:02.064Z | INFO | phd-runner: [WAIT_FOR_SERIAL_OUTPUT - EVENT] Waiting for output on serial console
file = phd-tests/framework/src/test_vm/mod.rs
line = 779
path = phd_tests::migrate::from_base::can_migrate_from_base
target = phd_framework::test_vm
timeout_duration = Explicit(15s)
vm = migration_from_base
vm_id = 12a2ab03-0365-4de1-a299-311233471415
|
321 | 2025-03-10T23:11:02.076Z | INFO | phd-runner: [WAIT_FOR_SERIAL_OUTPUT - END]
elapsed_milliseconds = 11
file = phd-tests/framework/src/test_vm/mod.rs
line = 772
path = phd_tests::migrate::from_base::can_migrate_from_base
target = phd_framework::test_vm
vm = migration_from_base
vm_id = 12a2ab03-0365-4de1-a299-311233471415
|
322 | 2025-03-10T23:11:02.076Z | INFO | phd-runner: [WAIT_FOR_SERIAL_OUTPUT - START]
file = phd-tests/framework/src/test_vm/mod.rs
line = 772
path = phd_tests::migrate::from_base::can_migrate_from_base
target = phd_framework::test_vm
vm = migration_from_base
vm_id = 12a2ab03-0365-4de1-a299-311233471415
|
323 | 2025-03-10T23:11:02.076Z | INFO | phd-runner: [WAIT_FOR_SERIAL_OUTPUT - EVENT] Waiting for output on serial console
file = phd-tests/framework/src/test_vm/mod.rs
line = 779
path = phd_tests::migrate::from_base::can_migrate_from_base
target = phd_framework::test_vm
timeout_duration = Explicit(300s)
vm = migration_from_base
vm_id = 12a2ab03-0365-4de1-a299-311233471415
|
324 | 2025-03-10T23:11:02.109Z | INFO | phd-runner: [WAIT_FOR_SERIAL_OUTPUT - END]
elapsed_milliseconds = 32
file = phd-tests/framework/src/test_vm/mod.rs
line = 772
path = phd_tests::migrate::from_base::can_migrate_from_base
target = phd_framework::test_vm
vm = migration_from_base
vm_id = 12a2ab03-0365-4de1-a299-311233471415
|
325 | 2025-03-10T23:11:02.109Z | INFO | phd-runner: [WAIT_FOR_SERIAL_OUTPUT - START]
file = phd-tests/framework/src/test_vm/mod.rs
line = 772
path = phd_tests::migrate::from_base::can_migrate_from_base
target = phd_framework::test_vm
vm = migration_from_base
vm_id = 12a2ab03-0365-4de1-a299-311233471415
|
326 | 2025-03-10T23:11:02.109Z | INFO | phd-runner: [WAIT_FOR_SERIAL_OUTPUT - EVENT] Waiting for output on serial console
file = phd-tests/framework/src/test_vm/mod.rs
line = 779
path = phd_tests::migrate::from_base::can_migrate_from_base
target = phd_framework::test_vm
timeout_duration = Explicit(15s)
vm = migration_from_base
vm_id = 12a2ab03-0365-4de1-a299-311233471415
|
327 | 2025-03-10T23:11:02.119Z | INFO | phd-runner: [WAIT_FOR_SERIAL_OUTPUT - END]
elapsed_milliseconds = 10
file = phd-tests/framework/src/test_vm/mod.rs
line = 772
path = phd_tests::migrate::from_base::can_migrate_from_base
target = phd_framework::test_vm
vm = migration_from_base
vm_id = 12a2ab03-0365-4de1-a299-311233471415
|
328 | 2025-03-10T23:11:02.120Z | INFO | phd-runner: [WAIT_FOR_SERIAL_OUTPUT - START]
file = phd-tests/framework/src/test_vm/mod.rs
line = 772
path = phd_tests::migrate::from_base::can_migrate_from_base
target = phd_framework::test_vm
vm = migration_from_base
vm_id = 12a2ab03-0365-4de1-a299-311233471415
|
329 | 2025-03-10T23:11:02.120Z | INFO | phd-runner: [WAIT_FOR_SERIAL_OUTPUT - EVENT] Waiting for output on serial console
file = phd-tests/framework/src/test_vm/mod.rs
line = 779
path = phd_tests::migrate::from_base::can_migrate_from_base
target = phd_framework::test_vm
timeout_duration = Explicit(300s)
vm = migration_from_base
vm_id = 12a2ab03-0365-4de1-a299-311233471415
|
330 | 2025-03-10T23:11:02.142Z | INFO | phd-runner: [WAIT_FOR_SERIAL_OUTPUT - END]
elapsed_milliseconds = 22
file = phd-tests/framework/src/test_vm/mod.rs
line = 772
path = phd_tests::migrate::from_base::can_migrate_from_base
target = phd_framework::test_vm
vm = migration_from_base
vm_id = 12a2ab03-0365-4de1-a299-311233471415
|
331 | 2025-03-10T23:11:02.142Z | INFO | phd-runner: [TEST - EVENT] migrating to new Propolis artifact for lifecycle test
file = phd-tests/framework/src/lifecycle.rs
line = 73
path = phd_tests::migrate::from_base::can_migrate_from_base
propolis_artifact = __DEFAULT_PROPOLIS
target = phd_framework::lifecycle
vm_name = migration_from_base
|
332 | 2025-03-10T23:11:02.143Z | INFO | phd-runner: [NEW - START]
file = phd-tests/framework/src/test_vm/mod.rs
line = 193
path = phd_tests::migrate::from_base::can_migrate_from_base
target = phd_framework::test_vm
|
333 | 2025-03-10T23:11:02.143Z | INFO | phd-runner: [NEW - EVENT] phd_framework::test_vm
environment = EnvironmentSpec { location: Local, propolis_artifact: "__DEFAULT_PROPOLIS" }
file = phd-tests/framework/src/test_vm/mod.rs
guest_os_kind = Alpine
line = 211
path = phd_tests::migrate::from_base::can_migrate_from_base
target = phd_framework::test_vm
vm_name = migration_from_base_lifecycle_0
|
334 | 2025-03-10T23:11:02.143Z | DEBG | phd-runner: [NEW - EVENT] Verified artifact already exists
file = phd-tests/framework/src/artifacts/store.rs
line = 45
path = /work/phd-test/propolis-server
target = phd_framework::artifacts::store
|
335 | 2025-03-10T23:11:02.143Z | INFO | phd-runner: [NEW - EVENT] Launching Propolis server
bootrom_path = "/phd-artifacts/29813374b58e3b77fb665f2d95cb3bab37d44fdd2c4fce2a70de9d76a3512a4f/OVMF_CODE.fd"
file = phd-tests/framework/src/test_vm/server.rs
line = 55
path = phd_tests::migrate::from_base::can_migrate_from_base
server_addr = 127.0.0.1:9002
server_path = "/work/phd-test/propolis-server"
target = phd_framework::test_vm::server
|
336 | 2025-03-10T23:11:02.143Z | INFO | phd-runner: [NEW - EVENT] Opening server log files
file = phd-tests/framework/src/server_log_mode.rs
line = 64
path = phd_tests::migrate::from_base::can_migrate_from_base
stderr_path = "/tmp/propolis-phd/migration_from_base_lifecycle_0.stderr.log"
stdout_path = "/tmp/propolis-phd/migration_from_base_lifecycle_0.stdout.log"
target = phd_framework::server_log_mode
|
337 | 2025-03-10T23:11:02.158Z | INFO | phd-runner: [NEW - EVENT] Launched server with pid 893
file = phd-tests/framework/src/test_vm/server.rs
line = 107
path = phd_tests::migrate::from_base::can_migrate_from_base
target = phd_framework::test_vm::server
|
338 | 2025-03-10T23:11:02.158Z | INFO | phd-runner: [NEW - END]
elapsed_milliseconds = 15
file = phd-tests/framework/src/test_vm/mod.rs
line = 193
path = phd_tests::migrate::from_base::can_migrate_from_base
target = phd_framework::test_vm
|
339 | 2025-03-10T23:11:02.158Z | INFO | phd-runner: [MIGRATE_FROM - START]
file = phd-tests/framework/src/test_vm/mod.rs
line = 474
path = phd_tests::migrate::from_base::can_migrate_from_base
source = migration_from_base
source_id = 12a2ab03-0365-4de1-a299-311233471415
target = phd_framework::test_vm
target_id = ec6eeac3-084b-48f4-a2a4-94c6d4d5e409
|
340 | 2025-03-10T23:11:02.158Z | INFO | phd-runner: [MIGRATE_FROM - EVENT] Migrating from source at address 127.0.0.1:9000
file = phd-tests/framework/src/test_vm/mod.rs
line = 507
migration_id = bd390dcb-630e-4e4b-a225-e907a356881c
path = phd_tests::migrate::from_base::can_migrate_from_base
source = migration_from_base
source_id = 12a2ab03-0365-4de1-a299-311233471415
target = phd_framework::test_vm
target_id = ec6eeac3-084b-48f4-a2a4-94c6d4d5e409
timeout_duration = 45s
|
341 | 2025-03-10T23:11:02.158Z | INFO | phd-runner: [INSTANCE_ENSURE_INTERNAL - START]
file = phd-tests/framework/src/test_vm/mod.rs
line = 276
path = phd_tests::migrate::from_base::can_migrate_from_base
source = migration_from_base
source_id = 12a2ab03-0365-4de1-a299-311233471415
target = phd_framework::test_vm
target_id = ec6eeac3-084b-48f4-a2a4-94c6d4d5e409
vm = migration_from_base_lifecycle_0
vm_id = ec6eeac3-084b-48f4-a2a4-94c6d4d5e409
|
342 | 2025-03-10T23:11:02.159Z | INFO | phd-runner: [INSTANCE_ENSURE_INTERNAL - EVENT] retriable error from instance_spec_ensure
e = Communication Error: error sending request for url (http://127.0.0.1:9002/instance)
file = phd-tests/framework/src/test_vm/mod.rs
line = 320
path = phd_tests::migrate::from_base::can_migrate_from_base
source = migration_from_base
source_id = 12a2ab03-0365-4de1-a299-311233471415
target = phd_framework::test_vm
target_id = ec6eeac3-084b-48f4-a2a4-94c6d4d5e409
vm = migration_from_base_lifecycle_0
vm_id = ec6eeac3-084b-48f4-a2a4-94c6d4d5e409
|
343 | 2025-03-10T23:11:02.852Z | INFO | phd-runner: [INSTANCE_ENSURE_INTERNAL - EVENT] Started instance
file = phd-tests/framework/src/test_vm/mod.rs
instance_description.instance = Instance { properties: InstanceProperties { description: "Pheidippides-managed VM", id: ec6eeac3-084b-48f4-a2a4-94c6d4d5e409, metadata: InstanceMetadata { project_id: b51cfd82-859b-41d3-8cf1-c64a22b8bc2e, silo_id: b28dc360-1f77-4cb4-9cf9-c534106f9384, sled_id: 1c59a193-1a27-460e-ad0a-311a16a89ca6, sled_model: "pheidippes", sled_revision: 1, sled_serial: "1c59a193-1a27-460e-ad0a-311a16a89ca6" }, name: "phd-vm-ec6eeac3-084b-48f4-a2a4-94c6d4d5e409" }, state: Migrating }
line = 379
path = phd_tests::migrate::from_base::can_migrate_from_base
source = migration_from_base
source_id = 12a2ab03-0365-4de1-a299-311233471415
target = phd_framework::test_vm
target_id = ec6eeac3-084b-48f4-a2a4-94c6d4d5e409
vm = migration_from_base_lifecycle_0
vm_id = ec6eeac3-084b-48f4-a2a4-94c6d4d5e409
|
344 | 2025-03-10T23:11:02.853Z | INFO | phd-runner: [INSTANCE_ENSURE_INTERNAL - END]
elapsed_milliseconds = 694
file = phd-tests/framework/src/test_vm/mod.rs
line = 276
path = phd_tests::migrate::from_base::can_migrate_from_base
source = migration_from_base
source_id = 12a2ab03-0365-4de1-a299-311233471415
target = phd_framework::test_vm
target_id = ec6eeac3-084b-48f4-a2a4-94c6d4d5e409
vm = migration_from_base_lifecycle_0
vm_id = ec6eeac3-084b-48f4-a2a4-94c6d4d5e409
|
345 | 2025-03-10T23:11:02.853Z | INFO | phd-runner: [MIGRATE - START]
file = phd-tests/framework/src/test_vm/mod.rs
line = 528
migration_id = bd390dcb-630e-4e4b-a225-e907a356881c
path = phd_tests::migrate::from_base::can_migrate_from_base
source = migration_from_base
source_id = 12a2ab03-0365-4de1-a299-311233471415
target = phd_framework::test_vm
target_id = ec6eeac3-084b-48f4-a2a4-94c6d4d5e409
|
346 | 2025-03-10T23:11:05.321Z | INFO | phd-runner: [SERIAL CONSOLE TASK - EVENT] serial socket control message
file = phd-tests/framework/src/serial/mod.rs
line = 275
s = {"Migrating":{"destination":"127.0.0.1:9002","from_start":7760}}
target = phd_framework::serial
|
347 | 2025-03-10T23:11:06.012Z | INFO | phd-runner: [MIGRATE_FROM - EVENT] Migration completed successfully
file = phd-tests/framework/src/test_vm/mod.rs
line = 541
path = phd_tests::migrate::from_base::can_migrate_from_base
source = migration_from_base
source_id = 12a2ab03-0365-4de1-a299-311233471415
target = phd_framework::test_vm
target_id = ec6eeac3-084b-48f4-a2a4-94c6d4d5e409
|
348 | 2025-03-10T23:11:06.012Z | INFO | phd-runner: [MIGRATE - END]
elapsed_milliseconds = 3159
file = phd-tests/framework/src/test_vm/mod.rs
line = 528
migration_id = bd390dcb-630e-4e4b-a225-e907a356881c
path = phd_tests::migrate::from_base::can_migrate_from_base
source = migration_from_base
source_id = 12a2ab03-0365-4de1-a299-311233471415
target = phd_framework::test_vm
target_id = ec6eeac3-084b-48f4-a2a4-94c6d4d5e409
|
349 | 2025-03-10T23:11:06.012Z | INFO | phd-runner: [MIGRATE_FROM - END]
elapsed_milliseconds = 3853
file = phd-tests/framework/src/test_vm/mod.rs
line = 474
path = phd_tests::migrate::from_base::can_migrate_from_base
source = migration_from_base
source_id = 12a2ab03-0365-4de1-a299-311233471415
target = phd_framework::test_vm
target_id = ec6eeac3-084b-48f4-a2a4-94c6d4d5e409
|
350 | 2025-03-10T23:11:06.013Z | INFO | phd-runner: [VM CLEANUP - START]
file = phd-tests/framework/src/test_vm/mod.rs
line = 1029
path = phd_tests::migrate::from_base::can_migrate_from_base
target = phd_framework::test_vm
vm = migration_from_base
vm_id = 12a2ab03-0365-4de1-a299-311233471415
|
351 | 2025-03-10T23:11:06.013Z | INFO | phd-runner: [WAIT_FOR_SERIAL_OUTPUT - START]
file = phd-tests/framework/src/test_vm/mod.rs
line = 772
path = phd_tests::migrate::from_base::can_migrate_from_base
target = phd_framework::test_vm
vm = migration_from_base_lifecycle_0
vm_id = ec6eeac3-084b-48f4-a2a4-94c6d4d5e409
|
352 | 2025-03-10T23:11:06.013Z | INFO | phd-runner: [WAIT_FOR_SERIAL_OUTPUT - EVENT] Waiting for output on serial console
file = phd-tests/framework/src/test_vm/mod.rs
line = 779
path = phd_tests::migrate::from_base::can_migrate_from_base
target = phd_framework::test_vm
timeout_duration = Explicit(15s)
vm = migration_from_base_lifecycle_0
vm_id = ec6eeac3-084b-48f4-a2a4-94c6d4d5e409
|
353 | 2025-03-10T23:11:06.014Z | DEBG | phd-runner: [VM CLEANUP - EVENT] Killing Propolis server process
file = phd-tests/framework/src/test_vm/server.rs
line = 125
path = phd_tests::migrate::from_base::can_migrate_from_base
self.address = 127.0.0.1:9000
target = phd_framework::test_vm::server
vm = migration_from_base
vm_id = 12a2ab03-0365-4de1-a299-311233471415
|
354 | 2025-03-10T23:11:06.114Z | INFO | phd-runner: [VM CLEANUP - END]
elapsed_milliseconds = 100
file = phd-tests/framework/src/test_vm/mod.rs
line = 1029
path = phd_tests::migrate::from_base::can_migrate_from_base
target = phd_framework::test_vm
vm = migration_from_base
vm_id = 12a2ab03-0365-4de1-a299-311233471415
|
355 | 2025-03-10T23:11:08.625Z | INFO | phd-runner: [WAIT_FOR_SERIAL_OUTPUT - END]
elapsed_milliseconds = 2611
file = phd-tests/framework/src/test_vm/mod.rs
line = 772
path = phd_tests::migrate::from_base::can_migrate_from_base
target = phd_framework::test_vm
vm = migration_from_base_lifecycle_0
vm_id = ec6eeac3-084b-48f4-a2a4-94c6d4d5e409
|
356 | 2025-03-10T23:11:08.625Z | INFO | phd-runner: [WAIT_FOR_SERIAL_OUTPUT - START]
file = phd-tests/framework/src/test_vm/mod.rs
line = 772
path = phd_tests::migrate::from_base::can_migrate_from_base
target = phd_framework::test_vm
vm = migration_from_base_lifecycle_0
vm_id = ec6eeac3-084b-48f4-a2a4-94c6d4d5e409
|
357 | 2025-03-10T23:11:08.625Z | INFO | phd-runner: [WAIT_FOR_SERIAL_OUTPUT - EVENT] Waiting for output on serial console
file = phd-tests/framework/src/test_vm/mod.rs
line = 779
path = phd_tests::migrate::from_base::can_migrate_from_base
target = phd_framework::test_vm
timeout_duration = Explicit(300s)
vm = migration_from_base_lifecycle_0
vm_id = ec6eeac3-084b-48f4-a2a4-94c6d4d5e409
|
358 | 2025-03-10T23:11:08.657Z | INFO | phd-runner: [WAIT_FOR_SERIAL_OUTPUT - END]
elapsed_milliseconds = 31
file = phd-tests/framework/src/test_vm/mod.rs
line = 772
path = phd_tests::migrate::from_base::can_migrate_from_base
target = phd_framework::test_vm
vm = migration_from_base_lifecycle_0
vm_id = ec6eeac3-084b-48f4-a2a4-94c6d4d5e409
|
359 | 2025-03-10T23:11:08.657Z | INFO | phd-runner: [VM CLEANUP - START]
file = phd-tests/framework/src/test_vm/mod.rs
line = 1029
path = phd_tests::migrate::from_base::can_migrate_from_base
target = phd_framework::test_vm
vm = migration_from_base_lifecycle_0
vm_id = ec6eeac3-084b-48f4-a2a4-94c6d4d5e409
|
360 | 2025-03-10T23:11:08.657Z | DEBG | phd-runner: [SERIAL CONSOLE TASK - EVENT] serial console command channel was closed
file = phd-tests/framework/src/serial/mod.rs
line = 213
target = phd_framework::serial
|
361 | 2025-03-10T23:11:08.658Z | INFO | phd-runner: [SERIAL CONSOLE TASK - END]
elapsed_milliseconds = 10876
file = phd-tests/framework/src/serial/mod.rs
line = 200
target = phd_framework::serial
|
362 | 2025-03-10T23:11:08.658Z | INFO | phd-runner: test phd_tests::migrate::from_base::can_migrate_from_base ... ok
file = phd-tests/runner/src/execute.rs
line = 129
target = phd_runner::execute
|
363 | 2025-03-10T23:11:08.658Z | INFO | phd-runner: [TEST_CLEANUP - START]
file = phd-tests/runner/src/fixtures.rs
line = 51
target = phd_runner::fixtures
|
364 | 2025-03-10T23:11:08.658Z | DEBG | phd-runner: [VM CLEANUP - EVENT] trying to ensure Propolis server VM is destroyed
file = phd-tests/framework/src/test_vm/mod.rs
line = 1052
path = phd_tests::migrate::from_base::can_migrate_from_base
target = phd_framework::test_vm
vm = migration_from_base_lifecycle_0
vm_id = ec6eeac3-084b-48f4-a2a4-94c6d4d5e409
|
365 | 2025-03-10T23:11:09.335Z | DEBG | phd-runner: [VM CLEANUP - EVENT] Killing Propolis server process
file = phd-tests/framework/src/test_vm/server.rs
line = 125
path = phd_tests::migrate::from_base::can_migrate_from_base
self.address = 127.0.0.1:9002
target = phd_framework::test_vm::server
vm = migration_from_base_lifecycle_0
vm_id = ec6eeac3-084b-48f4-a2a4-94c6d4d5e409
|
366 | 2025-03-10T23:11:09.437Z | DEBG | phd-runner: [VM CLEANUP - EVENT] zfs clone dropped
file = phd-tests/framework/src/zfs.rs
line = 83
path = phd_tests::migrate::from_base::can_migrate_from_base
target = phd_framework::zfs
vm = migration_from_base_lifecycle_0
vm_id = ec6eeac3-084b-48f4-a2a4-94c6d4d5e409
|
367 | 2025-03-10T23:11:09.437Z | DEBG | phd-runner: [VM CLEANUP - EVENT] executing ZFS command
args = ["phd-artifacts/phd-clone-543c0442-0b98-4f5a-aa66-40da569a894a"]
file = phd-tests/framework/src/zfs.rs
line = 304
path = phd_tests::migrate::from_base::can_migrate_from_base
target = phd_framework::zfs
verb = destroy
vm = migration_from_base_lifecycle_0
vm_id = ec6eeac3-084b-48f4-a2a4-94c6d4d5e409
|
368 | 2025-03-10T23:11:09.471Z | DEBG | phd-runner: [VM CLEANUP - EVENT] zfs snapshot dropped
file = phd-tests/framework/src/zfs.rs
line = 57
path = phd_tests::migrate::from_base::can_migrate_from_base
target = phd_framework::zfs
vm = migration_from_base_lifecycle_0
vm_id = ec6eeac3-084b-48f4-a2a4-94c6d4d5e409
|
369 | 2025-03-10T23:11:09.471Z | DEBG | phd-runner: [VM CLEANUP - EVENT] executing ZFS command
args = ["phd-artifacts@phd-7c7bf509-b8de-4337-b3d5-54a43c0edf9c"]
file = phd-tests/framework/src/zfs.rs
line = 304
path = phd_tests::migrate::from_base::can_migrate_from_base
target = phd_framework::zfs
verb = destroy
vm = migration_from_base_lifecycle_0
vm_id = ec6eeac3-084b-48f4-a2a4-94c6d4d5e409
|
370 | 2025-03-10T23:11:09.495Z | INFO | phd-runner: [VM CLEANUP - END]
elapsed_milliseconds = 838
file = phd-tests/framework/src/test_vm/mod.rs
line = 1029
path = phd_tests::migrate::from_base::can_migrate_from_base
target = phd_framework::test_vm
vm = migration_from_base_lifecycle_0
vm_id = ec6eeac3-084b-48f4-a2a4-94c6d4d5e409
|
371 | 2025-03-10T23:11:09.496Z | INFO | phd-runner: [TEST - END]
elapsed_milliseconds = 12567
file = phd-tests/tests/src/migrate.rs
line = 34
path = phd_tests::migrate::from_base::can_migrate_from_base
target = phd_tests::migrate::from_base
|
372 | 2025-03-10T23:11:09.496Z | INFO | phd-runner: [TEST_CLEANUP - END]
elapsed_milliseconds = 837
file = phd-tests/runner/src/fixtures.rs
line = 51
target = phd_runner::fixtures
|
373 | 2025-03-10T23:11:09.496Z | INFO | phd-runner: [EXECUTION_CLEANUP - START]
file = phd-tests/runner/src/fixtures.rs
line = 35
target = phd_runner::fixtures
|
374 | 2025-03-10T23:11:09.496Z | INFO | phd-runner: [EXECUTION_CLEANUP - END]
elapsed_milliseconds = 0
file = phd-tests/runner/src/fixtures.rs
line = 35
target = phd_runner::fixtures
|
375 | | test result: ok. 3 passed; 0 failed; 0 skipped; 0 not run; finished in 113.22s |
376 | | |
377 | 2025-03-10T23:11:09.496Z | DEBG | phd-runner: phd_runner
exit_code = 0
file = phd-tests/runner/src/main.rs
line = 40
target = phd_runner
|