1 | 2025-03-14T00:47:59.914Z | INFO | phd-runner: phd_runner
file = phd-tests/runner/src/main.rs
line = 35
runner_args = ProcessArgs { command: Run(RunOptions { propolis_server_cmd: "/work/phd-test/propolis-server", base_propolis_branch: Some("master"), base_propolis_commit: None, base_propolis_cmd: None, crucible_downstairs_cmd: None, crucible_downstairs_commit: Some(Auto), tmp_directory: "/tmp/propolis-phd", artifact_directory: Some("/phd-artifacts"), server_logging_mode: TmpFile, default_guest_cpus: 2, default_guest_memory_mib: 512, artifact_toml_path: "/work/phd-test/artifacts.toml", default_guest_artifact: "alpine", default_bootrom_artifact: "ovmf", include_filter: ["phd_tests::migrate::from_base"], exclude_filter: [], max_buildomat_wait_secs: 1200 }), disable_ansi: false, emit_bunyan: true }
target = phd_runner
|
2 | 2025-03-14T00:47:59.917Z | DEBG | phd-runner: Created new artifact store from manifest
file = phd-tests/framework/src/artifacts/store.rs
line = 221
store = Store { local_dir: "/phd-artifacts", artifacts: {"alpine": Mutex { data: StoredArtifact { description: Artifact { filename: "alpine.iso", kind: GuestOs(Alpine), source: RemoteServer { sha256: "ba8007f74f9b54fbae3b2520da577831b4834778a498d732f091260c61aa7ca1" }, untar: None }, cached_path: None } }, "ovmf": Mutex { data: StoredArtifact { description: Artifact { filename: "OVMF_CODE.fd", kind: Bootrom, source: Buildomat(BuildomatArtifact { repo: Repo("oxidecomputer/edk2"), series: Series("image_debug"), commit: Commit("6d92acf0a22718dd4175d7c64dbcf7aaec3740bd"), sha256: "29813374b58e3b77fb665f2d95cb3bab37d44fdd2c4fce2a70de9d76a3512a4f" }), untar: None }, cached_path: None } }}, downloader: DownloadConfig { timeout: 600s, buildomat_backoff: ExponentialBackoff { current_interval: 1s, initial_interval: 1s, randomization_factor: 0.5, multiplier: 1.5, max_interval: 60s, start_time: Instant { tv_sec: 210, tv_nsec: 977241578 }, max_elapsed_time: Some(1200s), clock: SystemClock }, remote_server_uris: ["https://oxide-omicron-build.s3.amazonaws.com"] } }
target = phd_framework::artifacts::store
|
3 | 2025-03-14T00:47:59.917Z | INFO | phd-runner: Adding Propolis server from local command
file = phd-tests/framework/src/artifacts/store.rs
line = 229
propolis_server_cmd = /work/phd-test/propolis-server
target = phd_framework::artifacts::store
|
4 | 2025-03-14T00:47:59.917Z | INFO | phd-runner: Adding crucible-downstairs from Buildomat Git revision
commit = d2d8f8ad449df7e2befb7ee2723a442dd74b9b72
file = phd-tests/framework/src/artifacts/store.rs
line = 313
target = phd_framework::artifacts::store
|
5 | 2025-03-14T00:47:59.917Z | DEBG | phd-runner: Downloading file from Buildomat...
file = phd-tests/framework/src/artifacts/buildomat.rs
line = 215
target = phd_framework::artifacts::buildomat
timeout = 600s
uri = https://buildomat.eng.oxide.computer/public/file/oxidecomputer/crucible/nightly-image/d2d8f8ad449df7e2befb7ee2723a442dd74b9b72/crucible-nightly.sha256.txt
|
6 | 2025-03-14T00:48:00.062Z | INFO | phd-runner: Adding 'current' Propolis server from Buildomat Git branch 'master'
file = phd-tests/framework/src/artifacts/store.rs
line = 250
target = phd_framework::artifacts::store
|
7 | 2025-03-14T00:48:00.514Z | DEBG | phd-runner: Downloading file from Buildomat...
file = phd-tests/framework/src/artifacts/buildomat.rs
line = 215
target = phd_framework::artifacts::buildomat
timeout = 600s
uri = https://buildomat.eng.oxide.computer/public/file/oxidecomputer/propolis/phd_build/7cd7c8809f12d610d8a2e114fd72c8c8ff00fe0c/propolis-server.sha256.txt
|
8 | 2025-03-14T00:48:00.636Z | INFO | phd-runner: [EXECUTION_SETUP - START]
file = phd-tests/runner/src/fixtures.rs
line = 25
target = phd_runner::fixtures
|
9 | 2025-03-14T00:48:00.636Z | INFO | phd-runner: [EXECUTION_SETUP - END]
elapsed_milliseconds = 0
file = phd-tests/runner/src/fixtures.rs
line = 25
target = phd_runner::fixtures
|
10 | 2025-03-14T00:48:00.636Z | INFO | phd-runner: Running 3 test(s)
file = phd-tests/runner/src/execute.rs
line = 82
target = phd_runner::execute
|
11 | 2025-03-14T00:48:00.636Z | INFO | phd-runner: Starting test phd_tests::migrate::from_base::migration_from_base_and_back
file = phd-tests/runner/src/execute.rs
line = 90
target = phd_runner::execute
|
12 | 2025-03-14T00:48:00.636Z | INFO | phd-runner: [TEST_SETUP - START]
file = phd-tests/runner/src/fixtures.rs
line = 41
target = phd_runner::fixtures
|
13 | 2025-03-14T00:48:00.636Z | INFO | phd-runner: [TEST_SETUP - END]
elapsed_milliseconds = 0
file = phd-tests/runner/src/fixtures.rs
line = 41
target = phd_runner::fixtures
|
14 | 2025-03-14T00:48:00.636Z | INFO | phd-runner: [TEST - START]
file = phd-tests/tests/src/migrate.rs
line = 52
path = phd_tests::migrate::from_base::migration_from_base_and_back
target = phd_tests::migrate::from_base
|
15 | 2025-03-14T00:48:00.637Z | DEBG | phd-runner: [TEST - EVENT] checking for existing copy of artifact
file = phd-tests/framework/src/artifacts/store.rs
line = 89
maybe_path = /phd-artifacts/29813374b58e3b77fb665f2d95cb3bab37d44fdd2c4fce2a70de9d76a3512a4f/OVMF_CODE.fd
path = phd_tests::migrate::from_base::migration_from_base_and_back
target = phd_framework::artifacts::store
|
16 | 2025-03-14T00:48:00.637Z | DEBG | phd-runner: [TEST - EVENT] Downloading file from Buildomat...
file = phd-tests/framework/src/artifacts/buildomat.rs
line = 215
path = phd_tests::migrate::from_base::migration_from_base_and_back
target = phd_framework::artifacts::buildomat
timeout = 600s
uri = https://buildomat.eng.oxide.computer/public/file/oxidecomputer/edk2/image_debug/6d92acf0a22718dd4175d7c64dbcf7aaec3740bd/OVMF_CODE.fd
|
17 | 2025-03-14T00:48:01.276Z | DEBG | phd-runner: [TEST - EVENT] checking for existing copy of artifact
file = phd-tests/framework/src/artifacts/store.rs
line = 89
maybe_path = /phd-artifacts/ba8007f74f9b54fbae3b2520da577831b4834778a498d732f091260c61aa7ca1/alpine.iso
path = phd_tests::migrate::from_base::migration_from_base_and_back
target = phd_framework::artifacts::store
|
18 | 2025-03-14T00:48:01.276Z | DEBG | phd-runner: [TEST - EVENT] Downloading alpine.iso from https://oxide-omicron-build.s3.amazonaws.com/alpine.iso
file = phd-tests/framework/src/artifacts/store.rs
line = 621
path = phd_tests::migrate::from_base::migration_from_base_and_back
target = phd_framework::artifacts::store
timeout = 600s
|
19 | 2025-03-14T00:48:35.492Z | DEBG | phd-runner: [TEST - EVENT] Verified artifact already exists
file = phd-tests/framework/src/artifacts/store.rs
line = 45
path = /phd-artifacts/ba8007f74f9b54fbae3b2520da577831b4834778a498d732f091260c61aa7ca1/alpine.iso
target = phd_framework::artifacts::store
|
20 | 2025-03-14T00:48:35.492Z | DEBG | phd-runner: [TEST - EVENT] executing ZFS command
args = ["/phd-artifacts/ba8007f74f9b54fbae3b2520da577831b4834778a498d732f091260c61aa7ca1/alpine.iso"]
file = phd-tests/framework/src/zfs.rs
line = 304
path = phd_tests::migrate::from_base::migration_from_base_and_back
target = phd_framework::zfs
verb = list
|
21 | 2025-03-14T00:48:35.522Z | DEBG | phd-runner: [TEST - EVENT] parsing zfs list output
file = phd-tests/framework/src/zfs.rs
line = 238
path = phd_tests::migrate::from_base::migration_from_base_and_back
stdout = NAME USED AVAIL REFER MOUNTPOINT\nphd-artifacts 2.00M 1.80T 1.91M /phd-artifacts\n
target = phd_framework::zfs
|
22 | 2025-03-14T00:48:35.522Z | DEBG | phd-runner: [TEST - EVENT] executing ZFS command
args = ["phd-artifacts@phd-0bacc304-06d6-4011-9f15-5376c04f56d4"]
file = phd-tests/framework/src/zfs.rs
line = 304
path = phd_tests::migrate::from_base::migration_from_base_and_back
target = phd_framework::zfs
verb = snapshot
|
23 | 2025-03-14T00:48:35.575Z | DEBG | phd-runner: [TEST - EVENT] executing ZFS command
args = ["phd-artifacts@phd-0bacc304-06d6-4011-9f15-5376c04f56d4", "phd-artifacts/phd-clone-de0bc56f-ca6e-4bec-b1f8-aed084c0be6e"]
file = phd-tests/framework/src/zfs.rs
line = 304
path = phd_tests::migrate::from_base::migration_from_base_and_back
target = phd_framework::zfs
verb = clone
|
24 | 2025-03-14T00:48:35.593Z | DEBG | phd-runner: [TEST - EVENT] executing ZFS command
args = ["phd-artifacts/phd-clone-de0bc56f-ca6e-4bec-b1f8-aed084c0be6e"]
file = phd-tests/framework/src/zfs.rs
line = 304
path = phd_tests::migrate::from_base::migration_from_base_and_back
target = phd_framework::zfs
verb = list
|
25 | 2025-03-14T00:48:35.604Z | DEBG | phd-runner: [TEST - EVENT] parsing zfs list output
file = phd-tests/framework/src/zfs.rs
line = 238
path = phd_tests::migrate::from_base::migration_from_base_and_back
stdout = NAME USED AVAIL REFER MOUNTPOINT\nphd-artifacts/phd-clone-de0bc56f-ca6e-4bec-b1f8-aed084c0be6e 0B 1.80T 48.9M /phd-artifacts/phd-clone-de0bc56f-ca6e-4bec-b1f8-aed084c0be6e\n
target = phd_framework::zfs
|
26 | 2025-03-14T00:48:35.605Z | INFO | phd-runner: [NEW - START]
file = phd-tests/framework/src/test_vm/mod.rs
line = 193
path = phd_tests::migrate::from_base::migration_from_base_and_back
target = phd_framework::test_vm
|
27 | 2025-03-14T00:48:35.605Z | INFO | phd-runner: [NEW - EVENT] phd_framework::test_vm
environment = EnvironmentSpec { location: Local, propolis_artifact: "__BASE_PROPOLIS" }
file = phd-tests/framework/src/test_vm/mod.rs
guest_os_kind = Alpine
line = 211
path = phd_tests::migrate::from_base::migration_from_base_and_back
target = phd_framework::test_vm
vm_name = migration_from_base_and_back
|
28 | 2025-03-14T00:48:35.605Z | DEBG | phd-runner: [NEW - EVENT] checking for existing copy of artifact
file = phd-tests/framework/src/artifacts/store.rs
line = 89
maybe_path = /phd-artifacts/0adadba9bdfab04f2219dad7818a591829214061ec05b3ed2b348eaf75b5a5a5/propolis-server.tar.gz
path = phd_tests::migrate::from_base::migration_from_base_and_back
target = phd_framework::artifacts::store
|
29 | 2025-03-14T00:48:35.605Z | DEBG | phd-runner: [NEW - EVENT] Downloading file from Buildomat...
file = phd-tests/framework/src/artifacts/buildomat.rs
line = 215
path = phd_tests::migrate::from_base::migration_from_base_and_back
target = phd_framework::artifacts::buildomat
timeout = 600s
uri = https://buildomat.eng.oxide.computer/public/file/oxidecomputer/propolis/phd_build/7cd7c8809f12d610d8a2e114fd72c8c8ff00fe0c/propolis-server.tar.gz
|
30 | 2025-03-14T00:49:00.581Z | DEBG | phd-runner: [NEW - EVENT] Extracting artifact from tarball
extracted_path = /phd-artifacts/0adadba9bdfab04f2219dad7818a591829214061ec05b3ed2b348eaf75b5a5a5/propolis-server
file = phd-tests/framework/src/artifacts/store.rs
line = 162
path = phd_tests::migrate::from_base::migration_from_base_and_back
target = phd_framework::artifacts::store
untar_path = propolis-server
|
31 | 2025-03-14T00:49:00.581Z | DEBG | phd-runner: [NEW - EVENT] Extracting gzipped tarball...
file = phd-tests/framework/src/artifacts/store.rs
line = 521
path = phd_tests::migrate::from_base::migration_from_base_and_back
target = phd_framework::artifacts::store
|
32 | 2025-03-14T00:49:13.452Z | INFO | phd-runner: [NEW - EVENT] Launching Propolis server
bootrom_path = "/phd-artifacts/29813374b58e3b77fb665f2d95cb3bab37d44fdd2c4fce2a70de9d76a3512a4f/OVMF_CODE.fd"
file = phd-tests/framework/src/test_vm/server.rs
line = 55
path = phd_tests::migrate::from_base::migration_from_base_and_back
server_addr = 127.0.0.1:9000
server_path = "/phd-artifacts/0adadba9bdfab04f2219dad7818a591829214061ec05b3ed2b348eaf75b5a5a5/propolis-server"
target = phd_framework::test_vm::server
|
33 | 2025-03-14T00:49:13.452Z | INFO | phd-runner: [NEW - EVENT] Opening server log files
file = phd-tests/framework/src/server_log_mode.rs
line = 64
path = phd_tests::migrate::from_base::migration_from_base_and_back
stderr_path = "/tmp/propolis-phd/migration_from_base_and_back.stderr.log"
stdout_path = "/tmp/propolis-phd/migration_from_base_and_back.stdout.log"
target = phd_framework::server_log_mode
|
34 | 2025-03-14T00:49:13.501Z | INFO | phd-runner: [NEW - EVENT] Launched server with pid 868
file = phd-tests/framework/src/test_vm/server.rs
line = 107
path = phd_tests::migrate::from_base::migration_from_base_and_back
target = phd_framework::test_vm::server
|
35 | 2025-03-14T00:49:13.502Z | INFO | phd-runner: [NEW - END]
elapsed_milliseconds = 37896
file = phd-tests/framework/src/test_vm/mod.rs
line = 193
path = phd_tests::migrate::from_base::migration_from_base_and_back
target = phd_framework::test_vm
|
36 | 2025-03-14T00:49:13.502Z | INFO | phd-runner: [INSTANCE_ENSURE_INTERNAL - START]
file = phd-tests/framework/src/test_vm/mod.rs
line = 276
path = phd_tests::migrate::from_base::migration_from_base_and_back
target = phd_framework::test_vm
vm = migration_from_base_and_back
vm_id = acc5af82-ba37-4009-b92d-5761691e451c
|
37 | 2025-03-14T00:49:13.503Z | INFO | phd-runner: [INSTANCE_ENSURE_INTERNAL - EVENT] retriable error from instance_spec_ensure
e = Communication Error: error sending request for url (http://127.0.0.1:9000/instance)
file = phd-tests/framework/src/test_vm/mod.rs
line = 320
path = phd_tests::migrate::from_base::migration_from_base_and_back
target = phd_framework::test_vm
vm = migration_from_base_and_back
vm_id = acc5af82-ba37-4009-b92d-5761691e451c
|
38 | 2025-03-14T00:49:14.039Z | INFO | phd-runner: [SERIAL CONSOLE TASK - START]
file = phd-tests/framework/src/serial/mod.rs
line = 200
target = phd_framework::serial
|
39 | 2025-03-14T00:49:14.040Z | INFO | phd-runner: [INSTANCE_ENSURE_INTERNAL - EVENT] Started instance
file = phd-tests/framework/src/test_vm/mod.rs
instance_description.instance = Instance { properties: InstanceProperties { description: "Pheidippides-managed VM", id: acc5af82-ba37-4009-b92d-5761691e451c, metadata: InstanceMetadata { project_id: e22c578f-3bc0-422f-8f85-2e597088a5f8, silo_id: 14c6f704-6a24-438e-82ad-2854bf497d66, sled_id: 23fc9625-0420-4279-b8e3-948b4c17dde5, sled_model: "pheidippes", sled_revision: 1, sled_serial: "23fc9625-0420-4279-b8e3-948b4c17dde5" }, name: "phd-vm-acc5af82-ba37-4009-b92d-5761691e451c" }, state: Creating }
line = 379
path = phd_tests::migrate::from_base::migration_from_base_and_back
target = phd_framework::test_vm
vm = migration_from_base_and_back
vm_id = acc5af82-ba37-4009-b92d-5761691e451c
|
40 | 2025-03-14T00:49:14.040Z | INFO | phd-runner: [INSTANCE_ENSURE_INTERNAL - END]
elapsed_milliseconds = 538
file = phd-tests/framework/src/test_vm/mod.rs
line = 276
path = phd_tests::migrate::from_base::migration_from_base_and_back
target = phd_framework::test_vm
vm = migration_from_base_and_back
vm_id = acc5af82-ba37-4009-b92d-5761691e451c
|
41 | 2025-03-14T00:49:14.040Z | INFO | phd-runner: [PUT_INSTANCE_STATE - START]
file = phd-tests/framework/src/test_vm/mod.rs
line = 440
path = phd_tests::migrate::from_base::migration_from_base_and_back
target = phd_framework::test_vm
vm = migration_from_base_and_back
vm_id = acc5af82-ba37-4009-b92d-5761691e451c
|
42 | 2025-03-14T00:49:14.040Z | INFO | phd-runner: [PUT_INSTANCE_STATE - EVENT] Requesting instance state change
file = phd-tests/framework/src/test_vm/mod.rs
line = 445
path = phd_tests::migrate::from_base::migration_from_base_and_back
state = Run
target = phd_framework::test_vm
vm = migration_from_base_and_back
vm_id = acc5af82-ba37-4009-b92d-5761691e451c
|
43 | 2025-03-14T00:49:14.041Z | INFO | phd-runner: [PUT_INSTANCE_STATE - END]
elapsed_milliseconds = 0
file = phd-tests/framework/src/test_vm/mod.rs
line = 440
path = phd_tests::migrate::from_base::migration_from_base_and_back
target = phd_framework::test_vm
vm = migration_from_base_and_back
vm_id = acc5af82-ba37-4009-b92d-5761691e451c
|
44 | 2025-03-14T00:49:14.041Z | INFO | phd-runner: [WAIT_TO_BOOT - START]
file = phd-tests/framework/src/test_vm/mod.rs
line = 757
path = phd_tests::migrate::from_base::migration_from_base_and_back
target = phd_framework::test_vm
|
45 | 2025-03-14T00:49:14.041Z | INFO | phd-runner: [WAIT_TO_BOOT - EVENT] waiting for guest to boot
file = phd-tests/framework/src/test_vm/mod.rs
line = 706
path = phd_tests::migrate::from_base::migration_from_base_and_back
target = phd_framework::test_vm
timeout_duration = 300s
vm = migration_from_base_and_back
vm_id = acc5af82-ba37-4009-b92d-5761691e451c
|
46 | 2025-03-14T00:49:14.041Z | DEBG | phd-runner: [WAIT_TO_BOOT - EVENT] executing command in boot sequence
file = phd-tests/framework/src/test_vm/mod.rs
line = 714
path = phd_tests::migrate::from_base::migration_from_base_and_back
step = WaitFor("localhost login: ")
target = phd_framework::test_vm
|
47 | 2025-03-14T00:49:14.041Z | INFO | phd-runner: [WAIT_FOR_SERIAL_OUTPUT - START]
file = phd-tests/framework/src/test_vm/mod.rs
line = 772
path = phd_tests::migrate::from_base::migration_from_base_and_back
target = phd_framework::test_vm
vm = migration_from_base_and_back
vm_id = acc5af82-ba37-4009-b92d-5761691e451c
|
48 | 2025-03-14T00:49:14.041Z | INFO | phd-runner: [WAIT_FOR_SERIAL_OUTPUT - EVENT] Waiting for output on serial console
file = phd-tests/framework/src/test_vm/mod.rs
line = 779
path = phd_tests::migrate::from_base::migration_from_base_and_back
target = phd_framework::test_vm
timeout_duration = CallerTimeout
vm = migration_from_base_and_back
vm_id = acc5af82-ba37-4009-b92d-5761691e451c
|
49 | 2025-03-14T00:49:18.326Z | INFO | phd-runner: [WAIT_FOR_SERIAL_OUTPUT - END]
elapsed_milliseconds = 4284
file = phd-tests/framework/src/test_vm/mod.rs
line = 772
path = phd_tests::migrate::from_base::migration_from_base_and_back
target = phd_framework::test_vm
vm = migration_from_base_and_back
vm_id = acc5af82-ba37-4009-b92d-5761691e451c
|
50 | 2025-03-14T00:49:18.326Z | DEBG | phd-runner: [WAIT_TO_BOOT - EVENT] executing command in boot sequence
file = phd-tests/framework/src/test_vm/mod.rs
line = 714
path = phd_tests::migrate::from_base::migration_from_base_and_back
step = WriteStr("root")
target = phd_framework::test_vm
|
51 | 2025-03-14T00:49:18.326Z | DEBG | phd-runner: [WAIT_TO_BOOT - EVENT] executing command in boot sequence
file = phd-tests/framework/src/test_vm/mod.rs
line = 714
path = phd_tests::migrate::from_base::migration_from_base_and_back
step = WaitFor("localhost:~#")
target = phd_framework::test_vm
|
52 | 2025-03-14T00:49:18.326Z | INFO | phd-runner: [WAIT_FOR_SERIAL_OUTPUT - START]
file = phd-tests/framework/src/test_vm/mod.rs
line = 772
path = phd_tests::migrate::from_base::migration_from_base_and_back
target = phd_framework::test_vm
vm = migration_from_base_and_back
vm_id = acc5af82-ba37-4009-b92d-5761691e451c
|
53 | 2025-03-14T00:49:18.326Z | INFO | phd-runner: [WAIT_FOR_SERIAL_OUTPUT - EVENT] Waiting for output on serial console
file = phd-tests/framework/src/test_vm/mod.rs
line = 779
path = phd_tests::migrate::from_base::migration_from_base_and_back
target = phd_framework::test_vm
timeout_duration = CallerTimeout
vm = migration_from_base_and_back
vm_id = acc5af82-ba37-4009-b92d-5761691e451c
|
54 | 2025-03-14T00:49:18.344Z | INFO | phd-runner: [WAIT_FOR_SERIAL_OUTPUT - END]
elapsed_milliseconds = 17
file = phd-tests/framework/src/test_vm/mod.rs
line = 772
path = phd_tests::migrate::from_base::migration_from_base_and_back
target = phd_framework::test_vm
vm = migration_from_base_and_back
vm_id = acc5af82-ba37-4009-b92d-5761691e451c
|
55 | 2025-03-14T00:49:18.344Z | DEBG | phd-runner: [WAIT_TO_BOOT - EVENT] executing command in boot sequence
file = phd-tests/framework/src/test_vm/mod.rs
line = 714
path = phd_tests::migrate::from_base::migration_from_base_and_back
step = WriteStr("stty -F `tty` cols 9999")
target = phd_framework::test_vm
|
56 | 2025-03-14T00:49:18.345Z | DEBG | phd-runner: [WAIT_TO_BOOT - EVENT] executing command in boot sequence
file = phd-tests/framework/src/test_vm/mod.rs
line = 714
path = phd_tests::migrate::from_base::migration_from_base_and_back
step = WaitFor("localhost:~#")
target = phd_framework::test_vm
|
57 | 2025-03-14T00:49:18.345Z | INFO | phd-runner: [WAIT_FOR_SERIAL_OUTPUT - START]
file = phd-tests/framework/src/test_vm/mod.rs
line = 772
path = phd_tests::migrate::from_base::migration_from_base_and_back
target = phd_framework::test_vm
vm = migration_from_base_and_back
vm_id = acc5af82-ba37-4009-b92d-5761691e451c
|
58 | 2025-03-14T00:49:18.345Z | INFO | phd-runner: [WAIT_FOR_SERIAL_OUTPUT - EVENT] Waiting for output on serial console
file = phd-tests/framework/src/test_vm/mod.rs
line = 779
path = phd_tests::migrate::from_base::migration_from_base_and_back
target = phd_framework::test_vm
timeout_duration = CallerTimeout
vm = migration_from_base_and_back
vm_id = acc5af82-ba37-4009-b92d-5761691e451c
|
59 | 2025-03-14T00:49:18.378Z | INFO | phd-runner: [WAIT_FOR_SERIAL_OUTPUT - END]
elapsed_milliseconds = 32
file = phd-tests/framework/src/test_vm/mod.rs
line = 772
path = phd_tests::migrate::from_base::migration_from_base_and_back
target = phd_framework::test_vm
vm = migration_from_base_and_back
vm_id = acc5af82-ba37-4009-b92d-5761691e451c
|
60 | 2025-03-14T00:49:18.378Z | INFO | phd-runner: [WAIT_TO_BOOT - EVENT] Guest has booted
file = phd-tests/framework/src/test_vm/mod.rs
line = 754
path = phd_tests::migrate::from_base::migration_from_base_and_back
target = phd_framework::test_vm
|
61 | 2025-03-14T00:49:18.378Z | INFO | phd-runner: [WAIT_TO_BOOT - END]
elapsed_milliseconds = 4336
file = phd-tests/framework/src/test_vm/mod.rs
line = 757
path = phd_tests::migrate::from_base::migration_from_base_and_back
target = phd_framework::test_vm
|
62 | 2025-03-14T00:49:18.378Z | INFO | phd-runner: [WAIT_FOR_SERIAL_OUTPUT - START]
file = phd-tests/framework/src/test_vm/mod.rs
line = 772
path = phd_tests::migrate::from_base::migration_from_base_and_back
target = phd_framework::test_vm
vm = migration_from_base_and_back
vm_id = acc5af82-ba37-4009-b92d-5761691e451c
|
63 | 2025-03-14T00:49:18.378Z | INFO | phd-runner: [WAIT_FOR_SERIAL_OUTPUT - EVENT] Waiting for output on serial console
file = phd-tests/framework/src/test_vm/mod.rs
line = 779
path = phd_tests::migrate::from_base::migration_from_base_and_back
target = phd_framework::test_vm
timeout_duration = Explicit(15s)
vm = migration_from_base_and_back
vm_id = acc5af82-ba37-4009-b92d-5761691e451c
|
64 | 2025-03-14T00:49:18.388Z | INFO | phd-runner: [WAIT_FOR_SERIAL_OUTPUT - END]
elapsed_milliseconds = 10
file = phd-tests/framework/src/test_vm/mod.rs
line = 772
path = phd_tests::migrate::from_base::migration_from_base_and_back
target = phd_framework::test_vm
vm = migration_from_base_and_back
vm_id = acc5af82-ba37-4009-b92d-5761691e451c
|
65 | 2025-03-14T00:49:18.389Z | INFO | phd-runner: [WAIT_FOR_SERIAL_OUTPUT - START]
file = phd-tests/framework/src/test_vm/mod.rs
line = 772
path = phd_tests::migrate::from_base::migration_from_base_and_back
target = phd_framework::test_vm
vm = migration_from_base_and_back
vm_id = acc5af82-ba37-4009-b92d-5761691e451c
|
66 | 2025-03-14T00:49:18.389Z | INFO | phd-runner: [WAIT_FOR_SERIAL_OUTPUT - EVENT] Waiting for output on serial console
file = phd-tests/framework/src/test_vm/mod.rs
line = 779
path = phd_tests::migrate::from_base::migration_from_base_and_back
target = phd_framework::test_vm
timeout_duration = Explicit(300s)
vm = migration_from_base_and_back
vm_id = acc5af82-ba37-4009-b92d-5761691e451c
|
67 | 2025-03-14T00:49:18.410Z | INFO | phd-runner: [WAIT_FOR_SERIAL_OUTPUT - END]
elapsed_milliseconds = 21
file = phd-tests/framework/src/test_vm/mod.rs
line = 772
path = phd_tests::migrate::from_base::migration_from_base_and_back
target = phd_framework::test_vm
vm = migration_from_base_and_back
vm_id = acc5af82-ba37-4009-b92d-5761691e451c
|
68 | 2025-03-14T00:49:18.410Z | INFO | phd-runner: [WAIT_FOR_SERIAL_OUTPUT - START]
file = phd-tests/framework/src/test_vm/mod.rs
line = 772
path = phd_tests::migrate::from_base::migration_from_base_and_back
target = phd_framework::test_vm
vm = migration_from_base_and_back
vm_id = acc5af82-ba37-4009-b92d-5761691e451c
|
69 | 2025-03-14T00:49:18.410Z | INFO | phd-runner: [WAIT_FOR_SERIAL_OUTPUT - EVENT] Waiting for output on serial console
file = phd-tests/framework/src/test_vm/mod.rs
line = 779
path = phd_tests::migrate::from_base::migration_from_base_and_back
target = phd_framework::test_vm
timeout_duration = Explicit(15s)
vm = migration_from_base_and_back
vm_id = acc5af82-ba37-4009-b92d-5761691e451c
|
70 | 2025-03-14T00:49:18.422Z | INFO | phd-runner: [WAIT_FOR_SERIAL_OUTPUT - END]
elapsed_milliseconds = 11
file = phd-tests/framework/src/test_vm/mod.rs
line = 772
path = phd_tests::migrate::from_base::migration_from_base_and_back
target = phd_framework::test_vm
vm = migration_from_base_and_back
vm_id = acc5af82-ba37-4009-b92d-5761691e451c
|
71 | 2025-03-14T00:49:18.422Z | INFO | phd-runner: [WAIT_FOR_SERIAL_OUTPUT - START]
file = phd-tests/framework/src/test_vm/mod.rs
line = 772
path = phd_tests::migrate::from_base::migration_from_base_and_back
target = phd_framework::test_vm
vm = migration_from_base_and_back
vm_id = acc5af82-ba37-4009-b92d-5761691e451c
|
72 | 2025-03-14T00:49:18.422Z | INFO | phd-runner: [WAIT_FOR_SERIAL_OUTPUT - EVENT] Waiting for output on serial console
file = phd-tests/framework/src/test_vm/mod.rs
line = 779
path = phd_tests::migrate::from_base::migration_from_base_and_back
target = phd_framework::test_vm
timeout_duration = Explicit(300s)
vm = migration_from_base_and_back
vm_id = acc5af82-ba37-4009-b92d-5761691e451c
|
73 | 2025-03-14T00:49:18.455Z | INFO | phd-runner: [WAIT_FOR_SERIAL_OUTPUT - END]
elapsed_milliseconds = 32
file = phd-tests/framework/src/test_vm/mod.rs
line = 772
path = phd_tests::migrate::from_base::migration_from_base_and_back
target = phd_framework::test_vm
vm = migration_from_base_and_back
vm_id = acc5af82-ba37-4009-b92d-5761691e451c
|
74 | 2025-03-14T00:49:18.455Z | INFO | phd-runner: [WAIT_FOR_SERIAL_OUTPUT - START]
file = phd-tests/framework/src/test_vm/mod.rs
line = 772
path = phd_tests::migrate::from_base::migration_from_base_and_back
target = phd_framework::test_vm
vm = migration_from_base_and_back
vm_id = acc5af82-ba37-4009-b92d-5761691e451c
|
75 | 2025-03-14T00:49:18.455Z | INFO | phd-runner: [WAIT_FOR_SERIAL_OUTPUT - EVENT] Waiting for output on serial console
file = phd-tests/framework/src/test_vm/mod.rs
line = 779
path = phd_tests::migrate::from_base::migration_from_base_and_back
target = phd_framework::test_vm
timeout_duration = Explicit(15s)
vm = migration_from_base_and_back
vm_id = acc5af82-ba37-4009-b92d-5761691e451c
|
76 | 2025-03-14T00:49:18.466Z | INFO | phd-runner: [WAIT_FOR_SERIAL_OUTPUT - END]
elapsed_milliseconds = 11
file = phd-tests/framework/src/test_vm/mod.rs
line = 772
path = phd_tests::migrate::from_base::migration_from_base_and_back
target = phd_framework::test_vm
vm = migration_from_base_and_back
vm_id = acc5af82-ba37-4009-b92d-5761691e451c
|
77 | 2025-03-14T00:49:18.467Z | INFO | phd-runner: [WAIT_FOR_SERIAL_OUTPUT - START]
file = phd-tests/framework/src/test_vm/mod.rs
line = 772
path = phd_tests::migrate::from_base::migration_from_base_and_back
target = phd_framework::test_vm
vm = migration_from_base_and_back
vm_id = acc5af82-ba37-4009-b92d-5761691e451c
|
78 | 2025-03-14T00:49:18.467Z | INFO | phd-runner: [WAIT_FOR_SERIAL_OUTPUT - EVENT] Waiting for output on serial console
file = phd-tests/framework/src/test_vm/mod.rs
line = 779
path = phd_tests::migrate::from_base::migration_from_base_and_back
target = phd_framework::test_vm
timeout_duration = Explicit(300s)
vm = migration_from_base_and_back
vm_id = acc5af82-ba37-4009-b92d-5761691e451c
|
79 | 2025-03-14T00:49:18.499Z | INFO | phd-runner: [WAIT_FOR_SERIAL_OUTPUT - END]
elapsed_milliseconds = 32
file = phd-tests/framework/src/test_vm/mod.rs
line = 772
path = phd_tests::migrate::from_base::migration_from_base_and_back
target = phd_framework::test_vm
vm = migration_from_base_and_back
vm_id = acc5af82-ba37-4009-b92d-5761691e451c
|
80 | 2025-03-14T00:49:18.500Z | INFO | phd-runner: [TEST - EVENT] migrating to new Propolis artifact for lifecycle test
file = phd-tests/framework/src/lifecycle.rs
line = 73
path = phd_tests::migrate::from_base::migration_from_base_and_back
propolis_artifact = __DEFAULT_PROPOLIS
target = phd_framework::lifecycle
vm_name = migration_from_base_and_back
|
81 | 2025-03-14T00:49:18.500Z | INFO | phd-runner: [NEW - START]
file = phd-tests/framework/src/test_vm/mod.rs
line = 193
path = phd_tests::migrate::from_base::migration_from_base_and_back
target = phd_framework::test_vm
|
82 | 2025-03-14T00:49:18.500Z | INFO | phd-runner: [NEW - EVENT] phd_framework::test_vm
environment = EnvironmentSpec { location: Local, propolis_artifact: "__DEFAULT_PROPOLIS" }
file = phd-tests/framework/src/test_vm/mod.rs
guest_os_kind = Alpine
line = 211
path = phd_tests::migrate::from_base::migration_from_base_and_back
target = phd_framework::test_vm
vm_name = migration_from_base_and_back_lifecycle_0
|
83 | 2025-03-14T00:49:18.500Z | DEBG | phd-runner: [NEW - EVENT] Examining locally-sourced artifact
file = phd-tests/framework/src/artifacts/store.rs
line = 56
path = /work/phd-test/propolis-server
sha256 = None
target = phd_framework::artifacts::store
|
84 | 2025-03-14T00:49:18.500Z | DEBG | phd-runner: [NEW - EVENT] Locally-sourced artifact is valid, caching its path
file = phd-tests/framework/src/artifacts/store.rs
line = 69
path = /work/phd-test/propolis-server
target = phd_framework::artifacts::store
|
85 | 2025-03-14T00:49:18.500Z | INFO | phd-runner: [NEW - EVENT] Launching Propolis server
bootrom_path = "/phd-artifacts/29813374b58e3b77fb665f2d95cb3bab37d44fdd2c4fce2a70de9d76a3512a4f/OVMF_CODE.fd"
file = phd-tests/framework/src/test_vm/server.rs
line = 55
path = phd_tests::migrate::from_base::migration_from_base_and_back
server_addr = 127.0.0.1:9002
server_path = "/work/phd-test/propolis-server"
target = phd_framework::test_vm::server
|
86 | 2025-03-14T00:49:18.500Z | INFO | phd-runner: [NEW - EVENT] Opening server log files
file = phd-tests/framework/src/server_log_mode.rs
line = 64
path = phd_tests::migrate::from_base::migration_from_base_and_back
stderr_path = "/tmp/propolis-phd/migration_from_base_and_back_lifecycle_0.stderr.log"
stdout_path = "/tmp/propolis-phd/migration_from_base_and_back_lifecycle_0.stdout.log"
target = phd_framework::server_log_mode
|
87 | 2025-03-14T00:49:18.517Z | INFO | phd-runner: [NEW - EVENT] Launched server with pid 869
file = phd-tests/framework/src/test_vm/server.rs
line = 107
path = phd_tests::migrate::from_base::migration_from_base_and_back
target = phd_framework::test_vm::server
|
88 | 2025-03-14T00:49:18.518Z | INFO | phd-runner: [NEW - END]
elapsed_milliseconds = 17
file = phd-tests/framework/src/test_vm/mod.rs
line = 193
path = phd_tests::migrate::from_base::migration_from_base_and_back
target = phd_framework::test_vm
|
89 | 2025-03-14T00:49:18.518Z | INFO | phd-runner: [MIGRATE_FROM - START]
file = phd-tests/framework/src/test_vm/mod.rs
line = 474
path = phd_tests::migrate::from_base::migration_from_base_and_back
source = migration_from_base_and_back
source_id = acc5af82-ba37-4009-b92d-5761691e451c
target = phd_framework::test_vm
target_id = 3feb1390-70ec-4772-a0c2-b7a42e5c6bea
|
90 | 2025-03-14T00:49:18.518Z | INFO | phd-runner: [MIGRATE_FROM - EVENT] Migrating from source at address 127.0.0.1:9000
file = phd-tests/framework/src/test_vm/mod.rs
line = 507
migration_id = dd3c4f73-6bb4-49b4-83b1-023f20116fe5
path = phd_tests::migrate::from_base::migration_from_base_and_back
source = migration_from_base_and_back
source_id = acc5af82-ba37-4009-b92d-5761691e451c
target = phd_framework::test_vm
target_id = 3feb1390-70ec-4772-a0c2-b7a42e5c6bea
timeout_duration = 45s
|
91 | 2025-03-14T00:49:18.518Z | INFO | phd-runner: [INSTANCE_ENSURE_INTERNAL - START]
file = phd-tests/framework/src/test_vm/mod.rs
line = 276
path = phd_tests::migrate::from_base::migration_from_base_and_back
source = migration_from_base_and_back
source_id = acc5af82-ba37-4009-b92d-5761691e451c
target = phd_framework::test_vm
target_id = 3feb1390-70ec-4772-a0c2-b7a42e5c6bea
vm = migration_from_base_and_back_lifecycle_0
vm_id = 3feb1390-70ec-4772-a0c2-b7a42e5c6bea
|
92 | 2025-03-14T00:49:18.519Z | INFO | phd-runner: [INSTANCE_ENSURE_INTERNAL - EVENT] retriable error from instance_spec_ensure
e = Communication Error: error sending request for url (http://127.0.0.1:9002/instance)
file = phd-tests/framework/src/test_vm/mod.rs
line = 320
path = phd_tests::migrate::from_base::migration_from_base_and_back
source = migration_from_base_and_back
source_id = acc5af82-ba37-4009-b92d-5761691e451c
target = phd_framework::test_vm
target_id = 3feb1390-70ec-4772-a0c2-b7a42e5c6bea
vm = migration_from_base_and_back_lifecycle_0
vm_id = 3feb1390-70ec-4772-a0c2-b7a42e5c6bea
|
93 | 2025-03-14T00:49:19.014Z | INFO | phd-runner: [INSTANCE_ENSURE_INTERNAL - EVENT] Started instance
file = phd-tests/framework/src/test_vm/mod.rs
instance_description.instance = Instance { properties: InstanceProperties { description: "Pheidippides-managed VM", id: 3feb1390-70ec-4772-a0c2-b7a42e5c6bea, metadata: InstanceMetadata { project_id: e22c578f-3bc0-422f-8f85-2e597088a5f8, silo_id: 14c6f704-6a24-438e-82ad-2854bf497d66, sled_id: 3b0e123a-083d-45d7-94d0-2261d9635f66, sled_model: "pheidippes", sled_revision: 1, sled_serial: "3b0e123a-083d-45d7-94d0-2261d9635f66" }, name: "phd-vm-3feb1390-70ec-4772-a0c2-b7a42e5c6bea" }, state: Migrating }
line = 379
path = phd_tests::migrate::from_base::migration_from_base_and_back
source = migration_from_base_and_back
source_id = acc5af82-ba37-4009-b92d-5761691e451c
target = phd_framework::test_vm
target_id = 3feb1390-70ec-4772-a0c2-b7a42e5c6bea
vm = migration_from_base_and_back_lifecycle_0
vm_id = 3feb1390-70ec-4772-a0c2-b7a42e5c6bea
|
94 | 2025-03-14T00:49:19.014Z | INFO | phd-runner: [INSTANCE_ENSURE_INTERNAL - END]
elapsed_milliseconds = 495
file = phd-tests/framework/src/test_vm/mod.rs
line = 276
path = phd_tests::migrate::from_base::migration_from_base_and_back
source = migration_from_base_and_back
source_id = acc5af82-ba37-4009-b92d-5761691e451c
target = phd_framework::test_vm
target_id = 3feb1390-70ec-4772-a0c2-b7a42e5c6bea
vm = migration_from_base_and_back_lifecycle_0
vm_id = 3feb1390-70ec-4772-a0c2-b7a42e5c6bea
|
95 | 2025-03-14T00:49:19.014Z | INFO | phd-runner: [MIGRATE - START]
file = phd-tests/framework/src/test_vm/mod.rs
line = 528
migration_id = dd3c4f73-6bb4-49b4-83b1-023f20116fe5
path = phd_tests::migrate::from_base::migration_from_base_and_back
source = migration_from_base_and_back
source_id = acc5af82-ba37-4009-b92d-5761691e451c
target = phd_framework::test_vm
target_id = 3feb1390-70ec-4772-a0c2-b7a42e5c6bea
|
96 | 2025-03-14T00:49:21.462Z | INFO | phd-runner: [SERIAL CONSOLE TASK - EVENT] serial socket control message
file = phd-tests/framework/src/serial/mod.rs
line = 275
s = {"Migrating":{"destination":"127.0.0.1:9002","from_start":7760}}
target = phd_framework::serial
|
97 | 2025-03-14T00:49:21.538Z | INFO | phd-runner: [MIGRATE_FROM - EVENT] Migration completed successfully
file = phd-tests/framework/src/test_vm/mod.rs
line = 541
path = phd_tests::migrate::from_base::migration_from_base_and_back
source = migration_from_base_and_back
source_id = acc5af82-ba37-4009-b92d-5761691e451c
target = phd_framework::test_vm
target_id = 3feb1390-70ec-4772-a0c2-b7a42e5c6bea
|
98 | 2025-03-14T00:49:21.538Z | INFO | phd-runner: [MIGRATE - END]
elapsed_milliseconds = 2523
file = phd-tests/framework/src/test_vm/mod.rs
line = 528
migration_id = dd3c4f73-6bb4-49b4-83b1-023f20116fe5
path = phd_tests::migrate::from_base::migration_from_base_and_back
source = migration_from_base_and_back
source_id = acc5af82-ba37-4009-b92d-5761691e451c
target = phd_framework::test_vm
target_id = 3feb1390-70ec-4772-a0c2-b7a42e5c6bea
|
99 | 2025-03-14T00:49:21.538Z | INFO | phd-runner: [MIGRATE_FROM - END]
elapsed_milliseconds = 3020
file = phd-tests/framework/src/test_vm/mod.rs
line = 474
path = phd_tests::migrate::from_base::migration_from_base_and_back
source = migration_from_base_and_back
source_id = acc5af82-ba37-4009-b92d-5761691e451c
target = phd_framework::test_vm
target_id = 3feb1390-70ec-4772-a0c2-b7a42e5c6bea
|
100 | 2025-03-14T00:49:21.539Z | INFO | phd-runner: [VM CLEANUP - START]
file = phd-tests/framework/src/test_vm/mod.rs
line = 1029
path = phd_tests::migrate::from_base::migration_from_base_and_back
target = phd_framework::test_vm
vm = migration_from_base_and_back
vm_id = acc5af82-ba37-4009-b92d-5761691e451c
|
101 | 2025-03-14T00:49:21.540Z | INFO | phd-runner: [WAIT_FOR_SERIAL_OUTPUT - START]
file = phd-tests/framework/src/test_vm/mod.rs
line = 772
path = phd_tests::migrate::from_base::migration_from_base_and_back
target = phd_framework::test_vm
vm = migration_from_base_and_back_lifecycle_0
vm_id = 3feb1390-70ec-4772-a0c2-b7a42e5c6bea
|
102 | 2025-03-14T00:49:21.540Z | INFO | phd-runner: [WAIT_FOR_SERIAL_OUTPUT - EVENT] Waiting for output on serial console
file = phd-tests/framework/src/test_vm/mod.rs
line = 779
path = phd_tests::migrate::from_base::migration_from_base_and_back
target = phd_framework::test_vm
timeout_duration = Explicit(15s)
vm = migration_from_base_and_back_lifecycle_0
vm_id = 3feb1390-70ec-4772-a0c2-b7a42e5c6bea
|
103 | 2025-03-14T00:49:21.540Z | DEBG | phd-runner: [VM CLEANUP - EVENT] Killing Propolis server process
file = phd-tests/framework/src/test_vm/server.rs
line = 125
path = phd_tests::migrate::from_base::migration_from_base_and_back
self.address = 127.0.0.1:9000
target = phd_framework::test_vm::server
vm = migration_from_base_and_back
vm_id = acc5af82-ba37-4009-b92d-5761691e451c
|
104 | 2025-03-14T00:49:21.637Z | INFO | phd-runner: [VM CLEANUP - END]
elapsed_milliseconds = 97
file = phd-tests/framework/src/test_vm/mod.rs
line = 1029
path = phd_tests::migrate::from_base::migration_from_base_and_back
target = phd_framework::test_vm
vm = migration_from_base_and_back
vm_id = acc5af82-ba37-4009-b92d-5761691e451c
|
105 | 2025-03-14T00:49:21.637Z | INFO | phd-runner: [WAIT_FOR_SERIAL_OUTPUT - END]
elapsed_milliseconds = 97
file = phd-tests/framework/src/test_vm/mod.rs
line = 772
path = phd_tests::migrate::from_base::migration_from_base_and_back
target = phd_framework::test_vm
vm = migration_from_base_and_back_lifecycle_0
vm_id = 3feb1390-70ec-4772-a0c2-b7a42e5c6bea
|
106 | 2025-03-14T00:49:21.638Z | INFO | phd-runner: [WAIT_FOR_SERIAL_OUTPUT - START]
file = phd-tests/framework/src/test_vm/mod.rs
line = 772
path = phd_tests::migrate::from_base::migration_from_base_and_back
target = phd_framework::test_vm
vm = migration_from_base_and_back_lifecycle_0
vm_id = 3feb1390-70ec-4772-a0c2-b7a42e5c6bea
|
107 | 2025-03-14T00:49:21.638Z | INFO | phd-runner: [WAIT_FOR_SERIAL_OUTPUT - EVENT] Waiting for output on serial console
file = phd-tests/framework/src/test_vm/mod.rs
line = 779
path = phd_tests::migrate::from_base::migration_from_base_and_back
target = phd_framework::test_vm
timeout_duration = Explicit(300s)
vm = migration_from_base_and_back_lifecycle_0
vm_id = 3feb1390-70ec-4772-a0c2-b7a42e5c6bea
|
108 | 2025-03-14T00:49:21.660Z | INFO | phd-runner: [WAIT_FOR_SERIAL_OUTPUT - END]
elapsed_milliseconds = 22
file = phd-tests/framework/src/test_vm/mod.rs
line = 772
path = phd_tests::migrate::from_base::migration_from_base_and_back
target = phd_framework::test_vm
vm = migration_from_base_and_back_lifecycle_0
vm_id = 3feb1390-70ec-4772-a0c2-b7a42e5c6bea
|
109 | 2025-03-14T00:49:21.660Z | INFO | phd-runner: [TEST - EVENT] migrating to new Propolis artifact for lifecycle test
file = phd-tests/framework/src/lifecycle.rs
line = 73
path = phd_tests::migrate::from_base::migration_from_base_and_back
propolis_artifact = __BASE_PROPOLIS
target = phd_framework::lifecycle
vm_name = migration_from_base_and_back
|
110 | 2025-03-14T00:49:21.660Z | INFO | phd-runner: [NEW - START]
file = phd-tests/framework/src/test_vm/mod.rs
line = 193
path = phd_tests::migrate::from_base::migration_from_base_and_back
target = phd_framework::test_vm
|
111 | 2025-03-14T00:49:21.660Z | INFO | phd-runner: [NEW - EVENT] phd_framework::test_vm
environment = EnvironmentSpec { location: Local, propolis_artifact: "__BASE_PROPOLIS" }
file = phd-tests/framework/src/test_vm/mod.rs
guest_os_kind = Alpine
line = 211
path = phd_tests::migrate::from_base::migration_from_base_and_back
target = phd_framework::test_vm
vm_name = migration_from_base_and_back_lifecycle_1
|
112 | 2025-03-14T00:49:21.660Z | DEBG | phd-runner: [NEW - EVENT] Verified artifact already exists
file = phd-tests/framework/src/artifacts/store.rs
line = 45
path = /phd-artifacts/0adadba9bdfab04f2219dad7818a591829214061ec05b3ed2b348eaf75b5a5a5/propolis-server
target = phd_framework::artifacts::store
|
113 | 2025-03-14T00:49:21.660Z | INFO | phd-runner: [NEW - EVENT] Launching Propolis server
bootrom_path = "/phd-artifacts/29813374b58e3b77fb665f2d95cb3bab37d44fdd2c4fce2a70de9d76a3512a4f/OVMF_CODE.fd"
file = phd-tests/framework/src/test_vm/server.rs
line = 55
path = phd_tests::migrate::from_base::migration_from_base_and_back
server_addr = 127.0.0.1:9004
server_path = "/phd-artifacts/0adadba9bdfab04f2219dad7818a591829214061ec05b3ed2b348eaf75b5a5a5/propolis-server"
target = phd_framework::test_vm::server
|
114 | 2025-03-14T00:49:21.660Z | INFO | phd-runner: [NEW - EVENT] Opening server log files
file = phd-tests/framework/src/server_log_mode.rs
line = 64
path = phd_tests::migrate::from_base::migration_from_base_and_back
stderr_path = "/tmp/propolis-phd/migration_from_base_and_back_lifecycle_1.stderr.log"
stdout_path = "/tmp/propolis-phd/migration_from_base_and_back_lifecycle_1.stdout.log"
target = phd_framework::server_log_mode
|
115 | 2025-03-14T00:49:21.677Z | INFO | phd-runner: [NEW - EVENT] Launched server with pid 871
file = phd-tests/framework/src/test_vm/server.rs
line = 107
path = phd_tests::migrate::from_base::migration_from_base_and_back
target = phd_framework::test_vm::server
|
116 | 2025-03-14T00:49:21.677Z | INFO | phd-runner: [NEW - END]
elapsed_milliseconds = 17
file = phd-tests/framework/src/test_vm/mod.rs
line = 193
path = phd_tests::migrate::from_base::migration_from_base_and_back
target = phd_framework::test_vm
|
117 | 2025-03-14T00:49:21.678Z | INFO | phd-runner: [MIGRATE_FROM - START]
file = phd-tests/framework/src/test_vm/mod.rs
line = 474
path = phd_tests::migrate::from_base::migration_from_base_and_back
source = migration_from_base_and_back_lifecycle_0
source_id = 3feb1390-70ec-4772-a0c2-b7a42e5c6bea
target = phd_framework::test_vm
target_id = 948a00a4-fd77-4945-a1cd-380a4b5f8826
|
118 | 2025-03-14T00:49:21.678Z | INFO | phd-runner: [MIGRATE_FROM - EVENT] Migrating from source at address 127.0.0.1:9002
file = phd-tests/framework/src/test_vm/mod.rs
line = 507
migration_id = aa273071-176c-4b67-a618-26e1df604ac5
path = phd_tests::migrate::from_base::migration_from_base_and_back
source = migration_from_base_and_back_lifecycle_0
source_id = 3feb1390-70ec-4772-a0c2-b7a42e5c6bea
target = phd_framework::test_vm
target_id = 948a00a4-fd77-4945-a1cd-380a4b5f8826
timeout_duration = 45s
|
119 | 2025-03-14T00:49:21.678Z | INFO | phd-runner: [INSTANCE_ENSURE_INTERNAL - START]
file = phd-tests/framework/src/test_vm/mod.rs
line = 276
path = phd_tests::migrate::from_base::migration_from_base_and_back
source = migration_from_base_and_back_lifecycle_0
source_id = 3feb1390-70ec-4772-a0c2-b7a42e5c6bea
target = phd_framework::test_vm
target_id = 948a00a4-fd77-4945-a1cd-380a4b5f8826
vm = migration_from_base_and_back_lifecycle_1
vm_id = 948a00a4-fd77-4945-a1cd-380a4b5f8826
|
120 | 2025-03-14T00:49:21.678Z | INFO | phd-runner: [INSTANCE_ENSURE_INTERNAL - EVENT] retriable error from instance_spec_ensure
e = Communication Error: error sending request for url (http://127.0.0.1:9004/instance)
file = phd-tests/framework/src/test_vm/mod.rs
line = 320
path = phd_tests::migrate::from_base::migration_from_base_and_back
source = migration_from_base_and_back_lifecycle_0
source_id = 3feb1390-70ec-4772-a0c2-b7a42e5c6bea
target = phd_framework::test_vm
target_id = 948a00a4-fd77-4945-a1cd-380a4b5f8826
vm = migration_from_base_and_back_lifecycle_1
vm_id = 948a00a4-fd77-4945-a1cd-380a4b5f8826
|
121 | 2025-03-14T00:49:22.402Z | INFO | phd-runner: [INSTANCE_ENSURE_INTERNAL - EVENT] Started instance
file = phd-tests/framework/src/test_vm/mod.rs
instance_description.instance = Instance { properties: InstanceProperties { description: "Pheidippides-managed VM", id: 948a00a4-fd77-4945-a1cd-380a4b5f8826, metadata: InstanceMetadata { project_id: e22c578f-3bc0-422f-8f85-2e597088a5f8, silo_id: 14c6f704-6a24-438e-82ad-2854bf497d66, sled_id: 25f602d3-d5ab-4089-963f-0dd368e30dc0, sled_model: "pheidippes", sled_revision: 1, sled_serial: "25f602d3-d5ab-4089-963f-0dd368e30dc0" }, name: "phd-vm-948a00a4-fd77-4945-a1cd-380a4b5f8826" }, state: Migrating }
line = 379
path = phd_tests::migrate::from_base::migration_from_base_and_back
source = migration_from_base_and_back_lifecycle_0
source_id = 3feb1390-70ec-4772-a0c2-b7a42e5c6bea
target = phd_framework::test_vm
target_id = 948a00a4-fd77-4945-a1cd-380a4b5f8826
vm = migration_from_base_and_back_lifecycle_1
vm_id = 948a00a4-fd77-4945-a1cd-380a4b5f8826
|
122 | 2025-03-14T00:49:22.402Z | INFO | phd-runner: [INSTANCE_ENSURE_INTERNAL - END]
elapsed_milliseconds = 724
file = phd-tests/framework/src/test_vm/mod.rs
line = 276
path = phd_tests::migrate::from_base::migration_from_base_and_back
source = migration_from_base_and_back_lifecycle_0
source_id = 3feb1390-70ec-4772-a0c2-b7a42e5c6bea
target = phd_framework::test_vm
target_id = 948a00a4-fd77-4945-a1cd-380a4b5f8826
vm = migration_from_base_and_back_lifecycle_1
vm_id = 948a00a4-fd77-4945-a1cd-380a4b5f8826
|
123 | 2025-03-14T00:49:22.402Z | INFO | phd-runner: [MIGRATE - START]
file = phd-tests/framework/src/test_vm/mod.rs
line = 528
migration_id = aa273071-176c-4b67-a618-26e1df604ac5
path = phd_tests::migrate::from_base::migration_from_base_and_back
source = migration_from_base_and_back_lifecycle_0
source_id = 3feb1390-70ec-4772-a0c2-b7a42e5c6bea
target = phd_framework::test_vm
target_id = 948a00a4-fd77-4945-a1cd-380a4b5f8826
|
124 | 2025-03-14T00:49:24.859Z | INFO | phd-runner: [SERIAL CONSOLE TASK - EVENT] serial socket control message
file = phd-tests/framework/src/serial/mod.rs
line = 275
s = {"Migrating":{"destination":"127.0.0.1:9004","from_start":7807}}
target = phd_framework::serial
|
125 | 2025-03-14T00:49:24.963Z | INFO | phd-runner: [MIGRATE_FROM - EVENT] Migration completed successfully
file = phd-tests/framework/src/test_vm/mod.rs
line = 541
path = phd_tests::migrate::from_base::migration_from_base_and_back
source = migration_from_base_and_back_lifecycle_0
source_id = 3feb1390-70ec-4772-a0c2-b7a42e5c6bea
target = phd_framework::test_vm
target_id = 948a00a4-fd77-4945-a1cd-380a4b5f8826
|
126 | 2025-03-14T00:49:24.963Z | INFO | phd-runner: [MIGRATE - END]
elapsed_milliseconds = 2561
file = phd-tests/framework/src/test_vm/mod.rs
line = 528
migration_id = aa273071-176c-4b67-a618-26e1df604ac5
path = phd_tests::migrate::from_base::migration_from_base_and_back
source = migration_from_base_and_back_lifecycle_0
source_id = 3feb1390-70ec-4772-a0c2-b7a42e5c6bea
target = phd_framework::test_vm
target_id = 948a00a4-fd77-4945-a1cd-380a4b5f8826
|
127 | 2025-03-14T00:49:24.963Z | INFO | phd-runner: [MIGRATE_FROM - END]
elapsed_milliseconds = 3285
file = phd-tests/framework/src/test_vm/mod.rs
line = 474
path = phd_tests::migrate::from_base::migration_from_base_and_back
source = migration_from_base_and_back_lifecycle_0
source_id = 3feb1390-70ec-4772-a0c2-b7a42e5c6bea
target = phd_framework::test_vm
target_id = 948a00a4-fd77-4945-a1cd-380a4b5f8826
|
128 | 2025-03-14T00:49:24.964Z | INFO | phd-runner: [VM CLEANUP - START]
file = phd-tests/framework/src/test_vm/mod.rs
line = 1029
path = phd_tests::migrate::from_base::migration_from_base_and_back
target = phd_framework::test_vm
vm = migration_from_base_and_back_lifecycle_0
vm_id = 3feb1390-70ec-4772-a0c2-b7a42e5c6bea
|
129 | 2025-03-14T00:49:24.965Z | INFO | phd-runner: [WAIT_FOR_SERIAL_OUTPUT - START]
file = phd-tests/framework/src/test_vm/mod.rs
line = 772
path = phd_tests::migrate::from_base::migration_from_base_and_back
target = phd_framework::test_vm
vm = migration_from_base_and_back_lifecycle_1
vm_id = 948a00a4-fd77-4945-a1cd-380a4b5f8826
|
130 | 2025-03-14T00:49:24.965Z | INFO | phd-runner: [WAIT_FOR_SERIAL_OUTPUT - EVENT] Waiting for output on serial console
file = phd-tests/framework/src/test_vm/mod.rs
line = 779
path = phd_tests::migrate::from_base::migration_from_base_and_back
target = phd_framework::test_vm
timeout_duration = Explicit(15s)
vm = migration_from_base_and_back_lifecycle_1
vm_id = 948a00a4-fd77-4945-a1cd-380a4b5f8826
|
131 | 2025-03-14T00:49:24.965Z | DEBG | phd-runner: [VM CLEANUP - EVENT] Killing Propolis server process
file = phd-tests/framework/src/test_vm/server.rs
line = 125
path = phd_tests::migrate::from_base::migration_from_base_and_back
self.address = 127.0.0.1:9002
target = phd_framework::test_vm::server
vm = migration_from_base_and_back_lifecycle_0
vm_id = 3feb1390-70ec-4772-a0c2-b7a42e5c6bea
|
132 | 2025-03-14T00:49:25.059Z | INFO | phd-runner: [VM CLEANUP - END]
elapsed_milliseconds = 94
file = phd-tests/framework/src/test_vm/mod.rs
line = 1029
path = phd_tests::migrate::from_base::migration_from_base_and_back
target = phd_framework::test_vm
vm = migration_from_base_and_back_lifecycle_0
vm_id = 3feb1390-70ec-4772-a0c2-b7a42e5c6bea
|
133 | 2025-03-14T00:49:25.059Z | INFO | phd-runner: [WAIT_FOR_SERIAL_OUTPUT - END]
elapsed_milliseconds = 94
file = phd-tests/framework/src/test_vm/mod.rs
line = 772
path = phd_tests::migrate::from_base::migration_from_base_and_back
target = phd_framework::test_vm
vm = migration_from_base_and_back_lifecycle_1
vm_id = 948a00a4-fd77-4945-a1cd-380a4b5f8826
|
134 | 2025-03-14T00:49:25.060Z | INFO | phd-runner: [WAIT_FOR_SERIAL_OUTPUT - START]
file = phd-tests/framework/src/test_vm/mod.rs
line = 772
path = phd_tests::migrate::from_base::migration_from_base_and_back
target = phd_framework::test_vm
vm = migration_from_base_and_back_lifecycle_1
vm_id = 948a00a4-fd77-4945-a1cd-380a4b5f8826
|
135 | 2025-03-14T00:49:25.060Z | INFO | phd-runner: [WAIT_FOR_SERIAL_OUTPUT - EVENT] Waiting for output on serial console
file = phd-tests/framework/src/test_vm/mod.rs
line = 779
path = phd_tests::migrate::from_base::migration_from_base_and_back
target = phd_framework::test_vm
timeout_duration = Explicit(300s)
vm = migration_from_base_and_back_lifecycle_1
vm_id = 948a00a4-fd77-4945-a1cd-380a4b5f8826
|
136 | 2025-03-14T00:49:25.092Z | INFO | phd-runner: [WAIT_FOR_SERIAL_OUTPUT - END]
elapsed_milliseconds = 32
file = phd-tests/framework/src/test_vm/mod.rs
line = 772
path = phd_tests::migrate::from_base::migration_from_base_and_back
target = phd_framework::test_vm
vm = migration_from_base_and_back_lifecycle_1
vm_id = 948a00a4-fd77-4945-a1cd-380a4b5f8826
|
137 | 2025-03-14T00:49:25.093Z | INFO | phd-runner: [TEST - EVENT] migrating to new Propolis artifact for lifecycle test
file = phd-tests/framework/src/lifecycle.rs
line = 73
path = phd_tests::migrate::from_base::migration_from_base_and_back
propolis_artifact = __DEFAULT_PROPOLIS
target = phd_framework::lifecycle
vm_name = migration_from_base_and_back
|
138 | 2025-03-14T00:49:25.093Z | INFO | phd-runner: [NEW - START]
file = phd-tests/framework/src/test_vm/mod.rs
line = 193
path = phd_tests::migrate::from_base::migration_from_base_and_back
target = phd_framework::test_vm
|
139 | 2025-03-14T00:49:25.093Z | INFO | phd-runner: [NEW - EVENT] phd_framework::test_vm
environment = EnvironmentSpec { location: Local, propolis_artifact: "__DEFAULT_PROPOLIS" }
file = phd-tests/framework/src/test_vm/mod.rs
guest_os_kind = Alpine
line = 211
path = phd_tests::migrate::from_base::migration_from_base_and_back
target = phd_framework::test_vm
vm_name = migration_from_base_and_back_lifecycle_2
|
140 | 2025-03-14T00:49:25.093Z | DEBG | phd-runner: [NEW - EVENT] Verified artifact already exists
file = phd-tests/framework/src/artifacts/store.rs
line = 45
path = /work/phd-test/propolis-server
target = phd_framework::artifacts::store
|
141 | 2025-03-14T00:49:25.093Z | INFO | phd-runner: [NEW - EVENT] Launching Propolis server
bootrom_path = "/phd-artifacts/29813374b58e3b77fb665f2d95cb3bab37d44fdd2c4fce2a70de9d76a3512a4f/OVMF_CODE.fd"
file = phd-tests/framework/src/test_vm/server.rs
line = 55
path = phd_tests::migrate::from_base::migration_from_base_and_back
server_addr = 127.0.0.1:9006
server_path = "/work/phd-test/propolis-server"
target = phd_framework::test_vm::server
|
142 | 2025-03-14T00:49:25.093Z | INFO | phd-runner: [NEW - EVENT] Opening server log files
file = phd-tests/framework/src/server_log_mode.rs
line = 64
path = phd_tests::migrate::from_base::migration_from_base_and_back
stderr_path = "/tmp/propolis-phd/migration_from_base_and_back_lifecycle_2.stderr.log"
stdout_path = "/tmp/propolis-phd/migration_from_base_and_back_lifecycle_2.stdout.log"
target = phd_framework::server_log_mode
|
143 | 2025-03-14T00:49:25.108Z | INFO | phd-runner: [NEW - EVENT] Launched server with pid 873
file = phd-tests/framework/src/test_vm/server.rs
line = 107
path = phd_tests::migrate::from_base::migration_from_base_and_back
target = phd_framework::test_vm::server
|
144 | 2025-03-14T00:49:25.109Z | INFO | phd-runner: [NEW - END]
elapsed_milliseconds = 15
file = phd-tests/framework/src/test_vm/mod.rs
line = 193
path = phd_tests::migrate::from_base::migration_from_base_and_back
target = phd_framework::test_vm
|
145 | 2025-03-14T00:49:25.109Z | INFO | phd-runner: [MIGRATE_FROM - START]
file = phd-tests/framework/src/test_vm/mod.rs
line = 474
path = phd_tests::migrate::from_base::migration_from_base_and_back
source = migration_from_base_and_back_lifecycle_1
source_id = 948a00a4-fd77-4945-a1cd-380a4b5f8826
target = phd_framework::test_vm
target_id = fe0f3380-7de9-468a-a93d-9e4f57a22cdd
|
146 | 2025-03-14T00:49:25.109Z | INFO | phd-runner: [MIGRATE_FROM - EVENT] Migrating from source at address 127.0.0.1:9004
file = phd-tests/framework/src/test_vm/mod.rs
line = 507
migration_id = 33e71ce5-1269-4aea-a285-e036c07df6ba
path = phd_tests::migrate::from_base::migration_from_base_and_back
source = migration_from_base_and_back_lifecycle_1
source_id = 948a00a4-fd77-4945-a1cd-380a4b5f8826
target = phd_framework::test_vm
target_id = fe0f3380-7de9-468a-a93d-9e4f57a22cdd
timeout_duration = 45s
|
147 | 2025-03-14T00:49:25.109Z | INFO | phd-runner: [INSTANCE_ENSURE_INTERNAL - START]
file = phd-tests/framework/src/test_vm/mod.rs
line = 276
path = phd_tests::migrate::from_base::migration_from_base_and_back
source = migration_from_base_and_back_lifecycle_1
source_id = 948a00a4-fd77-4945-a1cd-380a4b5f8826
target = phd_framework::test_vm
target_id = fe0f3380-7de9-468a-a93d-9e4f57a22cdd
vm = migration_from_base_and_back_lifecycle_2
vm_id = fe0f3380-7de9-468a-a93d-9e4f57a22cdd
|
148 | 2025-03-14T00:49:25.109Z | INFO | phd-runner: [INSTANCE_ENSURE_INTERNAL - EVENT] retriable error from instance_spec_ensure
e = Communication Error: error sending request for url (http://127.0.0.1:9006/instance)
file = phd-tests/framework/src/test_vm/mod.rs
line = 320
path = phd_tests::migrate::from_base::migration_from_base_and_back
source = migration_from_base_and_back_lifecycle_1
source_id = 948a00a4-fd77-4945-a1cd-380a4b5f8826
target = phd_framework::test_vm
target_id = fe0f3380-7de9-468a-a93d-9e4f57a22cdd
vm = migration_from_base_and_back_lifecycle_2
vm_id = fe0f3380-7de9-468a-a93d-9e4f57a22cdd
|
149 | 2025-03-14T00:49:25.820Z | INFO | phd-runner: [INSTANCE_ENSURE_INTERNAL - EVENT] Started instance
file = phd-tests/framework/src/test_vm/mod.rs
instance_description.instance = Instance { properties: InstanceProperties { description: "Pheidippides-managed VM", id: fe0f3380-7de9-468a-a93d-9e4f57a22cdd, metadata: InstanceMetadata { project_id: e22c578f-3bc0-422f-8f85-2e597088a5f8, silo_id: 14c6f704-6a24-438e-82ad-2854bf497d66, sled_id: 32e248c4-fa42-47ea-ab04-5254e5428655, sled_model: "pheidippes", sled_revision: 1, sled_serial: "32e248c4-fa42-47ea-ab04-5254e5428655" }, name: "phd-vm-fe0f3380-7de9-468a-a93d-9e4f57a22cdd" }, state: Migrating }
line = 379
path = phd_tests::migrate::from_base::migration_from_base_and_back
source = migration_from_base_and_back_lifecycle_1
source_id = 948a00a4-fd77-4945-a1cd-380a4b5f8826
target = phd_framework::test_vm
target_id = fe0f3380-7de9-468a-a93d-9e4f57a22cdd
vm = migration_from_base_and_back_lifecycle_2
vm_id = fe0f3380-7de9-468a-a93d-9e4f57a22cdd
|
150 | 2025-03-14T00:49:25.820Z | INFO | phd-runner: [INSTANCE_ENSURE_INTERNAL - END]
elapsed_milliseconds = 711
file = phd-tests/framework/src/test_vm/mod.rs
line = 276
path = phd_tests::migrate::from_base::migration_from_base_and_back
source = migration_from_base_and_back_lifecycle_1
source_id = 948a00a4-fd77-4945-a1cd-380a4b5f8826
target = phd_framework::test_vm
target_id = fe0f3380-7de9-468a-a93d-9e4f57a22cdd
vm = migration_from_base_and_back_lifecycle_2
vm_id = fe0f3380-7de9-468a-a93d-9e4f57a22cdd
|
151 | 2025-03-14T00:49:25.820Z | INFO | phd-runner: [MIGRATE - START]
file = phd-tests/framework/src/test_vm/mod.rs
line = 528
migration_id = 33e71ce5-1269-4aea-a285-e036c07df6ba
path = phd_tests::migrate::from_base::migration_from_base_and_back
source = migration_from_base_and_back_lifecycle_1
source_id = 948a00a4-fd77-4945-a1cd-380a4b5f8826
target = phd_framework::test_vm
target_id = fe0f3380-7de9-468a-a93d-9e4f57a22cdd
|
152 | 2025-03-14T00:49:28.266Z | INFO | phd-runner: [SERIAL CONSOLE TASK - EVENT] serial socket control message
file = phd-tests/framework/src/serial/mod.rs
line = 275
s = {"Migrating":{"destination":"127.0.0.1:9006","from_start":7854}}
target = phd_framework::serial
|
153 | 2025-03-14T00:49:29.413Z | INFO | phd-runner: [MIGRATE_FROM - EVENT] Migration completed successfully
file = phd-tests/framework/src/test_vm/mod.rs
line = 541
path = phd_tests::migrate::from_base::migration_from_base_and_back
source = migration_from_base_and_back_lifecycle_1
source_id = 948a00a4-fd77-4945-a1cd-380a4b5f8826
target = phd_framework::test_vm
target_id = fe0f3380-7de9-468a-a93d-9e4f57a22cdd
|
154 | 2025-03-14T00:49:29.413Z | INFO | phd-runner: [MIGRATE - END]
elapsed_milliseconds = 3593
file = phd-tests/framework/src/test_vm/mod.rs
line = 528
migration_id = 33e71ce5-1269-4aea-a285-e036c07df6ba
path = phd_tests::migrate::from_base::migration_from_base_and_back
source = migration_from_base_and_back_lifecycle_1
source_id = 948a00a4-fd77-4945-a1cd-380a4b5f8826
target = phd_framework::test_vm
target_id = fe0f3380-7de9-468a-a93d-9e4f57a22cdd
|
155 | 2025-03-14T00:49:29.413Z | INFO | phd-runner: [MIGRATE_FROM - END]
elapsed_milliseconds = 4304
file = phd-tests/framework/src/test_vm/mod.rs
line = 474
path = phd_tests::migrate::from_base::migration_from_base_and_back
source = migration_from_base_and_back_lifecycle_1
source_id = 948a00a4-fd77-4945-a1cd-380a4b5f8826
target = phd_framework::test_vm
target_id = fe0f3380-7de9-468a-a93d-9e4f57a22cdd
|
156 | 2025-03-14T00:49:29.415Z | INFO | phd-runner: [VM CLEANUP - START]
file = phd-tests/framework/src/test_vm/mod.rs
line = 1029
path = phd_tests::migrate::from_base::migration_from_base_and_back
target = phd_framework::test_vm
vm = migration_from_base_and_back_lifecycle_1
vm_id = 948a00a4-fd77-4945-a1cd-380a4b5f8826
|
157 | 2025-03-14T00:49:29.415Z | INFO | phd-runner: [WAIT_FOR_SERIAL_OUTPUT - START]
file = phd-tests/framework/src/test_vm/mod.rs
line = 772
path = phd_tests::migrate::from_base::migration_from_base_and_back
target = phd_framework::test_vm
vm = migration_from_base_and_back_lifecycle_2
vm_id = fe0f3380-7de9-468a-a93d-9e4f57a22cdd
|
158 | 2025-03-14T00:49:29.415Z | INFO | phd-runner: [WAIT_FOR_SERIAL_OUTPUT - EVENT] Waiting for output on serial console
file = phd-tests/framework/src/test_vm/mod.rs
line = 779
path = phd_tests::migrate::from_base::migration_from_base_and_back
target = phd_framework::test_vm
timeout_duration = Explicit(15s)
vm = migration_from_base_and_back_lifecycle_2
vm_id = fe0f3380-7de9-468a-a93d-9e4f57a22cdd
|
159 | 2025-03-14T00:49:29.416Z | DEBG | phd-runner: [VM CLEANUP - EVENT] Killing Propolis server process
file = phd-tests/framework/src/test_vm/server.rs
line = 125
path = phd_tests::migrate::from_base::migration_from_base_and_back
self.address = 127.0.0.1:9004
target = phd_framework::test_vm::server
vm = migration_from_base_and_back_lifecycle_1
vm_id = 948a00a4-fd77-4945-a1cd-380a4b5f8826
|
160 | 2025-03-14T00:49:29.510Z | INFO | phd-runner: [VM CLEANUP - END]
elapsed_milliseconds = 94
file = phd-tests/framework/src/test_vm/mod.rs
line = 1029
path = phd_tests::migrate::from_base::migration_from_base_and_back
target = phd_framework::test_vm
vm = migration_from_base_and_back_lifecycle_1
vm_id = 948a00a4-fd77-4945-a1cd-380a4b5f8826
|
161 | 2025-03-14T00:49:29.510Z | INFO | phd-runner: [WAIT_FOR_SERIAL_OUTPUT - END]
elapsed_milliseconds = 95
file = phd-tests/framework/src/test_vm/mod.rs
line = 772
path = phd_tests::migrate::from_base::migration_from_base_and_back
target = phd_framework::test_vm
vm = migration_from_base_and_back_lifecycle_2
vm_id = fe0f3380-7de9-468a-a93d-9e4f57a22cdd
|
162 | 2025-03-14T00:49:29.511Z | INFO | phd-runner: [WAIT_FOR_SERIAL_OUTPUT - START]
file = phd-tests/framework/src/test_vm/mod.rs
line = 772
path = phd_tests::migrate::from_base::migration_from_base_and_back
target = phd_framework::test_vm
vm = migration_from_base_and_back_lifecycle_2
vm_id = fe0f3380-7de9-468a-a93d-9e4f57a22cdd
|
163 | 2025-03-14T00:49:29.511Z | INFO | phd-runner: [WAIT_FOR_SERIAL_OUTPUT - EVENT] Waiting for output on serial console
file = phd-tests/framework/src/test_vm/mod.rs
line = 779
path = phd_tests::migrate::from_base::migration_from_base_and_back
target = phd_framework::test_vm
timeout_duration = Explicit(300s)
vm = migration_from_base_and_back_lifecycle_2
vm_id = fe0f3380-7de9-468a-a93d-9e4f57a22cdd
|
164 | 2025-03-14T00:49:29.533Z | INFO | phd-runner: [WAIT_FOR_SERIAL_OUTPUT - END]
elapsed_milliseconds = 22
file = phd-tests/framework/src/test_vm/mod.rs
line = 772
path = phd_tests::migrate::from_base::migration_from_base_and_back
target = phd_framework::test_vm
vm = migration_from_base_and_back_lifecycle_2
vm_id = fe0f3380-7de9-468a-a93d-9e4f57a22cdd
|
165 | 2025-03-14T00:49:29.533Z | INFO | phd-runner: [VM CLEANUP - START]
file = phd-tests/framework/src/test_vm/mod.rs
line = 1029
path = phd_tests::migrate::from_base::migration_from_base_and_back
target = phd_framework::test_vm
vm = migration_from_base_and_back_lifecycle_2
vm_id = fe0f3380-7de9-468a-a93d-9e4f57a22cdd
|
166 | 2025-03-14T00:49:29.534Z | DEBG | phd-runner: [SERIAL CONSOLE TASK - EVENT] serial console command channel was closed
file = phd-tests/framework/src/serial/mod.rs
line = 213
target = phd_framework::serial
|
167 | 2025-03-14T00:49:29.534Z | INFO | phd-runner: test phd_tests::migrate::from_base::migration_from_base_and_back ... ok
file = phd-tests/runner/src/execute.rs
line = 129
target = phd_runner::execute
|
168 | 2025-03-14T00:49:29.534Z | INFO | phd-runner: [SERIAL CONSOLE TASK - END]
elapsed_milliseconds = 15494
file = phd-tests/framework/src/serial/mod.rs
line = 200
target = phd_framework::serial
|
169 | 2025-03-14T00:49:29.534Z | INFO | phd-runner: [TEST_CLEANUP - START]
file = phd-tests/runner/src/fixtures.rs
line = 51
target = phd_runner::fixtures
|
170 | 2025-03-14T00:49:29.535Z | DEBG | phd-runner: [VM CLEANUP - EVENT] trying to ensure Propolis server VM is destroyed
file = phd-tests/framework/src/test_vm/mod.rs
line = 1052
path = phd_tests::migrate::from_base::migration_from_base_and_back
target = phd_framework::test_vm
vm = migration_from_base_and_back_lifecycle_2
vm_id = fe0f3380-7de9-468a-a93d-9e4f57a22cdd
|
171 | 2025-03-14T00:49:29.801Z | DEBG | phd-runner: [VM CLEANUP - EVENT] Killing Propolis server process
file = phd-tests/framework/src/test_vm/server.rs
line = 125
path = phd_tests::migrate::from_base::migration_from_base_and_back
self.address = 127.0.0.1:9006
target = phd_framework::test_vm::server
vm = migration_from_base_and_back_lifecycle_2
vm_id = fe0f3380-7de9-468a-a93d-9e4f57a22cdd
|
172 | 2025-03-14T00:49:29.899Z | DEBG | phd-runner: [VM CLEANUP - EVENT] zfs clone dropped
file = phd-tests/framework/src/zfs.rs
line = 83
path = phd_tests::migrate::from_base::migration_from_base_and_back
target = phd_framework::zfs
vm = migration_from_base_and_back_lifecycle_2
vm_id = fe0f3380-7de9-468a-a93d-9e4f57a22cdd
|
173 | 2025-03-14T00:49:29.899Z | DEBG | phd-runner: [VM CLEANUP - EVENT] executing ZFS command
args = ["phd-artifacts/phd-clone-de0bc56f-ca6e-4bec-b1f8-aed084c0be6e"]
file = phd-tests/framework/src/zfs.rs
line = 304
path = phd_tests::migrate::from_base::migration_from_base_and_back
target = phd_framework::zfs
verb = destroy
vm = migration_from_base_and_back_lifecycle_2
vm_id = fe0f3380-7de9-468a-a93d-9e4f57a22cdd
|
174 | 2025-03-14T00:49:29.929Z | DEBG | phd-runner: [VM CLEANUP - EVENT] zfs snapshot dropped
file = phd-tests/framework/src/zfs.rs
line = 57
path = phd_tests::migrate::from_base::migration_from_base_and_back
target = phd_framework::zfs
vm = migration_from_base_and_back_lifecycle_2
vm_id = fe0f3380-7de9-468a-a93d-9e4f57a22cdd
|
175 | 2025-03-14T00:49:29.929Z | DEBG | phd-runner: [VM CLEANUP - EVENT] executing ZFS command
args = ["phd-artifacts@phd-0bacc304-06d6-4011-9f15-5376c04f56d4"]
file = phd-tests/framework/src/zfs.rs
line = 304
path = phd_tests::migrate::from_base::migration_from_base_and_back
target = phd_framework::zfs
verb = destroy
vm = migration_from_base_and_back_lifecycle_2
vm_id = fe0f3380-7de9-468a-a93d-9e4f57a22cdd
|
176 | 2025-03-14T00:49:29.954Z | INFO | phd-runner: [VM CLEANUP - END]
elapsed_milliseconds = 420
file = phd-tests/framework/src/test_vm/mod.rs
line = 1029
path = phd_tests::migrate::from_base::migration_from_base_and_back
target = phd_framework::test_vm
vm = migration_from_base_and_back_lifecycle_2
vm_id = fe0f3380-7de9-468a-a93d-9e4f57a22cdd
|
177 | 2025-03-14T00:49:29.954Z | INFO | phd-runner: [TEST - END]
elapsed_milliseconds = 89317
file = phd-tests/tests/src/migrate.rs
line = 52
path = phd_tests::migrate::from_base::migration_from_base_and_back
target = phd_tests::migrate::from_base
|
178 | 2025-03-14T00:49:29.955Z | INFO | phd-runner: [TEST_CLEANUP - END]
elapsed_milliseconds = 420
file = phd-tests/runner/src/fixtures.rs
line = 51
target = phd_runner::fixtures
|
179 | 2025-03-14T00:49:29.955Z | INFO | phd-runner: Starting test phd_tests::migrate::from_base::serial_history
file = phd-tests/runner/src/execute.rs
line = 90
target = phd_runner::execute
|
180 | 2025-03-14T00:49:29.955Z | INFO | phd-runner: [TEST_SETUP - START]
file = phd-tests/runner/src/fixtures.rs
line = 41
target = phd_runner::fixtures
|
181 | 2025-03-14T00:49:29.955Z | INFO | phd-runner: [TEST_SETUP - END]
elapsed_milliseconds = 0
file = phd-tests/runner/src/fixtures.rs
line = 41
target = phd_runner::fixtures
|
182 | 2025-03-14T00:49:29.955Z | INFO | phd-runner: [TEST - START]
file = phd-tests/tests/src/migrate.rs
line = 40
path = phd_tests::migrate::from_base::serial_history
target = phd_tests::migrate::from_base
|
183 | 2025-03-14T00:49:29.955Z | DEBG | phd-runner: [TEST - EVENT] Verified artifact already exists
file = phd-tests/framework/src/artifacts/store.rs
line = 45
path = /phd-artifacts/29813374b58e3b77fb665f2d95cb3bab37d44fdd2c4fce2a70de9d76a3512a4f/OVMF_CODE.fd
target = phd_framework::artifacts::store
|
184 | 2025-03-14T00:49:29.955Z | DEBG | phd-runner: [TEST - EVENT] Verified artifact already exists
file = phd-tests/framework/src/artifacts/store.rs
line = 45
path = /phd-artifacts/ba8007f74f9b54fbae3b2520da577831b4834778a498d732f091260c61aa7ca1/alpine.iso
target = phd_framework::artifacts::store
|
185 | 2025-03-14T00:49:29.955Z | DEBG | phd-runner: [TEST - EVENT] Verified artifact already exists
file = phd-tests/framework/src/artifacts/store.rs
line = 45
path = /phd-artifacts/ba8007f74f9b54fbae3b2520da577831b4834778a498d732f091260c61aa7ca1/alpine.iso
target = phd_framework::artifacts::store
|
186 | 2025-03-14T00:49:29.955Z | DEBG | phd-runner: [TEST - EVENT] executing ZFS command
args = ["/phd-artifacts/ba8007f74f9b54fbae3b2520da577831b4834778a498d732f091260c61aa7ca1/alpine.iso"]
file = phd-tests/framework/src/zfs.rs
line = 304
path = phd_tests::migrate::from_base::serial_history
target = phd_framework::zfs
verb = list
|
187 | 2025-03-14T00:49:29.973Z | DEBG | phd-runner: [TEST - EVENT] parsing zfs list output
file = phd-tests/framework/src/zfs.rs
line = 238
path = phd_tests::migrate::from_base::serial_history
stdout = NAME USED AVAIL REFER MOUNTPOINT\nphd-artifacts 688M 1.80T 687M /phd-artifacts\n
target = phd_framework::zfs
|
188 | 2025-03-14T00:49:29.973Z | DEBG | phd-runner: [TEST - EVENT] executing ZFS command
args = ["phd-artifacts@phd-2c4b3144-4627-4d50-aafa-4ae1193965a2"]
file = phd-tests/framework/src/zfs.rs
line = 304
path = phd_tests::migrate::from_base::serial_history
target = phd_framework::zfs
verb = snapshot
|
189 | 2025-03-14T00:49:29.994Z | DEBG | phd-runner: [TEST - EVENT] executing ZFS command
args = ["phd-artifacts@phd-2c4b3144-4627-4d50-aafa-4ae1193965a2", "phd-artifacts/phd-clone-2f9abfab-7abe-443f-bbc8-8eebc7fe3e4d"]
file = phd-tests/framework/src/zfs.rs
line = 304
path = phd_tests::migrate::from_base::serial_history
target = phd_framework::zfs
verb = clone
|
190 | 2025-03-14T00:49:30.019Z | DEBG | phd-runner: [TEST - EVENT] executing ZFS command
args = ["phd-artifacts/phd-clone-2f9abfab-7abe-443f-bbc8-8eebc7fe3e4d"]
file = phd-tests/framework/src/zfs.rs
line = 304
path = phd_tests::migrate::from_base::serial_history
target = phd_framework::zfs
verb = list
|
191 | 2025-03-14T00:49:30.036Z | DEBG | phd-runner: [TEST - EVENT] parsing zfs list output
file = phd-tests/framework/src/zfs.rs
line = 238
path = phd_tests::migrate::from_base::serial_history
stdout = NAME USED AVAIL REFER MOUNTPOINT\nphd-artifacts/phd-clone-2f9abfab-7abe-443f-bbc8-8eebc7fe3e4d 0B 1.80T 687M /phd-artifacts/phd-clone-2f9abfab-7abe-443f-bbc8-8eebc7fe3e4d\n
target = phd_framework::zfs
|
192 | 2025-03-14T00:49:30.036Z | INFO | phd-runner: [NEW - START]
file = phd-tests/framework/src/test_vm/mod.rs
line = 193
path = phd_tests::migrate::from_base::serial_history
target = phd_framework::test_vm
|
193 | 2025-03-14T00:49:30.036Z | INFO | phd-runner: [NEW - EVENT] phd_framework::test_vm
environment = EnvironmentSpec { location: Local, propolis_artifact: "__BASE_PROPOLIS" }
file = phd-tests/framework/src/test_vm/mod.rs
guest_os_kind = Alpine
line = 211
path = phd_tests::migrate::from_base::serial_history
target = phd_framework::test_vm
vm_name = migration_serial_history_base
|
194 | 2025-03-14T00:49:30.036Z | DEBG | phd-runner: [NEW - EVENT] Verified artifact already exists
file = phd-tests/framework/src/artifacts/store.rs
line = 45
path = /phd-artifacts/0adadba9bdfab04f2219dad7818a591829214061ec05b3ed2b348eaf75b5a5a5/propolis-server
target = phd_framework::artifacts::store
|
195 | 2025-03-14T00:49:30.036Z | INFO | phd-runner: [NEW - EVENT] Launching Propolis server
bootrom_path = "/phd-artifacts/29813374b58e3b77fb665f2d95cb3bab37d44fdd2c4fce2a70de9d76a3512a4f/OVMF_CODE.fd"
file = phd-tests/framework/src/test_vm/server.rs
line = 55
path = phd_tests::migrate::from_base::serial_history
server_addr = 127.0.0.1:9000
server_path = "/phd-artifacts/0adadba9bdfab04f2219dad7818a591829214061ec05b3ed2b348eaf75b5a5a5/propolis-server"
target = phd_framework::test_vm::server
|
196 | 2025-03-14T00:49:30.036Z | INFO | phd-runner: [NEW - EVENT] Opening server log files
file = phd-tests/framework/src/server_log_mode.rs
line = 64
path = phd_tests::migrate::from_base::serial_history
stderr_path = "/tmp/propolis-phd/migration_serial_history_base.stderr.log"
stdout_path = "/tmp/propolis-phd/migration_serial_history_base.stdout.log"
target = phd_framework::server_log_mode
|
197 | 2025-03-14T00:49:30.047Z | INFO | phd-runner: [NEW - EVENT] Launched server with pid 882
file = phd-tests/framework/src/test_vm/server.rs
line = 107
path = phd_tests::migrate::from_base::serial_history
target = phd_framework::test_vm::server
|
198 | 2025-03-14T00:49:30.047Z | INFO | phd-runner: [NEW - END]
elapsed_milliseconds = 10
file = phd-tests/framework/src/test_vm/mod.rs
line = 193
path = phd_tests::migrate::from_base::serial_history
target = phd_framework::test_vm
|
199 | 2025-03-14T00:49:30.047Z | INFO | phd-runner: [INSTANCE_ENSURE_INTERNAL - START]
file = phd-tests/framework/src/test_vm/mod.rs
line = 276
path = phd_tests::migrate::from_base::serial_history
target = phd_framework::test_vm
vm = migration_serial_history_base
vm_id = bf9e65c9-1f8a-4c0d-8ea4-22d92f2149fc
|
200 | 2025-03-14T00:49:30.048Z | INFO | phd-runner: [INSTANCE_ENSURE_INTERNAL - EVENT] retriable error from instance_spec_ensure
e = Communication Error: error sending request for url (http://127.0.0.1:9000/instance)
file = phd-tests/framework/src/test_vm/mod.rs
line = 320
path = phd_tests::migrate::from_base::serial_history
target = phd_framework::test_vm
vm = migration_serial_history_base
vm_id = bf9e65c9-1f8a-4c0d-8ea4-22d92f2149fc
|
201 | 2025-03-14T00:49:30.634Z | INFO | phd-runner: [SERIAL CONSOLE TASK - START]
file = phd-tests/framework/src/serial/mod.rs
line = 200
target = phd_framework::serial
|
202 | 2025-03-14T00:49:30.634Z | INFO | phd-runner: [INSTANCE_ENSURE_INTERNAL - EVENT] Started instance
file = phd-tests/framework/src/test_vm/mod.rs
instance_description.instance = Instance { properties: InstanceProperties { description: "Pheidippides-managed VM", id: bf9e65c9-1f8a-4c0d-8ea4-22d92f2149fc, metadata: InstanceMetadata { project_id: 5ff5b638-a33b-4253-a2ca-33e36be4d51a, silo_id: 2f5029b1-221b-4713-9e93-84003d981b7c, sled_id: 61c6c567-5e11-4f80-ad0d-028e0a575438, sled_model: "pheidippes", sled_revision: 1, sled_serial: "61c6c567-5e11-4f80-ad0d-028e0a575438" }, name: "phd-vm-bf9e65c9-1f8a-4c0d-8ea4-22d92f2149fc" }, state: Creating }
line = 379
path = phd_tests::migrate::from_base::serial_history
target = phd_framework::test_vm
vm = migration_serial_history_base
vm_id = bf9e65c9-1f8a-4c0d-8ea4-22d92f2149fc
|
203 | 2025-03-14T00:49:30.634Z | INFO | phd-runner: [INSTANCE_ENSURE_INTERNAL - END]
elapsed_milliseconds = 587
file = phd-tests/framework/src/test_vm/mod.rs
line = 276
path = phd_tests::migrate::from_base::serial_history
target = phd_framework::test_vm
vm = migration_serial_history_base
vm_id = bf9e65c9-1f8a-4c0d-8ea4-22d92f2149fc
|
204 | 2025-03-14T00:49:30.634Z | INFO | phd-runner: [PUT_INSTANCE_STATE - START]
file = phd-tests/framework/src/test_vm/mod.rs
line = 440
path = phd_tests::migrate::from_base::serial_history
target = phd_framework::test_vm
vm = migration_serial_history_base
vm_id = bf9e65c9-1f8a-4c0d-8ea4-22d92f2149fc
|
205 | 2025-03-14T00:49:30.635Z | INFO | phd-runner: [PUT_INSTANCE_STATE - EVENT] Requesting instance state change
file = phd-tests/framework/src/test_vm/mod.rs
line = 445
path = phd_tests::migrate::from_base::serial_history
state = Run
target = phd_framework::test_vm
vm = migration_serial_history_base
vm_id = bf9e65c9-1f8a-4c0d-8ea4-22d92f2149fc
|
206 | 2025-03-14T00:49:30.635Z | INFO | phd-runner: [PUT_INSTANCE_STATE - END]
elapsed_milliseconds = 0
file = phd-tests/framework/src/test_vm/mod.rs
line = 440
path = phd_tests::migrate::from_base::serial_history
target = phd_framework::test_vm
vm = migration_serial_history_base
vm_id = bf9e65c9-1f8a-4c0d-8ea4-22d92f2149fc
|
207 | 2025-03-14T00:49:30.635Z | INFO | phd-runner: [WAIT_TO_BOOT - START]
file = phd-tests/framework/src/test_vm/mod.rs
line = 757
path = phd_tests::migrate::from_base::serial_history
target = phd_framework::test_vm
|
208 | 2025-03-14T00:49:30.635Z | INFO | phd-runner: [WAIT_TO_BOOT - EVENT] waiting for guest to boot
file = phd-tests/framework/src/test_vm/mod.rs
line = 706
path = phd_tests::migrate::from_base::serial_history
target = phd_framework::test_vm
timeout_duration = 300s
vm = migration_serial_history_base
vm_id = bf9e65c9-1f8a-4c0d-8ea4-22d92f2149fc
|
209 | 2025-03-14T00:49:30.635Z | DEBG | phd-runner: [WAIT_TO_BOOT - EVENT] executing command in boot sequence
file = phd-tests/framework/src/test_vm/mod.rs
line = 714
path = phd_tests::migrate::from_base::serial_history
step = WaitFor("localhost login: ")
target = phd_framework::test_vm
|
210 | 2025-03-14T00:49:30.635Z | INFO | phd-runner: [WAIT_FOR_SERIAL_OUTPUT - START]
file = phd-tests/framework/src/test_vm/mod.rs
line = 772
path = phd_tests::migrate::from_base::serial_history
target = phd_framework::test_vm
vm = migration_serial_history_base
vm_id = bf9e65c9-1f8a-4c0d-8ea4-22d92f2149fc
|
211 | 2025-03-14T00:49:30.635Z | INFO | phd-runner: [WAIT_FOR_SERIAL_OUTPUT - EVENT] Waiting for output on serial console
file = phd-tests/framework/src/test_vm/mod.rs
line = 779
path = phd_tests::migrate::from_base::serial_history
target = phd_framework::test_vm
timeout_duration = CallerTimeout
vm = migration_serial_history_base
vm_id = bf9e65c9-1f8a-4c0d-8ea4-22d92f2149fc
|
212 | 2025-03-14T00:49:34.794Z | INFO | phd-runner: [WAIT_FOR_SERIAL_OUTPUT - END]
elapsed_milliseconds = 4158
file = phd-tests/framework/src/test_vm/mod.rs
line = 772
path = phd_tests::migrate::from_base::serial_history
target = phd_framework::test_vm
vm = migration_serial_history_base
vm_id = bf9e65c9-1f8a-4c0d-8ea4-22d92f2149fc
|
213 | 2025-03-14T00:49:34.794Z | DEBG | phd-runner: [WAIT_TO_BOOT - EVENT] executing command in boot sequence
file = phd-tests/framework/src/test_vm/mod.rs
line = 714
path = phd_tests::migrate::from_base::serial_history
step = WriteStr("root")
target = phd_framework::test_vm
|
214 | 2025-03-14T00:49:34.795Z | DEBG | phd-runner: [WAIT_TO_BOOT - EVENT] executing command in boot sequence
file = phd-tests/framework/src/test_vm/mod.rs
line = 714
path = phd_tests::migrate::from_base::serial_history
step = WaitFor("localhost:~#")
target = phd_framework::test_vm
|
215 | 2025-03-14T00:49:34.795Z | INFO | phd-runner: [WAIT_FOR_SERIAL_OUTPUT - START]
file = phd-tests/framework/src/test_vm/mod.rs
line = 772
path = phd_tests::migrate::from_base::serial_history
target = phd_framework::test_vm
vm = migration_serial_history_base
vm_id = bf9e65c9-1f8a-4c0d-8ea4-22d92f2149fc
|
216 | 2025-03-14T00:49:34.795Z | INFO | phd-runner: [WAIT_FOR_SERIAL_OUTPUT - EVENT] Waiting for output on serial console
file = phd-tests/framework/src/test_vm/mod.rs
line = 779
path = phd_tests::migrate::from_base::serial_history
target = phd_framework::test_vm
timeout_duration = CallerTimeout
vm = migration_serial_history_base
vm_id = bf9e65c9-1f8a-4c0d-8ea4-22d92f2149fc
|
217 | 2025-03-14T00:49:34.814Z | INFO | phd-runner: [WAIT_FOR_SERIAL_OUTPUT - END]
elapsed_milliseconds = 18
file = phd-tests/framework/src/test_vm/mod.rs
line = 772
path = phd_tests::migrate::from_base::serial_history
target = phd_framework::test_vm
vm = migration_serial_history_base
vm_id = bf9e65c9-1f8a-4c0d-8ea4-22d92f2149fc
|
218 | 2025-03-14T00:49:34.814Z | DEBG | phd-runner: [WAIT_TO_BOOT - EVENT] executing command in boot sequence
file = phd-tests/framework/src/test_vm/mod.rs
line = 714
path = phd_tests::migrate::from_base::serial_history
step = WriteStr("stty -F `tty` cols 9999")
target = phd_framework::test_vm
|
219 | 2025-03-14T00:49:34.814Z | DEBG | phd-runner: [WAIT_TO_BOOT - EVENT] executing command in boot sequence
file = phd-tests/framework/src/test_vm/mod.rs
line = 714
path = phd_tests::migrate::from_base::serial_history
step = WaitFor("localhost:~#")
target = phd_framework::test_vm
|
220 | 2025-03-14T00:49:34.814Z | INFO | phd-runner: [WAIT_FOR_SERIAL_OUTPUT - START]
file = phd-tests/framework/src/test_vm/mod.rs
line = 772
path = phd_tests::migrate::from_base::serial_history
target = phd_framework::test_vm
vm = migration_serial_history_base
vm_id = bf9e65c9-1f8a-4c0d-8ea4-22d92f2149fc
|
221 | 2025-03-14T00:49:34.814Z | INFO | phd-runner: [WAIT_FOR_SERIAL_OUTPUT - EVENT] Waiting for output on serial console
file = phd-tests/framework/src/test_vm/mod.rs
line = 779
path = phd_tests::migrate::from_base::serial_history
target = phd_framework::test_vm
timeout_duration = CallerTimeout
vm = migration_serial_history_base
vm_id = bf9e65c9-1f8a-4c0d-8ea4-22d92f2149fc
|
222 | 2025-03-14T00:49:34.847Z | INFO | phd-runner: [WAIT_FOR_SERIAL_OUTPUT - END]
elapsed_milliseconds = 32
file = phd-tests/framework/src/test_vm/mod.rs
line = 772
path = phd_tests::migrate::from_base::serial_history
target = phd_framework::test_vm
vm = migration_serial_history_base
vm_id = bf9e65c9-1f8a-4c0d-8ea4-22d92f2149fc
|
223 | 2025-03-14T00:49:34.847Z | INFO | phd-runner: [WAIT_TO_BOOT - EVENT] Guest has booted
file = phd-tests/framework/src/test_vm/mod.rs
line = 754
path = phd_tests::migrate::from_base::serial_history
target = phd_framework::test_vm
|
224 | 2025-03-14T00:49:34.847Z | INFO | phd-runner: [WAIT_TO_BOOT - END]
elapsed_milliseconds = 4211
file = phd-tests/framework/src/test_vm/mod.rs
line = 757
path = phd_tests::migrate::from_base::serial_history
target = phd_framework::test_vm
|
225 | 2025-03-14T00:49:34.847Z | INFO | phd-runner: [WAIT_FOR_SERIAL_OUTPUT - START]
file = phd-tests/framework/src/test_vm/mod.rs
line = 772
path = phd_tests::migrate::from_base::serial_history
target = phd_framework::test_vm
vm = migration_serial_history_base
vm_id = bf9e65c9-1f8a-4c0d-8ea4-22d92f2149fc
|
226 | 2025-03-14T00:49:34.847Z | INFO | phd-runner: [WAIT_FOR_SERIAL_OUTPUT - EVENT] Waiting for output on serial console
file = phd-tests/framework/src/test_vm/mod.rs
line = 779
path = phd_tests::migrate::from_base::serial_history
target = phd_framework::test_vm
timeout_duration = Explicit(15s)
vm = migration_serial_history_base
vm_id = bf9e65c9-1f8a-4c0d-8ea4-22d92f2149fc
|
227 | 2025-03-14T00:49:34.857Z | INFO | phd-runner: [WAIT_FOR_SERIAL_OUTPUT - END]
elapsed_milliseconds = 10
file = phd-tests/framework/src/test_vm/mod.rs
line = 772
path = phd_tests::migrate::from_base::serial_history
target = phd_framework::test_vm
vm = migration_serial_history_base
vm_id = bf9e65c9-1f8a-4c0d-8ea4-22d92f2149fc
|
228 | 2025-03-14T00:49:34.858Z | INFO | phd-runner: [WAIT_FOR_SERIAL_OUTPUT - START]
file = phd-tests/framework/src/test_vm/mod.rs
line = 772
path = phd_tests::migrate::from_base::serial_history
target = phd_framework::test_vm
vm = migration_serial_history_base
vm_id = bf9e65c9-1f8a-4c0d-8ea4-22d92f2149fc
|
229 | 2025-03-14T00:49:34.858Z | INFO | phd-runner: [WAIT_FOR_SERIAL_OUTPUT - EVENT] Waiting for output on serial console
file = phd-tests/framework/src/test_vm/mod.rs
line = 779
path = phd_tests::migrate::from_base::serial_history
target = phd_framework::test_vm
timeout_duration = Explicit(300s)
vm = migration_serial_history_base
vm_id = bf9e65c9-1f8a-4c0d-8ea4-22d92f2149fc
|
230 | 2025-03-14T00:49:34.881Z | INFO | phd-runner: [WAIT_FOR_SERIAL_OUTPUT - END]
elapsed_milliseconds = 22
file = phd-tests/framework/src/test_vm/mod.rs
line = 772
path = phd_tests::migrate::from_base::serial_history
target = phd_framework::test_vm
vm = migration_serial_history_base
vm_id = bf9e65c9-1f8a-4c0d-8ea4-22d92f2149fc
|
231 | 2025-03-14T00:49:34.886Z | INFO | phd-runner: [TEST - EVENT] migrating to new Propolis artifact for lifecycle test
file = phd-tests/framework/src/lifecycle.rs
line = 73
path = phd_tests::migrate::from_base::serial_history
propolis_artifact = __DEFAULT_PROPOLIS
target = phd_framework::lifecycle
vm_name = migration_serial_history_base
|
232 | 2025-03-14T00:49:34.886Z | INFO | phd-runner: [NEW - START]
file = phd-tests/framework/src/test_vm/mod.rs
line = 193
path = phd_tests::migrate::from_base::serial_history
target = phd_framework::test_vm
|
233 | 2025-03-14T00:49:34.886Z | INFO | phd-runner: [NEW - EVENT] phd_framework::test_vm
environment = EnvironmentSpec { location: Local, propolis_artifact: "__DEFAULT_PROPOLIS" }
file = phd-tests/framework/src/test_vm/mod.rs
guest_os_kind = Alpine
line = 211
path = phd_tests::migrate::from_base::serial_history
target = phd_framework::test_vm
vm_name = migration_serial_history_base_lifecycle_0
|
234 | 2025-03-14T00:49:34.886Z | DEBG | phd-runner: [NEW - EVENT] Verified artifact already exists
file = phd-tests/framework/src/artifacts/store.rs
line = 45
path = /work/phd-test/propolis-server
target = phd_framework::artifacts::store
|
235 | 2025-03-14T00:49:34.886Z | INFO | phd-runner: [NEW - EVENT] Launching Propolis server
bootrom_path = "/phd-artifacts/29813374b58e3b77fb665f2d95cb3bab37d44fdd2c4fce2a70de9d76a3512a4f/OVMF_CODE.fd"
file = phd-tests/framework/src/test_vm/server.rs
line = 55
path = phd_tests::migrate::from_base::serial_history
server_addr = 127.0.0.1:9002
server_path = "/work/phd-test/propolis-server"
target = phd_framework::test_vm::server
|
236 | 2025-03-14T00:49:34.886Z | INFO | phd-runner: [NEW - EVENT] Opening server log files
file = phd-tests/framework/src/server_log_mode.rs
line = 64
path = phd_tests::migrate::from_base::serial_history
stderr_path = "/tmp/propolis-phd/migration_serial_history_base_lifecycle_0.stderr.log"
stdout_path = "/tmp/propolis-phd/migration_serial_history_base_lifecycle_0.stdout.log"
target = phd_framework::server_log_mode
|
237 | 2025-03-14T00:49:34.902Z | INFO | phd-runner: [NEW - EVENT] Launched server with pid 883
file = phd-tests/framework/src/test_vm/server.rs
line = 107
path = phd_tests::migrate::from_base::serial_history
target = phd_framework::test_vm::server
|
238 | 2025-03-14T00:49:34.902Z | INFO | phd-runner: [NEW - END]
elapsed_milliseconds = 16
file = phd-tests/framework/src/test_vm/mod.rs
line = 193
path = phd_tests::migrate::from_base::serial_history
target = phd_framework::test_vm
|
239 | 2025-03-14T00:49:34.902Z | INFO | phd-runner: [MIGRATE_FROM - START]
file = phd-tests/framework/src/test_vm/mod.rs
line = 474
path = phd_tests::migrate::from_base::serial_history
source = migration_serial_history_base
source_id = bf9e65c9-1f8a-4c0d-8ea4-22d92f2149fc
target = phd_framework::test_vm
target_id = 80bcf3d7-5c5a-4157-8bf0-9d2588c7a107
|
240 | 2025-03-14T00:49:34.902Z | INFO | phd-runner: [MIGRATE_FROM - EVENT] Migrating from source at address 127.0.0.1:9000
file = phd-tests/framework/src/test_vm/mod.rs
line = 507
migration_id = cdb8154d-b239-442e-83fc-3622d51959ce
path = phd_tests::migrate::from_base::serial_history
source = migration_serial_history_base
source_id = bf9e65c9-1f8a-4c0d-8ea4-22d92f2149fc
target = phd_framework::test_vm
target_id = 80bcf3d7-5c5a-4157-8bf0-9d2588c7a107
timeout_duration = 45s
|
241 | 2025-03-14T00:49:34.902Z | INFO | phd-runner: [INSTANCE_ENSURE_INTERNAL - START]
file = phd-tests/framework/src/test_vm/mod.rs
line = 276
path = phd_tests::migrate::from_base::serial_history
source = migration_serial_history_base
source_id = bf9e65c9-1f8a-4c0d-8ea4-22d92f2149fc
target = phd_framework::test_vm
target_id = 80bcf3d7-5c5a-4157-8bf0-9d2588c7a107
vm = migration_serial_history_base_lifecycle_0
vm_id = 80bcf3d7-5c5a-4157-8bf0-9d2588c7a107
|
242 | 2025-03-14T00:49:34.903Z | INFO | phd-runner: [INSTANCE_ENSURE_INTERNAL - EVENT] retriable error from instance_spec_ensure
e = Communication Error: error sending request for url (http://127.0.0.1:9002/instance)
file = phd-tests/framework/src/test_vm/mod.rs
line = 320
path = phd_tests::migrate::from_base::serial_history
source = migration_serial_history_base
source_id = bf9e65c9-1f8a-4c0d-8ea4-22d92f2149fc
target = phd_framework::test_vm
target_id = 80bcf3d7-5c5a-4157-8bf0-9d2588c7a107
vm = migration_serial_history_base_lifecycle_0
vm_id = 80bcf3d7-5c5a-4157-8bf0-9d2588c7a107
|
243 | 2025-03-14T00:49:35.472Z | INFO | phd-runner: [INSTANCE_ENSURE_INTERNAL - EVENT] Started instance
file = phd-tests/framework/src/test_vm/mod.rs
instance_description.instance = Instance { properties: InstanceProperties { description: "Pheidippides-managed VM", id: 80bcf3d7-5c5a-4157-8bf0-9d2588c7a107, metadata: InstanceMetadata { project_id: 5ff5b638-a33b-4253-a2ca-33e36be4d51a, silo_id: 2f5029b1-221b-4713-9e93-84003d981b7c, sled_id: 1ae02216-ad8e-4ebc-bce7-bc09a2908eba, sled_model: "pheidippes", sled_revision: 1, sled_serial: "1ae02216-ad8e-4ebc-bce7-bc09a2908eba" }, name: "phd-vm-80bcf3d7-5c5a-4157-8bf0-9d2588c7a107" }, state: Migrating }
line = 379
path = phd_tests::migrate::from_base::serial_history
source = migration_serial_history_base
source_id = bf9e65c9-1f8a-4c0d-8ea4-22d92f2149fc
target = phd_framework::test_vm
target_id = 80bcf3d7-5c5a-4157-8bf0-9d2588c7a107
vm = migration_serial_history_base_lifecycle_0
vm_id = 80bcf3d7-5c5a-4157-8bf0-9d2588c7a107
|
244 | 2025-03-14T00:49:35.473Z | INFO | phd-runner: [INSTANCE_ENSURE_INTERNAL - END]
elapsed_milliseconds = 570
file = phd-tests/framework/src/test_vm/mod.rs
line = 276
path = phd_tests::migrate::from_base::serial_history
source = migration_serial_history_base
source_id = bf9e65c9-1f8a-4c0d-8ea4-22d92f2149fc
target = phd_framework::test_vm
target_id = 80bcf3d7-5c5a-4157-8bf0-9d2588c7a107
vm = migration_serial_history_base_lifecycle_0
vm_id = 80bcf3d7-5c5a-4157-8bf0-9d2588c7a107
|
245 | 2025-03-14T00:49:35.473Z | INFO | phd-runner: [MIGRATE - START]
file = phd-tests/framework/src/test_vm/mod.rs
line = 528
migration_id = cdb8154d-b239-442e-83fc-3622d51959ce
path = phd_tests::migrate::from_base::serial_history
source = migration_serial_history_base
source_id = bf9e65c9-1f8a-4c0d-8ea4-22d92f2149fc
target = phd_framework::test_vm
target_id = 80bcf3d7-5c5a-4157-8bf0-9d2588c7a107
|
246 | 2025-03-14T00:49:37.928Z | INFO | phd-runner: [SERIAL CONSOLE TASK - EVENT] serial socket control message
file = phd-tests/framework/src/serial/mod.rs
line = 275
s = {"Migrating":{"destination":"127.0.0.1:9002","from_start":7727}}
target = phd_framework::serial
|
247 | 2025-03-14T00:49:39.254Z | INFO | phd-runner: [MIGRATE_FROM - EVENT] Migration completed successfully
file = phd-tests/framework/src/test_vm/mod.rs
line = 541
path = phd_tests::migrate::from_base::serial_history
source = migration_serial_history_base
source_id = bf9e65c9-1f8a-4c0d-8ea4-22d92f2149fc
target = phd_framework::test_vm
target_id = 80bcf3d7-5c5a-4157-8bf0-9d2588c7a107
|
248 | 2025-03-14T00:49:39.254Z | INFO | phd-runner: [MIGRATE - END]
elapsed_milliseconds = 3780
file = phd-tests/framework/src/test_vm/mod.rs
line = 528
migration_id = cdb8154d-b239-442e-83fc-3622d51959ce
path = phd_tests::migrate::from_base::serial_history
source = migration_serial_history_base
source_id = bf9e65c9-1f8a-4c0d-8ea4-22d92f2149fc
target = phd_framework::test_vm
target_id = 80bcf3d7-5c5a-4157-8bf0-9d2588c7a107
|
249 | 2025-03-14T00:49:39.254Z | INFO | phd-runner: [MIGRATE_FROM - END]
elapsed_milliseconds = 4351
file = phd-tests/framework/src/test_vm/mod.rs
line = 474
path = phd_tests::migrate::from_base::serial_history
source = migration_serial_history_base
source_id = bf9e65c9-1f8a-4c0d-8ea4-22d92f2149fc
target = phd_framework::test_vm
target_id = 80bcf3d7-5c5a-4157-8bf0-9d2588c7a107
|
250 | 2025-03-14T00:49:39.255Z | INFO | phd-runner: [VM CLEANUP - START]
file = phd-tests/framework/src/test_vm/mod.rs
line = 1029
path = phd_tests::migrate::from_base::serial_history
target = phd_framework::test_vm
vm = migration_serial_history_base
vm_id = bf9e65c9-1f8a-4c0d-8ea4-22d92f2149fc
|
251 | 2025-03-14T00:49:39.256Z | DEBG | phd-runner: [VM CLEANUP - EVENT] Killing Propolis server process
file = phd-tests/framework/src/test_vm/server.rs
line = 125
path = phd_tests::migrate::from_base::serial_history
self.address = 127.0.0.1:9000
target = phd_framework::test_vm::server
vm = migration_serial_history_base
vm_id = bf9e65c9-1f8a-4c0d-8ea4-22d92f2149fc
|
252 | 2025-03-14T00:49:39.348Z | INFO | phd-runner: [VM CLEANUP - END]
elapsed_milliseconds = 92
file = phd-tests/framework/src/test_vm/mod.rs
line = 1029
path = phd_tests::migrate::from_base::serial_history
target = phd_framework::test_vm
vm = migration_serial_history_base
vm_id = bf9e65c9-1f8a-4c0d-8ea4-22d92f2149fc
|
253 | 2025-03-14T00:49:39.351Z | INFO | phd-runner: [VM CLEANUP - START]
file = phd-tests/framework/src/test_vm/mod.rs
line = 1029
path = phd_tests::migrate::from_base::serial_history
target = phd_framework::test_vm
vm = migration_serial_history_base_lifecycle_0
vm_id = 80bcf3d7-5c5a-4157-8bf0-9d2588c7a107
|
254 | 2025-03-14T00:49:39.351Z | DEBG | phd-runner: [SERIAL CONSOLE TASK - EVENT] serial console command channel was closed
file = phd-tests/framework/src/serial/mod.rs
line = 213
target = phd_framework::serial
|
255 | 2025-03-14T00:49:39.351Z | INFO | phd-runner: [SERIAL CONSOLE TASK - END]
elapsed_milliseconds = 8717
file = phd-tests/framework/src/serial/mod.rs
line = 200
target = phd_framework::serial
|
256 | 2025-03-14T00:49:39.351Z | INFO | phd-runner: test phd_tests::migrate::from_base::serial_history ... ok
file = phd-tests/runner/src/execute.rs
line = 129
target = phd_runner::execute
|
257 | 2025-03-14T00:49:39.351Z | INFO | phd-runner: [TEST_CLEANUP - START]
file = phd-tests/runner/src/fixtures.rs
line = 51
target = phd_runner::fixtures
|
258 | 2025-03-14T00:49:39.352Z | DEBG | phd-runner: [VM CLEANUP - EVENT] trying to ensure Propolis server VM is destroyed
file = phd-tests/framework/src/test_vm/mod.rs
line = 1052
path = phd_tests::migrate::from_base::serial_history
target = phd_framework::test_vm
vm = migration_serial_history_base_lifecycle_0
vm_id = 80bcf3d7-5c5a-4157-8bf0-9d2588c7a107
|
259 | 2025-03-14T00:49:40.088Z | DEBG | phd-runner: [VM CLEANUP - EVENT] Killing Propolis server process
file = phd-tests/framework/src/test_vm/server.rs
line = 125
path = phd_tests::migrate::from_base::serial_history
self.address = 127.0.0.1:9002
target = phd_framework::test_vm::server
vm = migration_serial_history_base_lifecycle_0
vm_id = 80bcf3d7-5c5a-4157-8bf0-9d2588c7a107
|
260 | 2025-03-14T00:49:40.180Z | DEBG | phd-runner: [VM CLEANUP - EVENT] zfs clone dropped
file = phd-tests/framework/src/zfs.rs
line = 83
path = phd_tests::migrate::from_base::serial_history
target = phd_framework::zfs
vm = migration_serial_history_base_lifecycle_0
vm_id = 80bcf3d7-5c5a-4157-8bf0-9d2588c7a107
|
261 | 2025-03-14T00:49:40.180Z | DEBG | phd-runner: [VM CLEANUP - EVENT] executing ZFS command
args = ["phd-artifacts/phd-clone-2f9abfab-7abe-443f-bbc8-8eebc7fe3e4d"]
file = phd-tests/framework/src/zfs.rs
line = 304
path = phd_tests::migrate::from_base::serial_history
target = phd_framework::zfs
verb = destroy
vm = migration_serial_history_base_lifecycle_0
vm_id = 80bcf3d7-5c5a-4157-8bf0-9d2588c7a107
|
262 | 2025-03-14T00:49:40.217Z | DEBG | phd-runner: [VM CLEANUP - EVENT] zfs snapshot dropped
file = phd-tests/framework/src/zfs.rs
line = 57
path = phd_tests::migrate::from_base::serial_history
target = phd_framework::zfs
vm = migration_serial_history_base_lifecycle_0
vm_id = 80bcf3d7-5c5a-4157-8bf0-9d2588c7a107
|
263 | 2025-03-14T00:49:40.217Z | DEBG | phd-runner: [VM CLEANUP - EVENT] executing ZFS command
args = ["phd-artifacts@phd-2c4b3144-4627-4d50-aafa-4ae1193965a2"]
file = phd-tests/framework/src/zfs.rs
line = 304
path = phd_tests::migrate::from_base::serial_history
target = phd_framework::zfs
verb = destroy
vm = migration_serial_history_base_lifecycle_0
vm_id = 80bcf3d7-5c5a-4157-8bf0-9d2588c7a107
|
264 | 2025-03-14T00:49:40.242Z | INFO | phd-runner: [VM CLEANUP - END]
elapsed_milliseconds = 891
file = phd-tests/framework/src/test_vm/mod.rs
line = 1029
path = phd_tests::migrate::from_base::serial_history
target = phd_framework::test_vm
vm = migration_serial_history_base_lifecycle_0
vm_id = 80bcf3d7-5c5a-4157-8bf0-9d2588c7a107
|
265 | 2025-03-14T00:49:40.242Z | INFO | phd-runner: [TEST - END]
elapsed_milliseconds = 10286
file = phd-tests/tests/src/migrate.rs
line = 40
path = phd_tests::migrate::from_base::serial_history
target = phd_tests::migrate::from_base
|
266 | 2025-03-14T00:49:40.242Z | INFO | phd-runner: [TEST_CLEANUP - END]
elapsed_milliseconds = 891
file = phd-tests/runner/src/fixtures.rs
line = 51
target = phd_runner::fixtures
|
267 | 2025-03-14T00:49:40.242Z | INFO | phd-runner: Starting test phd_tests::migrate::from_base::can_migrate_from_base
file = phd-tests/runner/src/execute.rs
line = 90
target = phd_runner::execute
|
268 | 2025-03-14T00:49:40.242Z | INFO | phd-runner: [TEST_SETUP - START]
file = phd-tests/runner/src/fixtures.rs
line = 41
target = phd_runner::fixtures
|
269 | 2025-03-14T00:49:40.242Z | INFO | phd-runner: [TEST_SETUP - END]
elapsed_milliseconds = 0
file = phd-tests/runner/src/fixtures.rs
line = 41
target = phd_runner::fixtures
|
270 | 2025-03-14T00:49:40.243Z | INFO | phd-runner: [TEST - START]
file = phd-tests/tests/src/migrate.rs
line = 34
path = phd_tests::migrate::from_base::can_migrate_from_base
target = phd_tests::migrate::from_base
|
271 | 2025-03-14T00:49:40.243Z | DEBG | phd-runner: [TEST - EVENT] Verified artifact already exists
file = phd-tests/framework/src/artifacts/store.rs
line = 45
path = /phd-artifacts/29813374b58e3b77fb665f2d95cb3bab37d44fdd2c4fce2a70de9d76a3512a4f/OVMF_CODE.fd
target = phd_framework::artifacts::store
|
272 | 2025-03-14T00:49:40.243Z | DEBG | phd-runner: [TEST - EVENT] Verified artifact already exists
file = phd-tests/framework/src/artifacts/store.rs
line = 45
path = /phd-artifacts/ba8007f74f9b54fbae3b2520da577831b4834778a498d732f091260c61aa7ca1/alpine.iso
target = phd_framework::artifacts::store
|
273 | 2025-03-14T00:49:40.243Z | DEBG | phd-runner: [TEST - EVENT] Verified artifact already exists
file = phd-tests/framework/src/artifacts/store.rs
line = 45
path = /phd-artifacts/ba8007f74f9b54fbae3b2520da577831b4834778a498d732f091260c61aa7ca1/alpine.iso
target = phd_framework::artifacts::store
|
274 | 2025-03-14T00:49:40.243Z | DEBG | phd-runner: [TEST - EVENT] executing ZFS command
args = ["/phd-artifacts/ba8007f74f9b54fbae3b2520da577831b4834778a498d732f091260c61aa7ca1/alpine.iso"]
file = phd-tests/framework/src/zfs.rs
line = 304
path = phd_tests::migrate::from_base::can_migrate_from_base
target = phd_framework::zfs
verb = list
|
275 | 2025-03-14T00:49:40.261Z | DEBG | phd-runner: [TEST - EVENT] parsing zfs list output
file = phd-tests/framework/src/zfs.rs
line = 238
path = phd_tests::migrate::from_base::can_migrate_from_base
stdout = NAME USED AVAIL REFER MOUNTPOINT\nphd-artifacts 688M 1.80T 687M /phd-artifacts\n
target = phd_framework::zfs
|
276 | 2025-03-14T00:49:40.261Z | DEBG | phd-runner: [TEST - EVENT] executing ZFS command
args = ["phd-artifacts@phd-35f275f9-f5dd-4b63-a2d3-8159f48d6099"]
file = phd-tests/framework/src/zfs.rs
line = 304
path = phd_tests::migrate::from_base::can_migrate_from_base
target = phd_framework::zfs
verb = snapshot
|
277 | 2025-03-14T00:49:40.285Z | DEBG | phd-runner: [TEST - EVENT] executing ZFS command
args = ["phd-artifacts@phd-35f275f9-f5dd-4b63-a2d3-8159f48d6099", "phd-artifacts/phd-clone-e88f103c-914b-4bbd-bf09-b673574c33d1"]
file = phd-tests/framework/src/zfs.rs
line = 304
path = phd_tests::migrate::from_base::can_migrate_from_base
target = phd_framework::zfs
verb = clone
|
278 | 2025-03-14T00:49:40.308Z | DEBG | phd-runner: [TEST - EVENT] executing ZFS command
args = ["phd-artifacts/phd-clone-e88f103c-914b-4bbd-bf09-b673574c33d1"]
file = phd-tests/framework/src/zfs.rs
line = 304
path = phd_tests::migrate::from_base::can_migrate_from_base
target = phd_framework::zfs
verb = list
|
279 | 2025-03-14T00:49:40.326Z | DEBG | phd-runner: [TEST - EVENT] parsing zfs list output
file = phd-tests/framework/src/zfs.rs
line = 238
path = phd_tests::migrate::from_base::can_migrate_from_base
stdout = NAME USED AVAIL REFER MOUNTPOINT\nphd-artifacts/phd-clone-e88f103c-914b-4bbd-bf09-b673574c33d1 0B 1.80T 687M /phd-artifacts/phd-clone-e88f103c-914b-4bbd-bf09-b673574c33d1\n
target = phd_framework::zfs
|
280 | 2025-03-14T00:49:40.327Z | INFO | phd-runner: [NEW - START]
file = phd-tests/framework/src/test_vm/mod.rs
line = 193
path = phd_tests::migrate::from_base::can_migrate_from_base
target = phd_framework::test_vm
|
281 | 2025-03-14T00:49:40.327Z | INFO | phd-runner: [NEW - EVENT] phd_framework::test_vm
environment = EnvironmentSpec { location: Local, propolis_artifact: "__BASE_PROPOLIS" }
file = phd-tests/framework/src/test_vm/mod.rs
guest_os_kind = Alpine
line = 211
path = phd_tests::migrate::from_base::can_migrate_from_base
target = phd_framework::test_vm
vm_name = migration_from_base
|
282 | 2025-03-14T00:49:40.327Z | DEBG | phd-runner: [NEW - EVENT] Verified artifact already exists
file = phd-tests/framework/src/artifacts/store.rs
line = 45
path = /phd-artifacts/0adadba9bdfab04f2219dad7818a591829214061ec05b3ed2b348eaf75b5a5a5/propolis-server
target = phd_framework::artifacts::store
|
283 | 2025-03-14T00:49:40.327Z | INFO | phd-runner: [NEW - EVENT] Launching Propolis server
bootrom_path = "/phd-artifacts/29813374b58e3b77fb665f2d95cb3bab37d44fdd2c4fce2a70de9d76a3512a4f/OVMF_CODE.fd"
file = phd-tests/framework/src/test_vm/server.rs
line = 55
path = phd_tests::migrate::from_base::can_migrate_from_base
server_addr = 127.0.0.1:9000
server_path = "/phd-artifacts/0adadba9bdfab04f2219dad7818a591829214061ec05b3ed2b348eaf75b5a5a5/propolis-server"
target = phd_framework::test_vm::server
|
284 | 2025-03-14T00:49:40.327Z | INFO | phd-runner: [NEW - EVENT] Opening server log files
file = phd-tests/framework/src/server_log_mode.rs
line = 64
path = phd_tests::migrate::from_base::can_migrate_from_base
stderr_path = "/tmp/propolis-phd/migration_from_base.stderr.log"
stdout_path = "/tmp/propolis-phd/migration_from_base.stdout.log"
target = phd_framework::server_log_mode
|
285 | 2025-03-14T00:49:40.339Z | INFO | phd-runner: [NEW - EVENT] Launched server with pid 892
file = phd-tests/framework/src/test_vm/server.rs
line = 107
path = phd_tests::migrate::from_base::can_migrate_from_base
target = phd_framework::test_vm::server
|
286 | 2025-03-14T00:49:40.339Z | INFO | phd-runner: [NEW - END]
elapsed_milliseconds = 11
file = phd-tests/framework/src/test_vm/mod.rs
line = 193
path = phd_tests::migrate::from_base::can_migrate_from_base
target = phd_framework::test_vm
|
287 | 2025-03-14T00:49:40.339Z | INFO | phd-runner: [INSTANCE_ENSURE_INTERNAL - START]
file = phd-tests/framework/src/test_vm/mod.rs
line = 276
path = phd_tests::migrate::from_base::can_migrate_from_base
target = phd_framework::test_vm
vm = migration_from_base
vm_id = fca0ada7-95b6-40ff-b1a7-008543a890b0
|
288 | 2025-03-14T00:49:40.340Z | INFO | phd-runner: [INSTANCE_ENSURE_INTERNAL - EVENT] retriable error from instance_spec_ensure
e = Communication Error: error sending request for url (http://127.0.0.1:9000/instance)
file = phd-tests/framework/src/test_vm/mod.rs
line = 320
path = phd_tests::migrate::from_base::can_migrate_from_base
target = phd_framework::test_vm
vm = migration_from_base
vm_id = fca0ada7-95b6-40ff-b1a7-008543a890b0
|
289 | 2025-03-14T00:49:41.007Z | INFO | phd-runner: [SERIAL CONSOLE TASK - START]
file = phd-tests/framework/src/serial/mod.rs
line = 200
target = phd_framework::serial
|
290 | 2025-03-14T00:49:41.008Z | INFO | phd-runner: [INSTANCE_ENSURE_INTERNAL - EVENT] Started instance
file = phd-tests/framework/src/test_vm/mod.rs
instance_description.instance = Instance { properties: InstanceProperties { description: "Pheidippides-managed VM", id: fca0ada7-95b6-40ff-b1a7-008543a890b0, metadata: InstanceMetadata { project_id: ac1b0804-90a8-4a5f-8631-2ba71254cb74, silo_id: 1635fbca-3b7a-4513-80cc-587e5ce674a9, sled_id: c395f4b2-055b-43df-9934-01012f607137, sled_model: "pheidippes", sled_revision: 1, sled_serial: "c395f4b2-055b-43df-9934-01012f607137" }, name: "phd-vm-fca0ada7-95b6-40ff-b1a7-008543a890b0" }, state: Creating }
line = 379
path = phd_tests::migrate::from_base::can_migrate_from_base
target = phd_framework::test_vm
vm = migration_from_base
vm_id = fca0ada7-95b6-40ff-b1a7-008543a890b0
|
291 | 2025-03-14T00:49:41.008Z | INFO | phd-runner: [INSTANCE_ENSURE_INTERNAL - END]
elapsed_milliseconds = 669
file = phd-tests/framework/src/test_vm/mod.rs
line = 276
path = phd_tests::migrate::from_base::can_migrate_from_base
target = phd_framework::test_vm
vm = migration_from_base
vm_id = fca0ada7-95b6-40ff-b1a7-008543a890b0
|
292 | 2025-03-14T00:49:41.008Z | INFO | phd-runner: [PUT_INSTANCE_STATE - START]
file = phd-tests/framework/src/test_vm/mod.rs
line = 440
path = phd_tests::migrate::from_base::can_migrate_from_base
target = phd_framework::test_vm
vm = migration_from_base
vm_id = fca0ada7-95b6-40ff-b1a7-008543a890b0
|
293 | 2025-03-14T00:49:41.008Z | INFO | phd-runner: [PUT_INSTANCE_STATE - EVENT] Requesting instance state change
file = phd-tests/framework/src/test_vm/mod.rs
line = 445
path = phd_tests::migrate::from_base::can_migrate_from_base
state = Run
target = phd_framework::test_vm
vm = migration_from_base
vm_id = fca0ada7-95b6-40ff-b1a7-008543a890b0
|
294 | 2025-03-14T00:49:41.009Z | INFO | phd-runner: [PUT_INSTANCE_STATE - END]
elapsed_milliseconds = 0
file = phd-tests/framework/src/test_vm/mod.rs
line = 440
path = phd_tests::migrate::from_base::can_migrate_from_base
target = phd_framework::test_vm
vm = migration_from_base
vm_id = fca0ada7-95b6-40ff-b1a7-008543a890b0
|
295 | 2025-03-14T00:49:41.009Z | INFO | phd-runner: [WAIT_TO_BOOT - START]
file = phd-tests/framework/src/test_vm/mod.rs
line = 757
path = phd_tests::migrate::from_base::can_migrate_from_base
target = phd_framework::test_vm
|
296 | 2025-03-14T00:49:41.009Z | INFO | phd-runner: [WAIT_TO_BOOT - EVENT] waiting for guest to boot
file = phd-tests/framework/src/test_vm/mod.rs
line = 706
path = phd_tests::migrate::from_base::can_migrate_from_base
target = phd_framework::test_vm
timeout_duration = 300s
vm = migration_from_base
vm_id = fca0ada7-95b6-40ff-b1a7-008543a890b0
|
297 | 2025-03-14T00:49:41.009Z | DEBG | phd-runner: [WAIT_TO_BOOT - EVENT] executing command in boot sequence
file = phd-tests/framework/src/test_vm/mod.rs
line = 714
path = phd_tests::migrate::from_base::can_migrate_from_base
step = WaitFor("localhost login: ")
target = phd_framework::test_vm
|
298 | 2025-03-14T00:49:41.009Z | INFO | phd-runner: [WAIT_FOR_SERIAL_OUTPUT - START]
file = phd-tests/framework/src/test_vm/mod.rs
line = 772
path = phd_tests::migrate::from_base::can_migrate_from_base
target = phd_framework::test_vm
vm = migration_from_base
vm_id = fca0ada7-95b6-40ff-b1a7-008543a890b0
|
299 | 2025-03-14T00:49:41.009Z | INFO | phd-runner: [WAIT_FOR_SERIAL_OUTPUT - EVENT] Waiting for output on serial console
file = phd-tests/framework/src/test_vm/mod.rs
line = 779
path = phd_tests::migrate::from_base::can_migrate_from_base
target = phd_framework::test_vm
timeout_duration = CallerTimeout
vm = migration_from_base
vm_id = fca0ada7-95b6-40ff-b1a7-008543a890b0
|
300 | 2025-03-14T00:49:45.138Z | INFO | phd-runner: [WAIT_FOR_SERIAL_OUTPUT - END]
elapsed_milliseconds = 4128
file = phd-tests/framework/src/test_vm/mod.rs
line = 772
path = phd_tests::migrate::from_base::can_migrate_from_base
target = phd_framework::test_vm
vm = migration_from_base
vm_id = fca0ada7-95b6-40ff-b1a7-008543a890b0
|
301 | 2025-03-14T00:49:45.138Z | DEBG | phd-runner: [WAIT_TO_BOOT - EVENT] executing command in boot sequence
file = phd-tests/framework/src/test_vm/mod.rs
line = 714
path = phd_tests::migrate::from_base::can_migrate_from_base
step = WriteStr("root")
target = phd_framework::test_vm
|
302 | 2025-03-14T00:49:45.138Z | DEBG | phd-runner: [WAIT_TO_BOOT - EVENT] executing command in boot sequence
file = phd-tests/framework/src/test_vm/mod.rs
line = 714
path = phd_tests::migrate::from_base::can_migrate_from_base
step = WaitFor("localhost:~#")
target = phd_framework::test_vm
|
303 | 2025-03-14T00:49:45.138Z | INFO | phd-runner: [WAIT_FOR_SERIAL_OUTPUT - START]
file = phd-tests/framework/src/test_vm/mod.rs
line = 772
path = phd_tests::migrate::from_base::can_migrate_from_base
target = phd_framework::test_vm
vm = migration_from_base
vm_id = fca0ada7-95b6-40ff-b1a7-008543a890b0
|
304 | 2025-03-14T00:49:45.138Z | INFO | phd-runner: [WAIT_FOR_SERIAL_OUTPUT - EVENT] Waiting for output on serial console
file = phd-tests/framework/src/test_vm/mod.rs
line = 779
path = phd_tests::migrate::from_base::can_migrate_from_base
target = phd_framework::test_vm
timeout_duration = CallerTimeout
vm = migration_from_base
vm_id = fca0ada7-95b6-40ff-b1a7-008543a890b0
|
305 | 2025-03-14T00:49:45.157Z | INFO | phd-runner: [WAIT_FOR_SERIAL_OUTPUT - END]
elapsed_milliseconds = 18
file = phd-tests/framework/src/test_vm/mod.rs
line = 772
path = phd_tests::migrate::from_base::can_migrate_from_base
target = phd_framework::test_vm
vm = migration_from_base
vm_id = fca0ada7-95b6-40ff-b1a7-008543a890b0
|
306 | 2025-03-14T00:49:45.157Z | DEBG | phd-runner: [WAIT_TO_BOOT - EVENT] executing command in boot sequence
file = phd-tests/framework/src/test_vm/mod.rs
line = 714
path = phd_tests::migrate::from_base::can_migrate_from_base
step = WriteStr("stty -F `tty` cols 9999")
target = phd_framework::test_vm
|
307 | 2025-03-14T00:49:45.157Z | DEBG | phd-runner: [WAIT_TO_BOOT - EVENT] executing command in boot sequence
file = phd-tests/framework/src/test_vm/mod.rs
line = 714
path = phd_tests::migrate::from_base::can_migrate_from_base
step = WaitFor("localhost:~#")
target = phd_framework::test_vm
|
308 | 2025-03-14T00:49:45.157Z | INFO | phd-runner: [WAIT_FOR_SERIAL_OUTPUT - START]
file = phd-tests/framework/src/test_vm/mod.rs
line = 772
path = phd_tests::migrate::from_base::can_migrate_from_base
target = phd_framework::test_vm
vm = migration_from_base
vm_id = fca0ada7-95b6-40ff-b1a7-008543a890b0
|
309 | 2025-03-14T00:49:45.157Z | INFO | phd-runner: [WAIT_FOR_SERIAL_OUTPUT - EVENT] Waiting for output on serial console
file = phd-tests/framework/src/test_vm/mod.rs
line = 779
path = phd_tests::migrate::from_base::can_migrate_from_base
target = phd_framework::test_vm
timeout_duration = CallerTimeout
vm = migration_from_base
vm_id = fca0ada7-95b6-40ff-b1a7-008543a890b0
|
310 | 2025-03-14T00:49:45.190Z | INFO | phd-runner: [WAIT_FOR_SERIAL_OUTPUT - END]
elapsed_milliseconds = 32
file = phd-tests/framework/src/test_vm/mod.rs
line = 772
path = phd_tests::migrate::from_base::can_migrate_from_base
target = phd_framework::test_vm
vm = migration_from_base
vm_id = fca0ada7-95b6-40ff-b1a7-008543a890b0
|
311 | 2025-03-14T00:49:45.190Z | INFO | phd-runner: [WAIT_TO_BOOT - EVENT] Guest has booted
file = phd-tests/framework/src/test_vm/mod.rs
line = 754
path = phd_tests::migrate::from_base::can_migrate_from_base
target = phd_framework::test_vm
|
312 | 2025-03-14T00:49:45.190Z | INFO | phd-runner: [WAIT_TO_BOOT - END]
elapsed_milliseconds = 4181
file = phd-tests/framework/src/test_vm/mod.rs
line = 757
path = phd_tests::migrate::from_base::can_migrate_from_base
target = phd_framework::test_vm
|
313 | 2025-03-14T00:49:45.190Z | INFO | phd-runner: [WAIT_FOR_SERIAL_OUTPUT - START]
file = phd-tests/framework/src/test_vm/mod.rs
line = 772
path = phd_tests::migrate::from_base::can_migrate_from_base
target = phd_framework::test_vm
vm = migration_from_base
vm_id = fca0ada7-95b6-40ff-b1a7-008543a890b0
|
314 | 2025-03-14T00:49:45.191Z | INFO | phd-runner: [WAIT_FOR_SERIAL_OUTPUT - EVENT] Waiting for output on serial console
file = phd-tests/framework/src/test_vm/mod.rs
line = 779
path = phd_tests::migrate::from_base::can_migrate_from_base
target = phd_framework::test_vm
timeout_duration = Explicit(15s)
vm = migration_from_base
vm_id = fca0ada7-95b6-40ff-b1a7-008543a890b0
|
315 | 2025-03-14T00:49:45.201Z | INFO | phd-runner: [WAIT_FOR_SERIAL_OUTPUT - END]
elapsed_milliseconds = 10
file = phd-tests/framework/src/test_vm/mod.rs
line = 772
path = phd_tests::migrate::from_base::can_migrate_from_base
target = phd_framework::test_vm
vm = migration_from_base
vm_id = fca0ada7-95b6-40ff-b1a7-008543a890b0
|
316 | 2025-03-14T00:49:45.201Z | INFO | phd-runner: [WAIT_FOR_SERIAL_OUTPUT - START]
file = phd-tests/framework/src/test_vm/mod.rs
line = 772
path = phd_tests::migrate::from_base::can_migrate_from_base
target = phd_framework::test_vm
vm = migration_from_base
vm_id = fca0ada7-95b6-40ff-b1a7-008543a890b0
|
317 | 2025-03-14T00:49:45.201Z | INFO | phd-runner: [WAIT_FOR_SERIAL_OUTPUT - EVENT] Waiting for output on serial console
file = phd-tests/framework/src/test_vm/mod.rs
line = 779
path = phd_tests::migrate::from_base::can_migrate_from_base
target = phd_framework::test_vm
timeout_duration = Explicit(300s)
vm = migration_from_base
vm_id = fca0ada7-95b6-40ff-b1a7-008543a890b0
|
318 | 2025-03-14T00:49:45.234Z | INFO | phd-runner: [WAIT_FOR_SERIAL_OUTPUT - END]
elapsed_milliseconds = 32
file = phd-tests/framework/src/test_vm/mod.rs
line = 772
path = phd_tests::migrate::from_base::can_migrate_from_base
target = phd_framework::test_vm
vm = migration_from_base
vm_id = fca0ada7-95b6-40ff-b1a7-008543a890b0
|
319 | 2025-03-14T00:49:45.234Z | INFO | phd-runner: [WAIT_FOR_SERIAL_OUTPUT - START]
file = phd-tests/framework/src/test_vm/mod.rs
line = 772
path = phd_tests::migrate::from_base::can_migrate_from_base
target = phd_framework::test_vm
vm = migration_from_base
vm_id = fca0ada7-95b6-40ff-b1a7-008543a890b0
|
320 | 2025-03-14T00:49:45.234Z | INFO | phd-runner: [WAIT_FOR_SERIAL_OUTPUT - EVENT] Waiting for output on serial console
file = phd-tests/framework/src/test_vm/mod.rs
line = 779
path = phd_tests::migrate::from_base::can_migrate_from_base
target = phd_framework::test_vm
timeout_duration = Explicit(15s)
vm = migration_from_base
vm_id = fca0ada7-95b6-40ff-b1a7-008543a890b0
|
321 | 2025-03-14T00:49:45.245Z | INFO | phd-runner: [WAIT_FOR_SERIAL_OUTPUT - END]
elapsed_milliseconds = 10
file = phd-tests/framework/src/test_vm/mod.rs
line = 772
path = phd_tests::migrate::from_base::can_migrate_from_base
target = phd_framework::test_vm
vm = migration_from_base
vm_id = fca0ada7-95b6-40ff-b1a7-008543a890b0
|
322 | 2025-03-14T00:49:45.245Z | INFO | phd-runner: [WAIT_FOR_SERIAL_OUTPUT - START]
file = phd-tests/framework/src/test_vm/mod.rs
line = 772
path = phd_tests::migrate::from_base::can_migrate_from_base
target = phd_framework::test_vm
vm = migration_from_base
vm_id = fca0ada7-95b6-40ff-b1a7-008543a890b0
|
323 | 2025-03-14T00:49:45.245Z | INFO | phd-runner: [WAIT_FOR_SERIAL_OUTPUT - EVENT] Waiting for output on serial console
file = phd-tests/framework/src/test_vm/mod.rs
line = 779
path = phd_tests::migrate::from_base::can_migrate_from_base
target = phd_framework::test_vm
timeout_duration = Explicit(300s)
vm = migration_from_base
vm_id = fca0ada7-95b6-40ff-b1a7-008543a890b0
|
324 | 2025-03-14T00:49:45.267Z | INFO | phd-runner: [WAIT_FOR_SERIAL_OUTPUT - END]
elapsed_milliseconds = 21
file = phd-tests/framework/src/test_vm/mod.rs
line = 772
path = phd_tests::migrate::from_base::can_migrate_from_base
target = phd_framework::test_vm
vm = migration_from_base
vm_id = fca0ada7-95b6-40ff-b1a7-008543a890b0
|
325 | 2025-03-14T00:49:45.267Z | INFO | phd-runner: [WAIT_FOR_SERIAL_OUTPUT - START]
file = phd-tests/framework/src/test_vm/mod.rs
line = 772
path = phd_tests::migrate::from_base::can_migrate_from_base
target = phd_framework::test_vm
vm = migration_from_base
vm_id = fca0ada7-95b6-40ff-b1a7-008543a890b0
|
326 | 2025-03-14T00:49:45.267Z | INFO | phd-runner: [WAIT_FOR_SERIAL_OUTPUT - EVENT] Waiting for output on serial console
file = phd-tests/framework/src/test_vm/mod.rs
line = 779
path = phd_tests::migrate::from_base::can_migrate_from_base
target = phd_framework::test_vm
timeout_duration = Explicit(15s)
vm = migration_from_base
vm_id = fca0ada7-95b6-40ff-b1a7-008543a890b0
|
327 | 2025-03-14T00:49:45.278Z | INFO | phd-runner: [WAIT_FOR_SERIAL_OUTPUT - END]
elapsed_milliseconds = 11
file = phd-tests/framework/src/test_vm/mod.rs
line = 772
path = phd_tests::migrate::from_base::can_migrate_from_base
target = phd_framework::test_vm
vm = migration_from_base
vm_id = fca0ada7-95b6-40ff-b1a7-008543a890b0
|
328 | 2025-03-14T00:49:45.278Z | INFO | phd-runner: [WAIT_FOR_SERIAL_OUTPUT - START]
file = phd-tests/framework/src/test_vm/mod.rs
line = 772
path = phd_tests::migrate::from_base::can_migrate_from_base
target = phd_framework::test_vm
vm = migration_from_base
vm_id = fca0ada7-95b6-40ff-b1a7-008543a890b0
|
329 | 2025-03-14T00:49:45.279Z | INFO | phd-runner: [WAIT_FOR_SERIAL_OUTPUT - EVENT] Waiting for output on serial console
file = phd-tests/framework/src/test_vm/mod.rs
line = 779
path = phd_tests::migrate::from_base::can_migrate_from_base
target = phd_framework::test_vm
timeout_duration = Explicit(300s)
vm = migration_from_base
vm_id = fca0ada7-95b6-40ff-b1a7-008543a890b0
|
330 | 2025-03-14T00:49:45.301Z | INFO | phd-runner: [WAIT_FOR_SERIAL_OUTPUT - END]
elapsed_milliseconds = 22
file = phd-tests/framework/src/test_vm/mod.rs
line = 772
path = phd_tests::migrate::from_base::can_migrate_from_base
target = phd_framework::test_vm
vm = migration_from_base
vm_id = fca0ada7-95b6-40ff-b1a7-008543a890b0
|
331 | 2025-03-14T00:49:45.301Z | INFO | phd-runner: [TEST - EVENT] migrating to new Propolis artifact for lifecycle test
file = phd-tests/framework/src/lifecycle.rs
line = 73
path = phd_tests::migrate::from_base::can_migrate_from_base
propolis_artifact = __DEFAULT_PROPOLIS
target = phd_framework::lifecycle
vm_name = migration_from_base
|
332 | 2025-03-14T00:49:45.301Z | INFO | phd-runner: [NEW - START]
file = phd-tests/framework/src/test_vm/mod.rs
line = 193
path = phd_tests::migrate::from_base::can_migrate_from_base
target = phd_framework::test_vm
|
333 | 2025-03-14T00:49:45.301Z | INFO | phd-runner: [NEW - EVENT] phd_framework::test_vm
environment = EnvironmentSpec { location: Local, propolis_artifact: "__DEFAULT_PROPOLIS" }
file = phd-tests/framework/src/test_vm/mod.rs
guest_os_kind = Alpine
line = 211
path = phd_tests::migrate::from_base::can_migrate_from_base
target = phd_framework::test_vm
vm_name = migration_from_base_lifecycle_0
|
334 | 2025-03-14T00:49:45.302Z | DEBG | phd-runner: [NEW - EVENT] Verified artifact already exists
file = phd-tests/framework/src/artifacts/store.rs
line = 45
path = /work/phd-test/propolis-server
target = phd_framework::artifacts::store
|
335 | 2025-03-14T00:49:45.302Z | INFO | phd-runner: [NEW - EVENT] Launching Propolis server
bootrom_path = "/phd-artifacts/29813374b58e3b77fb665f2d95cb3bab37d44fdd2c4fce2a70de9d76a3512a4f/OVMF_CODE.fd"
file = phd-tests/framework/src/test_vm/server.rs
line = 55
path = phd_tests::migrate::from_base::can_migrate_from_base
server_addr = 127.0.0.1:9002
server_path = "/work/phd-test/propolis-server"
target = phd_framework::test_vm::server
|
336 | 2025-03-14T00:49:45.302Z | INFO | phd-runner: [NEW - EVENT] Opening server log files
file = phd-tests/framework/src/server_log_mode.rs
line = 64
path = phd_tests::migrate::from_base::can_migrate_from_base
stderr_path = "/tmp/propolis-phd/migration_from_base_lifecycle_0.stderr.log"
stdout_path = "/tmp/propolis-phd/migration_from_base_lifecycle_0.stdout.log"
target = phd_framework::server_log_mode
|
337 | 2025-03-14T00:49:45.319Z | INFO | phd-runner: [NEW - EVENT] Launched server with pid 893
file = phd-tests/framework/src/test_vm/server.rs
line = 107
path = phd_tests::migrate::from_base::can_migrate_from_base
target = phd_framework::test_vm::server
|
338 | 2025-03-14T00:49:45.319Z | INFO | phd-runner: [NEW - END]
elapsed_milliseconds = 17
file = phd-tests/framework/src/test_vm/mod.rs
line = 193
path = phd_tests::migrate::from_base::can_migrate_from_base
target = phd_framework::test_vm
|
339 | 2025-03-14T00:49:45.319Z | INFO | phd-runner: [MIGRATE_FROM - START]
file = phd-tests/framework/src/test_vm/mod.rs
line = 474
path = phd_tests::migrate::from_base::can_migrate_from_base
source = migration_from_base
source_id = fca0ada7-95b6-40ff-b1a7-008543a890b0
target = phd_framework::test_vm
target_id = ec4f641b-db37-4b8d-84c3-527b7ba282bc
|
340 | 2025-03-14T00:49:45.319Z | INFO | phd-runner: [MIGRATE_FROM - EVENT] Migrating from source at address 127.0.0.1:9000
file = phd-tests/framework/src/test_vm/mod.rs
line = 507
migration_id = b8160b20-3a73-462d-903f-0cb478751e5e
path = phd_tests::migrate::from_base::can_migrate_from_base
source = migration_from_base
source_id = fca0ada7-95b6-40ff-b1a7-008543a890b0
target = phd_framework::test_vm
target_id = ec4f641b-db37-4b8d-84c3-527b7ba282bc
timeout_duration = 45s
|
341 | 2025-03-14T00:49:45.319Z | INFO | phd-runner: [INSTANCE_ENSURE_INTERNAL - START]
file = phd-tests/framework/src/test_vm/mod.rs
line = 276
path = phd_tests::migrate::from_base::can_migrate_from_base
source = migration_from_base
source_id = fca0ada7-95b6-40ff-b1a7-008543a890b0
target = phd_framework::test_vm
target_id = ec4f641b-db37-4b8d-84c3-527b7ba282bc
vm = migration_from_base_lifecycle_0
vm_id = ec4f641b-db37-4b8d-84c3-527b7ba282bc
|
342 | 2025-03-14T00:49:45.319Z | INFO | phd-runner: [INSTANCE_ENSURE_INTERNAL - EVENT] retriable error from instance_spec_ensure
e = Communication Error: error sending request for url (http://127.0.0.1:9002/instance)
file = phd-tests/framework/src/test_vm/mod.rs
line = 320
path = phd_tests::migrate::from_base::can_migrate_from_base
source = migration_from_base
source_id = fca0ada7-95b6-40ff-b1a7-008543a890b0
target = phd_framework::test_vm
target_id = ec4f641b-db37-4b8d-84c3-527b7ba282bc
vm = migration_from_base_lifecycle_0
vm_id = ec4f641b-db37-4b8d-84c3-527b7ba282bc
|
343 | 2025-03-14T00:49:45.737Z | INFO | phd-runner: [INSTANCE_ENSURE_INTERNAL - EVENT] Started instance
file = phd-tests/framework/src/test_vm/mod.rs
instance_description.instance = Instance { properties: InstanceProperties { description: "Pheidippides-managed VM", id: ec4f641b-db37-4b8d-84c3-527b7ba282bc, metadata: InstanceMetadata { project_id: ac1b0804-90a8-4a5f-8631-2ba71254cb74, silo_id: 1635fbca-3b7a-4513-80cc-587e5ce674a9, sled_id: ccefce55-d24c-49f7-bb68-09f6f3aab5a9, sled_model: "pheidippes", sled_revision: 1, sled_serial: "ccefce55-d24c-49f7-bb68-09f6f3aab5a9" }, name: "phd-vm-ec4f641b-db37-4b8d-84c3-527b7ba282bc" }, state: Migrating }
line = 379
path = phd_tests::migrate::from_base::can_migrate_from_base
source = migration_from_base
source_id = fca0ada7-95b6-40ff-b1a7-008543a890b0
target = phd_framework::test_vm
target_id = ec4f641b-db37-4b8d-84c3-527b7ba282bc
vm = migration_from_base_lifecycle_0
vm_id = ec4f641b-db37-4b8d-84c3-527b7ba282bc
|
344 | 2025-03-14T00:49:45.737Z | INFO | phd-runner: [INSTANCE_ENSURE_INTERNAL - END]
elapsed_milliseconds = 418
file = phd-tests/framework/src/test_vm/mod.rs
line = 276
path = phd_tests::migrate::from_base::can_migrate_from_base
source = migration_from_base
source_id = fca0ada7-95b6-40ff-b1a7-008543a890b0
target = phd_framework::test_vm
target_id = ec4f641b-db37-4b8d-84c3-527b7ba282bc
vm = migration_from_base_lifecycle_0
vm_id = ec4f641b-db37-4b8d-84c3-527b7ba282bc
|
345 | 2025-03-14T00:49:45.737Z | INFO | phd-runner: [MIGRATE - START]
file = phd-tests/framework/src/test_vm/mod.rs
line = 528
migration_id = b8160b20-3a73-462d-903f-0cb478751e5e
path = phd_tests::migrate::from_base::can_migrate_from_base
source = migration_from_base
source_id = fca0ada7-95b6-40ff-b1a7-008543a890b0
target = phd_framework::test_vm
target_id = ec4f641b-db37-4b8d-84c3-527b7ba282bc
|
346 | 2025-03-14T00:49:48.180Z | INFO | phd-runner: [SERIAL CONSOLE TASK - EVENT] serial socket control message
file = phd-tests/framework/src/serial/mod.rs
line = 275
s = {"Migrating":{"destination":"127.0.0.1:9002","from_start":7760}}
target = phd_framework::serial
|
347 | 2025-03-14T00:49:50.143Z | INFO | phd-runner: [MIGRATE_FROM - EVENT] Migration completed successfully
file = phd-tests/framework/src/test_vm/mod.rs
line = 541
path = phd_tests::migrate::from_base::can_migrate_from_base
source = migration_from_base
source_id = fca0ada7-95b6-40ff-b1a7-008543a890b0
target = phd_framework::test_vm
target_id = ec4f641b-db37-4b8d-84c3-527b7ba282bc
|
348 | 2025-03-14T00:49:50.143Z | INFO | phd-runner: [MIGRATE - END]
elapsed_milliseconds = 4406
file = phd-tests/framework/src/test_vm/mod.rs
line = 528
migration_id = b8160b20-3a73-462d-903f-0cb478751e5e
path = phd_tests::migrate::from_base::can_migrate_from_base
source = migration_from_base
source_id = fca0ada7-95b6-40ff-b1a7-008543a890b0
target = phd_framework::test_vm
target_id = ec4f641b-db37-4b8d-84c3-527b7ba282bc
|
349 | 2025-03-14T00:49:50.144Z | INFO | phd-runner: [MIGRATE_FROM - END]
elapsed_milliseconds = 4824
file = phd-tests/framework/src/test_vm/mod.rs
line = 474
path = phd_tests::migrate::from_base::can_migrate_from_base
source = migration_from_base
source_id = fca0ada7-95b6-40ff-b1a7-008543a890b0
target = phd_framework::test_vm
target_id = ec4f641b-db37-4b8d-84c3-527b7ba282bc
|
350 | 2025-03-14T00:49:50.145Z | INFO | phd-runner: [VM CLEANUP - START]
file = phd-tests/framework/src/test_vm/mod.rs
line = 1029
path = phd_tests::migrate::from_base::can_migrate_from_base
target = phd_framework::test_vm
vm = migration_from_base
vm_id = fca0ada7-95b6-40ff-b1a7-008543a890b0
|
351 | 2025-03-14T00:49:50.145Z | INFO | phd-runner: [WAIT_FOR_SERIAL_OUTPUT - START]
file = phd-tests/framework/src/test_vm/mod.rs
line = 772
path = phd_tests::migrate::from_base::can_migrate_from_base
target = phd_framework::test_vm
vm = migration_from_base_lifecycle_0
vm_id = ec4f641b-db37-4b8d-84c3-527b7ba282bc
|
352 | 2025-03-14T00:49:50.145Z | INFO | phd-runner: [WAIT_FOR_SERIAL_OUTPUT - EVENT] Waiting for output on serial console
file = phd-tests/framework/src/test_vm/mod.rs
line = 779
path = phd_tests::migrate::from_base::can_migrate_from_base
target = phd_framework::test_vm
timeout_duration = Explicit(15s)
vm = migration_from_base_lifecycle_0
vm_id = ec4f641b-db37-4b8d-84c3-527b7ba282bc
|
353 | 2025-03-14T00:49:50.146Z | DEBG | phd-runner: [VM CLEANUP - EVENT] Killing Propolis server process
file = phd-tests/framework/src/test_vm/server.rs
line = 125
path = phd_tests::migrate::from_base::can_migrate_from_base
self.address = 127.0.0.1:9000
target = phd_framework::test_vm::server
vm = migration_from_base
vm_id = fca0ada7-95b6-40ff-b1a7-008543a890b0
|
354 | 2025-03-14T00:49:50.240Z | INFO | phd-runner: [VM CLEANUP - END]
elapsed_milliseconds = 94
file = phd-tests/framework/src/test_vm/mod.rs
line = 1029
path = phd_tests::migrate::from_base::can_migrate_from_base
target = phd_framework::test_vm
vm = migration_from_base
vm_id = fca0ada7-95b6-40ff-b1a7-008543a890b0
|
355 | 2025-03-14T00:49:50.240Z | INFO | phd-runner: [WAIT_FOR_SERIAL_OUTPUT - END]
elapsed_milliseconds = 94
file = phd-tests/framework/src/test_vm/mod.rs
line = 772
path = phd_tests::migrate::from_base::can_migrate_from_base
target = phd_framework::test_vm
vm = migration_from_base_lifecycle_0
vm_id = ec4f641b-db37-4b8d-84c3-527b7ba282bc
|
356 | 2025-03-14T00:49:50.240Z | INFO | phd-runner: [WAIT_FOR_SERIAL_OUTPUT - START]
file = phd-tests/framework/src/test_vm/mod.rs
line = 772
path = phd_tests::migrate::from_base::can_migrate_from_base
target = phd_framework::test_vm
vm = migration_from_base_lifecycle_0
vm_id = ec4f641b-db37-4b8d-84c3-527b7ba282bc
|
357 | 2025-03-14T00:49:50.240Z | INFO | phd-runner: [WAIT_FOR_SERIAL_OUTPUT - EVENT] Waiting for output on serial console
file = phd-tests/framework/src/test_vm/mod.rs
line = 779
path = phd_tests::migrate::from_base::can_migrate_from_base
target = phd_framework::test_vm
timeout_duration = Explicit(300s)
vm = migration_from_base_lifecycle_0
vm_id = ec4f641b-db37-4b8d-84c3-527b7ba282bc
|
358 | 2025-03-14T00:49:50.273Z | INFO | phd-runner: [WAIT_FOR_SERIAL_OUTPUT - END]
elapsed_milliseconds = 32
file = phd-tests/framework/src/test_vm/mod.rs
line = 772
path = phd_tests::migrate::from_base::can_migrate_from_base
target = phd_framework::test_vm
vm = migration_from_base_lifecycle_0
vm_id = ec4f641b-db37-4b8d-84c3-527b7ba282bc
|
359 | 2025-03-14T00:49:50.273Z | INFO | phd-runner: [VM CLEANUP - START]
file = phd-tests/framework/src/test_vm/mod.rs
line = 1029
path = phd_tests::migrate::from_base::can_migrate_from_base
target = phd_framework::test_vm
vm = migration_from_base_lifecycle_0
vm_id = ec4f641b-db37-4b8d-84c3-527b7ba282bc
|
360 | 2025-03-14T00:49:50.274Z | DEBG | phd-runner: [SERIAL CONSOLE TASK - EVENT] serial console command channel was closed
file = phd-tests/framework/src/serial/mod.rs
line = 213
target = phd_framework::serial
|
361 | 2025-03-14T00:49:50.274Z | INFO | phd-runner: test phd_tests::migrate::from_base::can_migrate_from_base ... ok
file = phd-tests/runner/src/execute.rs
line = 129
target = phd_runner::execute
|
362 | 2025-03-14T00:49:50.274Z | INFO | phd-runner: [SERIAL CONSOLE TASK - END]
elapsed_milliseconds = 9266
file = phd-tests/framework/src/serial/mod.rs
line = 200
target = phd_framework::serial
|
363 | 2025-03-14T00:49:50.274Z | INFO | phd-runner: [TEST_CLEANUP - START]
file = phd-tests/runner/src/fixtures.rs
line = 51
target = phd_runner::fixtures
|
364 | 2025-03-14T00:49:50.274Z | DEBG | phd-runner: [VM CLEANUP - EVENT] trying to ensure Propolis server VM is destroyed
file = phd-tests/framework/src/test_vm/mod.rs
line = 1052
path = phd_tests::migrate::from_base::can_migrate_from_base
target = phd_framework::test_vm
vm = migration_from_base_lifecycle_0
vm_id = ec4f641b-db37-4b8d-84c3-527b7ba282bc
|
365 | 2025-03-14T00:49:50.559Z | DEBG | phd-runner: [VM CLEANUP - EVENT] Killing Propolis server process
file = phd-tests/framework/src/test_vm/server.rs
line = 125
path = phd_tests::migrate::from_base::can_migrate_from_base
self.address = 127.0.0.1:9002
target = phd_framework::test_vm::server
vm = migration_from_base_lifecycle_0
vm_id = ec4f641b-db37-4b8d-84c3-527b7ba282bc
|
366 | 2025-03-14T00:49:50.653Z | DEBG | phd-runner: [VM CLEANUP - EVENT] zfs clone dropped
file = phd-tests/framework/src/zfs.rs
line = 83
path = phd_tests::migrate::from_base::can_migrate_from_base
target = phd_framework::zfs
vm = migration_from_base_lifecycle_0
vm_id = ec4f641b-db37-4b8d-84c3-527b7ba282bc
|
367 | 2025-03-14T00:49:50.653Z | DEBG | phd-runner: [VM CLEANUP - EVENT] executing ZFS command
args = ["phd-artifacts/phd-clone-e88f103c-914b-4bbd-bf09-b673574c33d1"]
file = phd-tests/framework/src/zfs.rs
line = 304
path = phd_tests::migrate::from_base::can_migrate_from_base
target = phd_framework::zfs
verb = destroy
vm = migration_from_base_lifecycle_0
vm_id = ec4f641b-db37-4b8d-84c3-527b7ba282bc
|
368 | 2025-03-14T00:49:50.690Z | DEBG | phd-runner: [VM CLEANUP - EVENT] zfs snapshot dropped
file = phd-tests/framework/src/zfs.rs
line = 57
path = phd_tests::migrate::from_base::can_migrate_from_base
target = phd_framework::zfs
vm = migration_from_base_lifecycle_0
vm_id = ec4f641b-db37-4b8d-84c3-527b7ba282bc
|
369 | 2025-03-14T00:49:50.690Z | DEBG | phd-runner: [VM CLEANUP - EVENT] executing ZFS command
args = ["phd-artifacts@phd-35f275f9-f5dd-4b63-a2d3-8159f48d6099"]
file = phd-tests/framework/src/zfs.rs
line = 304
path = phd_tests::migrate::from_base::can_migrate_from_base
target = phd_framework::zfs
verb = destroy
vm = migration_from_base_lifecycle_0
vm_id = ec4f641b-db37-4b8d-84c3-527b7ba282bc
|
370 | 2025-03-14T00:49:50.716Z | INFO | phd-runner: [VM CLEANUP - END]
elapsed_milliseconds = 442
file = phd-tests/framework/src/test_vm/mod.rs
line = 1029
path = phd_tests::migrate::from_base::can_migrate_from_base
target = phd_framework::test_vm
vm = migration_from_base_lifecycle_0
vm_id = ec4f641b-db37-4b8d-84c3-527b7ba282bc
|
371 | 2025-03-14T00:49:50.716Z | INFO | phd-runner: [TEST - END]
elapsed_milliseconds = 10473
file = phd-tests/tests/src/migrate.rs
line = 34
path = phd_tests::migrate::from_base::can_migrate_from_base
target = phd_tests::migrate::from_base
|
372 | 2025-03-14T00:49:50.716Z | INFO | phd-runner: [TEST_CLEANUP - END]
elapsed_milliseconds = 442
file = phd-tests/runner/src/fixtures.rs
line = 51
target = phd_runner::fixtures
|
373 | 2025-03-14T00:49:50.717Z | INFO | phd-runner: [EXECUTION_CLEANUP - START]
file = phd-tests/runner/src/fixtures.rs
line = 35
target = phd_runner::fixtures
|
374 | 2025-03-14T00:49:50.717Z | INFO | phd-runner: [EXECUTION_CLEANUP - END]
elapsed_milliseconds = 0
file = phd-tests/runner/src/fixtures.rs
line = 35
target = phd_runner::fixtures
|
375 | | test result: ok. 3 passed; 0 failed; 0 skipped; 0 not run; finished in 110.08s |
376 | | |
377 | 2025-03-14T00:49:50.717Z | DEBG | phd-runner: phd_runner
exit_code = 0
file = phd-tests/runner/src/main.rs
line = 40
target = phd_runner
|