| 1 | 2026-09-08T19:40:29.030Z | INFO | phd-runner: phd_runner
file = phd-tests/runner/src/main.rs
line = 36
runner_args = ProcessArgs { command: Run(RunOptions { propolis_server_cmd: "/work/phd-test/propolis-server", base_propolis_branch: Some("master"), base_propolis_commit: None, base_propolis_cmd: None, crucible_downstairs_cmd: None, crucible_downstairs_commit: Some(Auto), tmp_directory: "/tmp/propolis-phd", artifact_directory: Some("/phd-artifacts"), output_mode: TmpFile, default_guest_cpus: 2, default_guest_memory_mib: 512, artifact_toml_path: "/work/phd-test/artifacts.toml", default_guest_artifact: "alpine", default_bootrom_artifact: "ovmf", include_filter: ["phd_tests::migrate::from_base"], exclude_filter: [], max_buildomat_wait_secs: 1200, manual_stop_on_failure: false }), disable_ansi: false, emit_bunyan: true }
target = phd_runner
|
| 2 | 2026-09-08T19:40:29.054Z | DEBG | phd-runner: Created new artifact store from manifest
file = phd-tests/framework/src/artifacts/store.rs
line = 219
store = Store { local_dir: "/phd-artifacts", artifacts: {"alpine": Mutex { data: StoredArtifact { description: Artifact { filename: "alpine.iso", kind: GuestOs(Alpine), source: RemoteServer { sha256: "ba8007f74f9b54fbae3b2520da577831b4834778a498d732f091260c61aa7ca1" }, untar: None }, cached_path: None } }, "ovmf": Mutex { data: StoredArtifact { description: Artifact { filename: "OVMF_CODE.fd", kind: Bootrom, source: Buildomat(BuildomatArtifact { repo: Repo("oxidecomputer/edk2"), series: Series("image_debug"), commit: Commit("bf64f45b1a58e69d126a3c6ca1e4512c88668132"), sha256: "740187046a7267d0de72d3455070333547dbc0ea023531471fb2b2a61effa448" }), untar: None }, cached_path: None } }}, downloader: DownloadConfig { timeout: 600s, buildomat_backoff: ExponentialBackoff { current_interval: 1s, initial_interval: 1s, randomization_factor: 0.5, multiplier: 1.5, max_interval: 60s, start_time: Instant { tv_sec: 264, tv_nsec: 422894129 }, max_elapsed_time: Some(1200s), clock: SystemClock }, remote_server_uris: ["https://oxide-omicron-build.s3.amazonaws.com"] } }
target = phd_framework::artifacts::store
|
| 3 | 2026-09-08T19:40:29.055Z | INFO | phd-runner: Adding Propolis server from local command
file = phd-tests/framework/src/artifacts/store.rs
line = 227
propolis_server_cmd = /work/phd-test/propolis-server
target = phd_framework::artifacts::store
|
| 4 | 2026-09-08T19:40:29.057Z | INFO | phd-runner: Adding crucible-downstairs from Buildomat Git revision
commit = ad8a31742adc45e925e63443a5b43c8e30604022
file = phd-tests/framework/src/artifacts/store.rs
line = 311
target = phd_framework::artifacts::store
|
| 5 | 2026-09-08T19:40:29.062Z | DEBG | phd-runner: Downloading file from Buildomat...
file = phd-tests/framework/src/artifacts/buildomat.rs
line = 215
target = phd_framework::artifacts::buildomat
timeout = 600s
uri = https://buildomat.eng.oxide.computer/public/file/oxidecomputer/crucible/nightly-image/ad8a31742adc45e925e63443a5b43c8e30604022/crucible-nightly.sha256.txt
|
| 6 | 2026-09-08T19:40:29.305Z | INFO | phd-runner: Adding 'current' Propolis server from Buildomat Git branch 'master'
file = phd-tests/framework/src/artifacts/store.rs
line = 248
target = phd_framework::artifacts::store
|
| 7 | 2026-09-08T19:40:29.876Z | DEBG | phd-runner: Downloading file from Buildomat...
file = phd-tests/framework/src/artifacts/buildomat.rs
line = 215
target = phd_framework::artifacts::buildomat
timeout = 600s
uri = https://buildomat.eng.oxide.computer/public/file/oxidecomputer/propolis/phd_build/3408a2d02097cd0634d2904bac4f531b600257cb/propolis-server.sha256.txt
|
| 8 | 2026-09-08T19:40:30.049Z | INFO | phd-runner: [EXECUTION_SETUP - START]
file = phd-tests/runner/src/fixtures.rs
line = 25
target = phd_runner::fixtures
|
| 9 | 2026-09-08T19:40:30.049Z | INFO | phd-runner: [EXECUTION_SETUP - END]
elapsed_milliseconds = 0
file = phd-tests/runner/src/fixtures.rs
line = 25
target = phd_runner::fixtures
|
| 10 | 2026-09-08T19:40:30.052Z | INFO | phd-runner: Running 3 test(s)
file = phd-tests/runner/src/execute.rs
line = 83
target = phd_runner::execute
|
| 11 | 2026-09-08T19:40:30.053Z | INFO | phd-runner: Starting test phd_tests::migrate::from_base::serial_history
file = phd-tests/runner/src/execute.rs
line = 91
target = phd_runner::execute
|
| 12 | 2026-09-08T19:40:30.053Z | INFO | phd-runner: [TEST_SETUP - START]
file = phd-tests/runner/src/fixtures.rs
line = 41
target = phd_runner::fixtures
|
| 13 | 2026-09-08T19:40:30.053Z | INFO | phd-runner: [TEST_SETUP - END]
elapsed_milliseconds = 0
file = phd-tests/runner/src/fixtures.rs
line = 41
target = phd_runner::fixtures
|
| 14 | 2026-09-08T19:40:30.055Z | INFO | phd-runner: [TEST - START]
file = phd-tests/tests/src/migrate.rs
line = 40
path = phd_tests::migrate::from_base::serial_history
target = phd_tests::migrate::from_base
|
| 15 | 2026-09-08T19:40:30.057Z | DEBG | phd-runner: [TEST - EVENT] checking for existing copy of artifact
file = phd-tests/framework/src/artifacts/store.rs
line = 89
maybe_path = /phd-artifacts/740187046a7267d0de72d3455070333547dbc0ea023531471fb2b2a61effa448/OVMF_CODE.fd
path = phd_tests::migrate::from_base::serial_history
target = phd_framework::artifacts::store
|
| 16 | 2026-09-08T19:40:30.059Z | DEBG | phd-runner: [TEST - EVENT] Downloading file from Buildomat...
file = phd-tests/framework/src/artifacts/buildomat.rs
line = 215
path = phd_tests::migrate::from_base::serial_history
target = phd_framework::artifacts::buildomat
timeout = 600s
uri = https://buildomat.eng.oxide.computer/public/file/oxidecomputer/edk2/image_debug/bf64f45b1a58e69d126a3c6ca1e4512c88668132/OVMF_CODE.fd
|
| 17 | 2026-09-08T19:40:30.501Z | DEBG | phd-runner: [TEST - EVENT] checking for existing copy of artifact
file = phd-tests/framework/src/artifacts/store.rs
line = 89
maybe_path = /phd-artifacts/ba8007f74f9b54fbae3b2520da577831b4834778a498d732f091260c61aa7ca1/alpine.iso
path = phd_tests::migrate::from_base::serial_history
target = phd_framework::artifacts::store
|
| 18 | 2026-09-08T19:40:30.514Z | DEBG | phd-runner: [TEST - EVENT] Downloading alpine.iso from https://oxide-omicron-build.s3.amazonaws.com/alpine.iso
file = phd-tests/framework/src/artifacts/store.rs
line = 614
path = phd_tests::migrate::from_base::serial_history
target = phd_framework::artifacts::store
timeout = 600s
|
| 19 | 2026-09-08T19:40:37.882Z | DEBG | phd-runner: [TEST - EVENT] Verified artifact already exists
file = phd-tests/framework/src/artifacts/store.rs
line = 45
path = /phd-artifacts/ba8007f74f9b54fbae3b2520da577831b4834778a498d732f091260c61aa7ca1/alpine.iso
target = phd_framework::artifacts::store
|
| 20 | 2026-09-08T19:40:37.883Z | DEBG | phd-runner: [TEST - EVENT] executing ZFS command
args = ["/phd-artifacts/ba8007f74f9b54fbae3b2520da577831b4834778a498d732f091260c61aa7ca1/alpine.iso"]
file = phd-tests/framework/src/zfs.rs
line = 304
path = phd_tests::migrate::from_base::serial_history
target = phd_framework::zfs
verb = list
|
| 21 | 2026-09-08T19:40:37.898Z | DEBG | phd-runner: [TEST - EVENT] parsing zfs list output
file = phd-tests/framework/src/zfs.rs
line = 238
path = phd_tests::migrate::from_base::serial_history
stdout = NAME USED AVAIL REFER MOUNTPOINT\nphd-artifacts 4.67M 25.3T 2M /phd-artifacts\n
target = phd_framework::zfs
|
| 22 | 2026-09-08T19:40:37.901Z | DEBG | phd-runner: [TEST - EVENT] executing ZFS command
args = ["phd-artifacts@phd-c881037a-f124-4252-87ae-a78bb65cafac"]
file = phd-tests/framework/src/zfs.rs
line = 304
path = phd_tests::migrate::from_base::serial_history
target = phd_framework::zfs
verb = snapshot
|
| 23 | 2026-09-08T19:40:37.924Z | DEBG | phd-runner: [TEST - EVENT] executing ZFS command
args = ["phd-artifacts@phd-c881037a-f124-4252-87ae-a78bb65cafac", "phd-artifacts/phd-clone-087db219-084c-4c5b-8729-6c1763e0c52c"]
file = phd-tests/framework/src/zfs.rs
line = 304
path = phd_tests::migrate::from_base::serial_history
target = phd_framework::zfs
verb = clone
|
| 24 | 2026-09-08T19:40:37.943Z | DEBG | phd-runner: [TEST - EVENT] executing ZFS command
args = ["phd-artifacts/phd-clone-087db219-084c-4c5b-8729-6c1763e0c52c"]
file = phd-tests/framework/src/zfs.rs
line = 304
path = phd_tests::migrate::from_base::serial_history
target = phd_framework::zfs
verb = list
|
| 25 | 2026-09-08T19:40:37.954Z | DEBG | phd-runner: [TEST - EVENT] parsing zfs list output
file = phd-tests/framework/src/zfs.rs
line = 238
path = phd_tests::migrate::from_base::serial_history
stdout = NAME USED AVAIL REFER MOUNTPOINT\nphd-artifacts/phd-clone-087db219-084c-4c5b-8729-6c1763e0c52c 0B 25.3T 49.0M /phd-artifacts/phd-clone-087db219-084c-4c5b-8729-6c1763e0c52c\n
target = phd_framework::zfs
|
| 26 | 2026-09-08T19:40:37.959Z | INFO | phd-runner: [NEW - START]
file = phd-tests/framework/src/test_vm/mod.rs
line = 300
path = phd_tests::migrate::from_base::serial_history
target = phd_framework::test_vm
|
| 27 | 2026-09-08T19:40:37.959Z | INFO | phd-runner: [NEW - EVENT] phd_framework::test_vm
environment = EnvironmentSpec { location: Local, propolis_artifact: "__BASE_PROPOLIS", metrics: None }
file = phd-tests/framework/src/test_vm/mod.rs
guest_os_kind = Alpine
line = 318
path = phd_tests::migrate::from_base::serial_history
target = phd_framework::test_vm
vm_name = migration_serial_history_base
|
| 28 | 2026-09-08T19:40:37.959Z | DEBG | phd-runner: [NEW - EVENT] checking for existing copy of artifact
file = phd-tests/framework/src/artifacts/store.rs
line = 89
maybe_path = /phd-artifacts/279b1c4728a24b4f7a44b54ce9f8f9718dc7bbf7c63d48a3324f98ccba625d72/propolis-server.tar.gz
path = phd_tests::migrate::from_base::serial_history
target = phd_framework::artifacts::store
|
| 29 | 2026-09-08T19:40:37.959Z | DEBG | phd-runner: [NEW - EVENT] Downloading file from Buildomat...
file = phd-tests/framework/src/artifacts/buildomat.rs
line = 215
path = phd_tests::migrate::from_base::serial_history
target = phd_framework::artifacts::buildomat
timeout = 600s
uri = https://buildomat.eng.oxide.computer/public/file/oxidecomputer/propolis/phd_build/3408a2d02097cd0634d2904bac4f531b600257cb/propolis-server.tar.gz
|
| 30 | 2026-09-08T19:40:50.993Z | DEBG | phd-runner: [NEW - EVENT] Extracting artifact from tarball
extracted_path = /phd-artifacts/279b1c4728a24b4f7a44b54ce9f8f9718dc7bbf7c63d48a3324f98ccba625d72/propolis-server
file = phd-tests/framework/src/artifacts/store.rs
line = 160
path = phd_tests::migrate::from_base::serial_history
target = phd_framework::artifacts::store
untar_path = propolis-server
|
| 31 | 2026-09-08T19:40:50.993Z | DEBG | phd-runner: [NEW - EVENT] Extracting gzipped tarball...
file = phd-tests/framework/src/artifacts/store.rs
line = 514
path = phd_tests::migrate::from_base::serial_history
target = phd_framework::artifacts::store
|
| 32 | 2026-09-08T19:41:15.829Z | INFO | phd-runner: [NEW - EVENT] Launching Propolis server
bootrom_path = "/phd-artifacts/740187046a7267d0de72d3455070333547dbc0ea023531471fb2b2a61effa448/OVMF_CODE.fd"
file = phd-tests/framework/src/test_vm/server.rs
line = 66
path = phd_tests::migrate::from_base::serial_history
server_addr = 127.0.0.1:9000
server_path = "/phd-artifacts/279b1c4728a24b4f7a44b54ce9f8f9718dc7bbf7c63d48a3324f98ccba625d72/propolis-server"
target = phd_framework::test_vm::server
|
| 33 | 2026-09-08T19:41:15.829Z | INFO | phd-runner: [NEW - EVENT] Opening server log files
file = phd-tests/framework/src/log_config.rs
line = 84
path = phd_tests::migrate::from_base::serial_history
stderr_path = "/tmp/propolis-phd/phd_tests::migrate::from_base::serial_history/migration_serial_history_base.stderr.log"
stdout_path = "/tmp/propolis-phd/phd_tests::migrate::from_base::serial_history/migration_serial_history_base.stdout.log"
target = phd_framework::log_config
|
| 34 | 2026-09-08T19:41:15.990Z | INFO | phd-runner: [NEW - EVENT] Launched server with pid 917
file = phd-tests/framework/src/test_vm/server.rs
line = 127
path = phd_tests::migrate::from_base::serial_history
target = phd_framework::test_vm::server
|
| 35 | 2026-09-08T19:41:16.007Z | INFO | phd-runner: [INSTANCE_ENSURE_INTERNAL - START]
file = phd-tests/framework/src/test_vm/mod.rs
line = 412
path = phd_tests::migrate::from_base::serial_history
target = phd_framework::test_vm
vm = migration_serial_history_base
vm_id = 82932aa5-6dca-43dc-b5f0-10dfde6c6623
|
| 36 | 2026-09-08T19:41:16.018Z | INFO | phd-runner: [INSTANCE_ENSURE_INTERNAL - EVENT] retriable error from instance_spec_ensure
e = Communication Error: error sending request for url (http://127.0.0.1:9000/instance)
file = phd-tests/framework/src/test_vm/mod.rs
line = 455
path = phd_tests::migrate::from_base::serial_history
target = phd_framework::test_vm
vm = migration_serial_history_base
vm_id = 82932aa5-6dca-43dc-b5f0-10dfde6c6623
|
| 37 | 2026-09-08T19:41:16.021Z | INFO | phd-runner: [NEW - END]
elapsed_milliseconds = 38055
file = phd-tests/framework/src/test_vm/mod.rs
line = 300
path = phd_tests::migrate::from_base::serial_history
target = phd_framework::test_vm
|
| 38 | 2026-09-08T19:41:16.728Z | INFO | phd-runner: [SERIAL CONSOLE TASK - START]
file = phd-tests/framework/src/serial/mod.rs
line = 200
target = phd_framework::serial
|
| 39 | 2026-09-08T19:41:16.732Z | INFO | phd-runner: [INSTANCE_ENSURE_INTERNAL - EVENT] Started instance
file = phd-tests/framework/src/test_vm/mod.rs
instance_description.instance = Instance { properties: InstanceProperties { id: 82932aa5-6dca-43dc-b5f0-10dfde6c6623, name: "phd-vm-82932aa5-6dca-43dc-b5f0-10dfde6c6623", description: "Pheidippides-managed VM", metadata: InstanceMetadata { silo_id: e1a940ba-0d76-45ce-9f44-4009c6ba0807, project_id: bf6e8401-e47e-41bf-b8ac-1d38036dd310, sled_id: 559510ab-e005-425f-9998-a049f7aed168, sled_serial: "559510ab-e005-425f-9998-a049f7aed168", sled_revision: 1, sled_model: "pheidippes" } }, state: Creating }
line = 514
path = phd_tests::migrate::from_base::serial_history
target = phd_framework::test_vm
vm = migration_serial_history_base
vm_id = 82932aa5-6dca-43dc-b5f0-10dfde6c6623
|
| 40 | 2026-09-08T19:41:16.732Z | INFO | phd-runner: [PUT_INSTANCE_STATE - START]
file = phd-tests/framework/src/test_vm/mod.rs
line = 575
path = phd_tests::migrate::from_base::serial_history
target = phd_framework::test_vm
vm = migration_serial_history_base
vm_id = 82932aa5-6dca-43dc-b5f0-10dfde6c6623
|
| 41 | 2026-09-08T19:41:16.732Z | INFO | phd-runner: [PUT_INSTANCE_STATE - EVENT] Requesting instance state change
file = phd-tests/framework/src/test_vm/mod.rs
line = 580
path = phd_tests::migrate::from_base::serial_history
state = Run
target = phd_framework::test_vm
vm = migration_serial_history_base
vm_id = 82932aa5-6dca-43dc-b5f0-10dfde6c6623
|
| 42 | 2026-09-08T19:41:16.734Z | INFO | phd-runner: [PUT_INSTANCE_STATE - END]
elapsed_milliseconds = 1
file = phd-tests/framework/src/test_vm/mod.rs
line = 575
path = phd_tests::migrate::from_base::serial_history
target = phd_framework::test_vm
vm = migration_serial_history_base
vm_id = 82932aa5-6dca-43dc-b5f0-10dfde6c6623
|
| 43 | 2026-09-08T19:41:16.734Z | INFO | phd-runner: [WAIT_TO_BOOT - START]
file = phd-tests/framework/src/test_vm/mod.rs
line = 890
path = phd_tests::migrate::from_base::serial_history
target = phd_framework::test_vm
|
| 44 | 2026-09-08T19:41:16.735Z | INFO | phd-runner: [WAIT_TO_BOOT - EVENT] waiting for guest to boot
file = phd-tests/framework/src/test_vm/mod.rs
line = 839
path = phd_tests::migrate::from_base::serial_history
target = phd_framework::test_vm
timeout_duration = 300s
vm = migration_serial_history_base
vm_id = 82932aa5-6dca-43dc-b5f0-10dfde6c6623
|
| 45 | 2026-09-08T19:41:16.735Z | DEBG | phd-runner: [WAIT_TO_BOOT - EVENT] executing command in boot sequence
file = phd-tests/framework/src/test_vm/mod.rs
line = 847
path = phd_tests::migrate::from_base::serial_history
step = WaitFor("localhost login: ")
target = phd_framework::test_vm
|
| 46 | 2026-09-08T19:41:16.735Z | INFO | phd-runner: [WAIT_FOR_SERIAL_OUTPUT - START]
file = phd-tests/framework/src/test_vm/mod.rs
line = 913
path = phd_tests::migrate::from_base::serial_history
target = phd_framework::test_vm
vm = migration_serial_history_base
vm_id = 82932aa5-6dca-43dc-b5f0-10dfde6c6623
|
| 47 | 2026-09-08T19:41:16.735Z | INFO | phd-runner: [WAIT_FOR_SERIAL_OUTPUT - EVENT] Waiting for output on serial console
file = phd-tests/framework/src/test_vm/mod.rs
line = 920
path = phd_tests::migrate::from_base::serial_history
target = phd_framework::test_vm
timeout_duration = CallerTimeout
vm = migration_serial_history_base
vm_id = 82932aa5-6dca-43dc-b5f0-10dfde6c6623
|
| 48 | 2026-09-08T19:41:21.355Z | INFO | phd-runner: [WAIT_FOR_SERIAL_OUTPUT - END]
elapsed_milliseconds = 4618
file = phd-tests/framework/src/test_vm/mod.rs
line = 913
path = phd_tests::migrate::from_base::serial_history
target = phd_framework::test_vm
vm = migration_serial_history_base
vm_id = 82932aa5-6dca-43dc-b5f0-10dfde6c6623
|
| 49 | 2026-09-08T19:41:21.355Z | DEBG | phd-runner: [WAIT_TO_BOOT - EVENT] executing command in boot sequence
file = phd-tests/framework/src/test_vm/mod.rs
line = 847
path = phd_tests::migrate::from_base::serial_history
step = WriteStr("root")
target = phd_framework::test_vm
|
| 50 | 2026-09-08T19:41:21.358Z | DEBG | phd-runner: [WAIT_TO_BOOT - EVENT] executing command in boot sequence
file = phd-tests/framework/src/test_vm/mod.rs
line = 847
path = phd_tests::migrate::from_base::serial_history
step = WaitFor("localhost:~#")
target = phd_framework::test_vm
|
| 51 | 2026-09-08T19:41:21.358Z | INFO | phd-runner: [WAIT_FOR_SERIAL_OUTPUT - START]
file = phd-tests/framework/src/test_vm/mod.rs
line = 913
path = phd_tests::migrate::from_base::serial_history
target = phd_framework::test_vm
vm = migration_serial_history_base
vm_id = 82932aa5-6dca-43dc-b5f0-10dfde6c6623
|
| 52 | 2026-09-08T19:41:21.358Z | INFO | phd-runner: [WAIT_FOR_SERIAL_OUTPUT - EVENT] Waiting for output on serial console
file = phd-tests/framework/src/test_vm/mod.rs
line = 920
path = phd_tests::migrate::from_base::serial_history
target = phd_framework::test_vm
timeout_duration = CallerTimeout
vm = migration_serial_history_base
vm_id = 82932aa5-6dca-43dc-b5f0-10dfde6c6623
|
| 53 | 2026-09-08T19:41:21.386Z | INFO | phd-runner: [WAIT_FOR_SERIAL_OUTPUT - END]
elapsed_milliseconds = 27
file = phd-tests/framework/src/test_vm/mod.rs
line = 913
path = phd_tests::migrate::from_base::serial_history
target = phd_framework::test_vm
vm = migration_serial_history_base
vm_id = 82932aa5-6dca-43dc-b5f0-10dfde6c6623
|
| 54 | 2026-09-08T19:41:21.386Z | DEBG | phd-runner: [WAIT_TO_BOOT - EVENT] executing command in boot sequence
file = phd-tests/framework/src/test_vm/mod.rs
line = 847
path = phd_tests::migrate::from_base::serial_history
step = WriteStr("stty -F `tty` cols 9999")
target = phd_framework::test_vm
|
| 55 | 2026-09-08T19:41:21.386Z | DEBG | phd-runner: [WAIT_TO_BOOT - EVENT] executing command in boot sequence
file = phd-tests/framework/src/test_vm/mod.rs
line = 847
path = phd_tests::migrate::from_base::serial_history
step = WaitFor("localhost:~#")
target = phd_framework::test_vm
|
| 56 | 2026-09-08T19:41:21.386Z | INFO | phd-runner: [WAIT_FOR_SERIAL_OUTPUT - START]
file = phd-tests/framework/src/test_vm/mod.rs
line = 913
path = phd_tests::migrate::from_base::serial_history
target = phd_framework::test_vm
vm = migration_serial_history_base
vm_id = 82932aa5-6dca-43dc-b5f0-10dfde6c6623
|
| 57 | 2026-09-08T19:41:21.386Z | INFO | phd-runner: [WAIT_FOR_SERIAL_OUTPUT - EVENT] Waiting for output on serial console
file = phd-tests/framework/src/test_vm/mod.rs
line = 920
path = phd_tests::migrate::from_base::serial_history
target = phd_framework::test_vm
timeout_duration = CallerTimeout
vm = migration_serial_history_base
vm_id = 82932aa5-6dca-43dc-b5f0-10dfde6c6623
|
| 58 | 2026-09-08T19:41:21.418Z | INFO | phd-runner: [WAIT_FOR_SERIAL_OUTPUT - END]
elapsed_milliseconds = 31
file = phd-tests/framework/src/test_vm/mod.rs
line = 913
path = phd_tests::migrate::from_base::serial_history
target = phd_framework::test_vm
vm = migration_serial_history_base
vm_id = 82932aa5-6dca-43dc-b5f0-10dfde6c6623
|
| 59 | 2026-09-08T19:41:21.418Z | INFO | phd-runner: [WAIT_TO_BOOT - EVENT] Guest has booted
file = phd-tests/framework/src/test_vm/mod.rs
line = 887
path = phd_tests::migrate::from_base::serial_history
target = phd_framework::test_vm
|
| 60 | 2026-09-08T19:41:21.419Z | INFO | phd-runner: [WAIT_TO_BOOT - END]
elapsed_milliseconds = 4683
file = phd-tests/framework/src/test_vm/mod.rs
line = 890
path = phd_tests::migrate::from_base::serial_history
target = phd_framework::test_vm
|
| 61 | 2026-09-08T19:41:21.420Z | INFO | phd-runner: [WAIT_FOR_SERIAL_OUTPUT - START]
file = phd-tests/framework/src/test_vm/mod.rs
line = 913
path = phd_tests::migrate::from_base::serial_history
target = phd_framework::test_vm
vm = migration_serial_history_base
vm_id = 82932aa5-6dca-43dc-b5f0-10dfde6c6623
|
| 62 | 2026-09-08T19:41:21.420Z | INFO | phd-runner: [WAIT_FOR_SERIAL_OUTPUT - EVENT] Waiting for output on serial console
file = phd-tests/framework/src/test_vm/mod.rs
line = 920
path = phd_tests::migrate::from_base::serial_history
target = phd_framework::test_vm
timeout_duration = Explicit(15s)
vm = migration_serial_history_base
vm_id = 82932aa5-6dca-43dc-b5f0-10dfde6c6623
|
| 63 | 2026-09-08T19:41:21.430Z | INFO | phd-runner: [WAIT_FOR_SERIAL_OUTPUT - END]
elapsed_milliseconds = 10
file = phd-tests/framework/src/test_vm/mod.rs
line = 913
path = phd_tests::migrate::from_base::serial_history
target = phd_framework::test_vm
vm = migration_serial_history_base
vm_id = 82932aa5-6dca-43dc-b5f0-10dfde6c6623
|
| 64 | 2026-09-08T19:41:21.430Z | INFO | phd-runner: [WAIT_FOR_SERIAL_OUTPUT - START]
file = phd-tests/framework/src/test_vm/mod.rs
line = 913
path = phd_tests::migrate::from_base::serial_history
target = phd_framework::test_vm
vm = migration_serial_history_base
vm_id = 82932aa5-6dca-43dc-b5f0-10dfde6c6623
|
| 65 | 2026-09-08T19:41:21.431Z | INFO | phd-runner: [WAIT_FOR_SERIAL_OUTPUT - EVENT] Waiting for output on serial console
file = phd-tests/framework/src/test_vm/mod.rs
line = 920
path = phd_tests::migrate::from_base::serial_history
target = phd_framework::test_vm
timeout_duration = Explicit(300s)
vm = migration_serial_history_base
vm_id = 82932aa5-6dca-43dc-b5f0-10dfde6c6623
|
| 66 | 2026-09-08T19:41:21.464Z | INFO | phd-runner: [WAIT_FOR_SERIAL_OUTPUT - END]
elapsed_milliseconds = 32
file = phd-tests/framework/src/test_vm/mod.rs
line = 913
path = phd_tests::migrate::from_base::serial_history
target = phd_framework::test_vm
vm = migration_serial_history_base
vm_id = 82932aa5-6dca-43dc-b5f0-10dfde6c6623
|
| 67 | 2026-09-08T19:41:21.464Z | INFO | phd-runner: [WAIT_FOR_SERIAL_OUTPUT - START]
file = phd-tests/framework/src/test_vm/mod.rs
line = 913
path = phd_tests::migrate::from_base::serial_history
target = phd_framework::test_vm
vm = migration_serial_history_base
vm_id = 82932aa5-6dca-43dc-b5f0-10dfde6c6623
|
| 68 | 2026-09-08T19:41:21.464Z | INFO | phd-runner: [WAIT_FOR_SERIAL_OUTPUT - EVENT] Waiting for output on serial console
file = phd-tests/framework/src/test_vm/mod.rs
line = 920
path = phd_tests::migrate::from_base::serial_history
target = phd_framework::test_vm
timeout_duration = Explicit(15s)
vm = migration_serial_history_base
vm_id = 82932aa5-6dca-43dc-b5f0-10dfde6c6623
|
| 69 | 2026-09-08T19:41:21.474Z | INFO | phd-runner: [WAIT_FOR_SERIAL_OUTPUT - END]
elapsed_milliseconds = 10
file = phd-tests/framework/src/test_vm/mod.rs
line = 913
path = phd_tests::migrate::from_base::serial_history
target = phd_framework::test_vm
vm = migration_serial_history_base
vm_id = 82932aa5-6dca-43dc-b5f0-10dfde6c6623
|
| 70 | 2026-09-08T19:41:21.475Z | INFO | phd-runner: [WAIT_FOR_SERIAL_OUTPUT - START]
file = phd-tests/framework/src/test_vm/mod.rs
line = 913
path = phd_tests::migrate::from_base::serial_history
target = phd_framework::test_vm
vm = migration_serial_history_base
vm_id = 82932aa5-6dca-43dc-b5f0-10dfde6c6623
|
| 71 | 2026-09-08T19:41:21.475Z | INFO | phd-runner: [WAIT_FOR_SERIAL_OUTPUT - EVENT] Waiting for output on serial console
file = phd-tests/framework/src/test_vm/mod.rs
line = 920
path = phd_tests::migrate::from_base::serial_history
target = phd_framework::test_vm
timeout_duration = Explicit(300s)
vm = migration_serial_history_base
vm_id = 82932aa5-6dca-43dc-b5f0-10dfde6c6623
|
| 72 | 2026-09-08T19:41:21.508Z | INFO | phd-runner: [WAIT_FOR_SERIAL_OUTPUT - END]
elapsed_milliseconds = 33
file = phd-tests/framework/src/test_vm/mod.rs
line = 913
path = phd_tests::migrate::from_base::serial_history
target = phd_framework::test_vm
vm = migration_serial_history_base
vm_id = 82932aa5-6dca-43dc-b5f0-10dfde6c6623
|
| 73 | 2026-09-08T19:41:21.519Z | INFO | phd-runner: [TEST - EVENT] migrating to new Propolis artifact for lifecycle test
file = phd-tests/framework/src/lifecycle.rs
line = 73
path = phd_tests::migrate::from_base::serial_history
propolis_artifact = __DEFAULT_PROPOLIS
target = phd_framework::lifecycle
vm_name = migration_serial_history_base
|
| 74 | 2026-09-08T19:41:21.519Z | INFO | phd-runner: [NEW - START]
file = phd-tests/framework/src/test_vm/mod.rs
line = 300
path = phd_tests::migrate::from_base::serial_history
target = phd_framework::test_vm
|
| 75 | 2026-09-08T19:41:21.519Z | INFO | phd-runner: [NEW - EVENT] phd_framework::test_vm
environment = EnvironmentSpec { location: Local, propolis_artifact: "__DEFAULT_PROPOLIS", metrics: None }
file = phd-tests/framework/src/test_vm/mod.rs
guest_os_kind = Alpine
line = 318
path = phd_tests::migrate::from_base::serial_history
target = phd_framework::test_vm
vm_name = migration_serial_history_base_lifecycle_0
|
| 76 | 2026-09-08T19:41:21.519Z | DEBG | phd-runner: [NEW - EVENT] Examining locally-sourced artifact
file = phd-tests/framework/src/artifacts/store.rs
line = 56
path = /work/phd-test/propolis-server
sha256 = None
target = phd_framework::artifacts::store
|
| 77 | 2026-09-08T19:41:21.519Z | DEBG | phd-runner: [NEW - EVENT] Locally-sourced artifact is valid, caching its path
file = phd-tests/framework/src/artifacts/store.rs
line = 69
path = /work/phd-test/propolis-server
target = phd_framework::artifacts::store
|
| 78 | 2026-09-08T19:41:21.519Z | INFO | phd-runner: [NEW - EVENT] Launching Propolis server
bootrom_path = "/phd-artifacts/740187046a7267d0de72d3455070333547dbc0ea023531471fb2b2a61effa448/OVMF_CODE.fd"
file = phd-tests/framework/src/test_vm/server.rs
line = 66
path = phd_tests::migrate::from_base::serial_history
server_addr = 127.0.0.1:9002
server_path = "/work/phd-test/propolis-server"
target = phd_framework::test_vm::server
|
| 79 | 2026-09-08T19:41:21.519Z | INFO | phd-runner: [NEW - EVENT] Opening server log files
file = phd-tests/framework/src/log_config.rs
line = 84
path = phd_tests::migrate::from_base::serial_history
stderr_path = "/tmp/propolis-phd/phd_tests::migrate::from_base::serial_history/migration_serial_history_base_lifecycle_0.stderr.log"
stdout_path = "/tmp/propolis-phd/phd_tests::migrate::from_base::serial_history/migration_serial_history_base_lifecycle_0.stdout.log"
target = phd_framework::log_config
|
| 80 | 2026-09-08T19:41:21.563Z | INFO | phd-runner: [NEW - EVENT] Launched server with pid 918
file = phd-tests/framework/src/test_vm/server.rs
line = 127
path = phd_tests::migrate::from_base::serial_history
target = phd_framework::test_vm::server
|
| 81 | 2026-09-08T19:41:21.576Z | INFO | phd-runner: [NEW - END]
elapsed_milliseconds = 57
file = phd-tests/framework/src/test_vm/mod.rs
line = 300
path = phd_tests::migrate::from_base::serial_history
target = phd_framework::test_vm
|
| 82 | 2026-09-08T19:41:21.577Z | INFO | phd-runner: [MIGRATE_FROM - START]
file = phd-tests/framework/src/test_vm/mod.rs
line = 609
path = phd_tests::migrate::from_base::serial_history
source = migration_serial_history_base
source_id = 82932aa5-6dca-43dc-b5f0-10dfde6c6623
target = phd_framework::test_vm
target_id = dca5eae3-d203-457a-b785-83103cd94e07
|
| 83 | 2026-09-08T19:41:21.577Z | INFO | phd-runner: [MIGRATE_FROM - EVENT] Migrating from source at address 127.0.0.1:9000
file = phd-tests/framework/src/test_vm/mod.rs
line = 642
migration_id = 291a8d6a-c597-414f-857b-e3f588530288
path = phd_tests::migrate::from_base::serial_history
source = migration_serial_history_base
source_id = 82932aa5-6dca-43dc-b5f0-10dfde6c6623
target = phd_framework::test_vm
target_id = dca5eae3-d203-457a-b785-83103cd94e07
timeout_duration = 45s
|
| 84 | 2026-09-08T19:41:21.577Z | INFO | phd-runner: [INSTANCE_ENSURE_INTERNAL - START]
file = phd-tests/framework/src/test_vm/mod.rs
line = 412
path = phd_tests::migrate::from_base::serial_history
source = migration_serial_history_base
source_id = 82932aa5-6dca-43dc-b5f0-10dfde6c6623
target = phd_framework::test_vm
target_id = dca5eae3-d203-457a-b785-83103cd94e07
vm = migration_serial_history_base_lifecycle_0
vm_id = dca5eae3-d203-457a-b785-83103cd94e07
|
| 85 | 2026-09-08T19:41:21.578Z | INFO | phd-runner: [INSTANCE_ENSURE_INTERNAL - EVENT] retriable error from instance_spec_ensure
e = Communication Error: error sending request for url (http://127.0.0.1:9002/instance)
file = phd-tests/framework/src/test_vm/mod.rs
line = 455
path = phd_tests::migrate::from_base::serial_history
source = migration_serial_history_base
source_id = 82932aa5-6dca-43dc-b5f0-10dfde6c6623
target = phd_framework::test_vm
target_id = dca5eae3-d203-457a-b785-83103cd94e07
vm = migration_serial_history_base_lifecycle_0
vm_id = dca5eae3-d203-457a-b785-83103cd94e07
|
| 86 | 2026-09-08T19:41:21.850Z | INFO | phd-runner: [INSTANCE_ENSURE_INTERNAL - EVENT] retriable error from instance_spec_ensure
e = Communication Error: error sending request for url (http://127.0.0.1:9002/instance)
file = phd-tests/framework/src/test_vm/mod.rs
line = 455
path = phd_tests::migrate::from_base::serial_history
source = migration_serial_history_base
source_id = 82932aa5-6dca-43dc-b5f0-10dfde6c6623
target = phd_framework::test_vm
target_id = dca5eae3-d203-457a-b785-83103cd94e07
vm = migration_serial_history_base_lifecycle_0
vm_id = dca5eae3-d203-457a-b785-83103cd94e07
|
| 87 | 2026-09-08T19:41:22.604Z | INFO | phd-runner: [INSTANCE_ENSURE_INTERNAL - EVENT] Started instance
file = phd-tests/framework/src/test_vm/mod.rs
instance_description.instance = Instance { properties: InstanceProperties { id: dca5eae3-d203-457a-b785-83103cd94e07, name: "phd-vm-dca5eae3-d203-457a-b785-83103cd94e07", description: "Pheidippides-managed VM", metadata: InstanceMetadata { silo_id: e1a940ba-0d76-45ce-9f44-4009c6ba0807, project_id: bf6e8401-e47e-41bf-b8ac-1d38036dd310, sled_id: 9ff9ae1b-4a7f-49e9-89b8-f0cb6ff17121, sled_serial: "9ff9ae1b-4a7f-49e9-89b8-f0cb6ff17121", sled_revision: 1, sled_model: "pheidippes" } }, state: Migrating }
line = 514
path = phd_tests::migrate::from_base::serial_history
source = migration_serial_history_base
source_id = 82932aa5-6dca-43dc-b5f0-10dfde6c6623
target = phd_framework::test_vm
target_id = dca5eae3-d203-457a-b785-83103cd94e07
vm = migration_serial_history_base_lifecycle_0
vm_id = dca5eae3-d203-457a-b785-83103cd94e07
|
| 88 | 2026-09-08T19:41:22.604Z | INFO | phd-runner: [MIGRATE - START]
file = phd-tests/framework/src/test_vm/mod.rs
line = 663
migration_id = 291a8d6a-c597-414f-857b-e3f588530288
path = phd_tests::migrate::from_base::serial_history
source = migration_serial_history_base
source_id = 82932aa5-6dca-43dc-b5f0-10dfde6c6623
target = phd_framework::test_vm
target_id = dca5eae3-d203-457a-b785-83103cd94e07
|
| 89 | 2026-09-08T19:41:25.112Z | INFO | phd-runner: [SERIAL CONSOLE TASK - EVENT] serial socket control message
file = phd-tests/framework/src/serial/mod.rs
line = 275
s = {"Migrating":{"destination":"127.0.0.1:9002","from_start":7756}}
target = phd_framework::serial
|
| 90 | 2026-09-08T19:41:26.382Z | INFO | phd-runner: [MIGRATE_FROM - EVENT] Migration completed successfully
file = phd-tests/framework/src/test_vm/mod.rs
line = 676
path = phd_tests::migrate::from_base::serial_history
source = migration_serial_history_base
source_id = 82932aa5-6dca-43dc-b5f0-10dfde6c6623
target = phd_framework::test_vm
target_id = dca5eae3-d203-457a-b785-83103cd94e07
|
| 91 | 2026-09-08T19:41:26.383Z | INFO | phd-runner: [MIGRATE - END]
elapsed_milliseconds = 3777
file = phd-tests/framework/src/test_vm/mod.rs
line = 663
migration_id = 291a8d6a-c597-414f-857b-e3f588530288
path = phd_tests::migrate::from_base::serial_history
source = migration_serial_history_base
source_id = 82932aa5-6dca-43dc-b5f0-10dfde6c6623
target = phd_framework::test_vm
target_id = dca5eae3-d203-457a-b785-83103cd94e07
|
| 92 | 2026-09-08T19:41:26.386Z | INFO | phd-runner: [VM CLEANUP - START]
file = phd-tests/framework/src/test_vm/mod.rs
line = 1172
path = phd_tests::migrate::from_base::serial_history
target = phd_framework::test_vm
vm = migration_serial_history_base
vm_id = 82932aa5-6dca-43dc-b5f0-10dfde6c6623
|
| 93 | 2026-09-08T19:41:26.389Z | DEBG | phd-runner: [VM CLEANUP - EVENT] Killing Propolis server process
file = phd-tests/framework/src/test_vm/server.rs
line = 177
path = phd_tests::migrate::from_base::serial_history
self.address = 127.0.0.1:9000
target = phd_framework::test_vm::server
vm = migration_serial_history_base
vm_id = 82932aa5-6dca-43dc-b5f0-10dfde6c6623
|
| 94 | 2026-09-08T19:41:26.470Z | INFO | phd-runner: [VM CLEANUP - END]
elapsed_milliseconds = 82
file = phd-tests/framework/src/test_vm/mod.rs
line = 1172
path = phd_tests::migrate::from_base::serial_history
target = phd_framework::test_vm
vm = migration_serial_history_base
vm_id = 82932aa5-6dca-43dc-b5f0-10dfde6c6623
|
| 95 | 2026-09-08T19:41:26.471Z | INFO | phd-runner: [INSTANCE_ENSURE_INTERNAL - END]
elapsed_milliseconds = 10462
file = phd-tests/framework/src/test_vm/mod.rs
line = 412
path = phd_tests::migrate::from_base::serial_history
target = phd_framework::test_vm
vm = migration_serial_history_base
vm_id = 82932aa5-6dca-43dc-b5f0-10dfde6c6623
|
| 96 | 2026-09-08T19:41:26.475Z | INFO | phd-runner: [VM CLEANUP - START]
file = phd-tests/framework/src/test_vm/mod.rs
line = 1172
path = phd_tests::migrate::from_base::serial_history
target = phd_framework::test_vm
vm = migration_serial_history_base_lifecycle_0
vm_id = dca5eae3-d203-457a-b785-83103cd94e07
|
| 97 | 2026-09-08T19:41:26.475Z | DEBG | phd-runner: [SERIAL CONSOLE TASK - EVENT] serial console command channel was closed
file = phd-tests/framework/src/serial/mod.rs
line = 213
target = phd_framework::serial
|
| 98 | 2026-09-08T19:41:26.476Z | INFO | phd-runner: [SERIAL CONSOLE TASK - END]
elapsed_milliseconds = 9746
file = phd-tests/framework/src/serial/mod.rs
line = 200
target = phd_framework::serial
|
| 99 | 2026-09-08T19:41:26.477Z | DEBG | phd-runner: [VM CLEANUP - EVENT] trying to ensure Propolis server VM is destroyed
file = phd-tests/framework/src/test_vm/mod.rs
line = 1195
path = phd_tests::migrate::from_base::serial_history
target = phd_framework::test_vm
vm = migration_serial_history_base_lifecycle_0
vm_id = dca5eae3-d203-457a-b785-83103cd94e07
|
| 100 | 2026-09-08T19:41:26.477Z | INFO | phd-runner: test phd_tests::migrate::from_base::serial_history ... ok
file = phd-tests/runner/src/execute.rs
line = 141
target = phd_runner::execute
|
| 101 | 2026-09-08T19:41:26.477Z | INFO | phd-runner: [TEST_CLEANUP - START]
file = phd-tests/runner/src/fixtures.rs
line = 51
target = phd_runner::fixtures
|
| 102 | 2026-09-08T19:41:26.860Z | DEBG | phd-runner: [VM CLEANUP - EVENT] Killing Propolis server process
file = phd-tests/framework/src/test_vm/server.rs
line = 177
path = phd_tests::migrate::from_base::serial_history
self.address = 127.0.0.1:9002
target = phd_framework::test_vm::server
vm = migration_serial_history_base_lifecycle_0
vm_id = dca5eae3-d203-457a-b785-83103cd94e07
|
| 103 | 2026-09-08T19:41:26.946Z | DEBG | phd-runner: [VM CLEANUP - EVENT] zfs clone dropped
file = phd-tests/framework/src/zfs.rs
line = 83
path = phd_tests::migrate::from_base::serial_history
target = phd_framework::zfs
vm = migration_serial_history_base_lifecycle_0
vm_id = dca5eae3-d203-457a-b785-83103cd94e07
|
| 104 | 2026-09-08T19:41:26.946Z | DEBG | phd-runner: [VM CLEANUP - EVENT] executing ZFS command
args = ["phd-artifacts/phd-clone-087db219-084c-4c5b-8729-6c1763e0c52c"]
file = phd-tests/framework/src/zfs.rs
line = 304
path = phd_tests::migrate::from_base::serial_history
target = phd_framework::zfs
verb = destroy
vm = migration_serial_history_base_lifecycle_0
vm_id = dca5eae3-d203-457a-b785-83103cd94e07
|
| 105 | 2026-09-08T19:41:26.971Z | DEBG | phd-runner: [VM CLEANUP - EVENT] zfs snapshot dropped
file = phd-tests/framework/src/zfs.rs
line = 57
path = phd_tests::migrate::from_base::serial_history
target = phd_framework::zfs
vm = migration_serial_history_base_lifecycle_0
vm_id = dca5eae3-d203-457a-b785-83103cd94e07
|
| 106 | 2026-09-08T19:41:26.971Z | DEBG | phd-runner: [VM CLEANUP - EVENT] executing ZFS command
args = ["phd-artifacts@phd-c881037a-f124-4252-87ae-a78bb65cafac"]
file = phd-tests/framework/src/zfs.rs
line = 304
path = phd_tests::migrate::from_base::serial_history
target = phd_framework::zfs
verb = destroy
vm = migration_serial_history_base_lifecycle_0
vm_id = dca5eae3-d203-457a-b785-83103cd94e07
|
| 107 | 2026-09-08T19:41:26.989Z | INFO | phd-runner: [VM CLEANUP - END]
elapsed_milliseconds = 513
file = phd-tests/framework/src/test_vm/mod.rs
line = 1172
path = phd_tests::migrate::from_base::serial_history
target = phd_framework::test_vm
vm = migration_serial_history_base_lifecycle_0
vm_id = dca5eae3-d203-457a-b785-83103cd94e07
|
| 108 | 2026-09-08T19:41:26.989Z | INFO | phd-runner: [INSTANCE_ENSURE_INTERNAL - END]
elapsed_milliseconds = 5410
file = phd-tests/framework/src/test_vm/mod.rs
line = 412
path = phd_tests::migrate::from_base::serial_history
source = migration_serial_history_base
source_id = 82932aa5-6dca-43dc-b5f0-10dfde6c6623
target = phd_framework::test_vm
target_id = dca5eae3-d203-457a-b785-83103cd94e07
vm = migration_serial_history_base_lifecycle_0
vm_id = dca5eae3-d203-457a-b785-83103cd94e07
|
| 109 | 2026-09-08T19:41:26.989Z | INFO | phd-runner: [MIGRATE_FROM - END]
elapsed_milliseconds = 5411
file = phd-tests/framework/src/test_vm/mod.rs
line = 609
path = phd_tests::migrate::from_base::serial_history
source = migration_serial_history_base
source_id = 82932aa5-6dca-43dc-b5f0-10dfde6c6623
target = phd_framework::test_vm
target_id = dca5eae3-d203-457a-b785-83103cd94e07
|
| 110 | 2026-09-08T19:41:26.989Z | INFO | phd-runner: [TEST - END]
elapsed_milliseconds = 56925
file = phd-tests/tests/src/migrate.rs
line = 40
path = phd_tests::migrate::from_base::serial_history
target = phd_tests::migrate::from_base
|
| 111 | 2026-09-08T19:41:26.990Z | INFO | phd-runner: [TEST_CLEANUP - END]
elapsed_milliseconds = 512
file = phd-tests/runner/src/fixtures.rs
line = 51
target = phd_runner::fixtures
|
| 112 | 2026-09-08T19:41:26.990Z | INFO | phd-runner: Starting test phd_tests::migrate::from_base::can_migrate_from_base
file = phd-tests/runner/src/execute.rs
line = 91
target = phd_runner::execute
|
| 113 | 2026-09-08T19:41:26.990Z | INFO | phd-runner: [TEST_SETUP - START]
file = phd-tests/runner/src/fixtures.rs
line = 41
target = phd_runner::fixtures
|
| 114 | 2026-09-08T19:41:26.990Z | INFO | phd-runner: [TEST_SETUP - END]
elapsed_milliseconds = 0
file = phd-tests/runner/src/fixtures.rs
line = 41
target = phd_runner::fixtures
|
| 115 | 2026-09-08T19:41:26.990Z | INFO | phd-runner: [TEST - START]
file = phd-tests/tests/src/migrate.rs
line = 34
path = phd_tests::migrate::from_base::can_migrate_from_base
target = phd_tests::migrate::from_base
|
| 116 | 2026-09-08T19:41:26.991Z | DEBG | phd-runner: [TEST - EVENT] Verified artifact already exists
file = phd-tests/framework/src/artifacts/store.rs
line = 45
path = /phd-artifacts/740187046a7267d0de72d3455070333547dbc0ea023531471fb2b2a61effa448/OVMF_CODE.fd
target = phd_framework::artifacts::store
|
| 117 | 2026-09-08T19:41:26.991Z | DEBG | phd-runner: [TEST - EVENT] Verified artifact already exists
file = phd-tests/framework/src/artifacts/store.rs
line = 45
path = /phd-artifacts/ba8007f74f9b54fbae3b2520da577831b4834778a498d732f091260c61aa7ca1/alpine.iso
target = phd_framework::artifacts::store
|
| 118 | 2026-09-08T19:41:26.991Z | DEBG | phd-runner: [TEST - EVENT] Verified artifact already exists
file = phd-tests/framework/src/artifacts/store.rs
line = 45
path = /phd-artifacts/ba8007f74f9b54fbae3b2520da577831b4834778a498d732f091260c61aa7ca1/alpine.iso
target = phd_framework::artifacts::store
|
| 119 | 2026-09-08T19:41:26.991Z | DEBG | phd-runner: [TEST - EVENT] executing ZFS command
args = ["/phd-artifacts/ba8007f74f9b54fbae3b2520da577831b4834778a498d732f091260c61aa7ca1/alpine.iso"]
file = phd-tests/framework/src/zfs.rs
line = 304
path = phd_tests::migrate::from_base::can_migrate_from_base
target = phd_framework::zfs
verb = list
|
| 120 | 2026-09-08T19:41:27.002Z | DEBG | phd-runner: [TEST - EVENT] parsing zfs list output
file = phd-tests/framework/src/zfs.rs
line = 238
path = phd_tests::migrate::from_base::can_migrate_from_base
stdout = NAME USED AVAIL REFER MOUNTPOINT\nphd-artifacts 1.30G 25.3T 1.30G /phd-artifacts\n
target = phd_framework::zfs
|
| 121 | 2026-09-08T19:41:27.002Z | DEBG | phd-runner: [TEST - EVENT] executing ZFS command
args = ["phd-artifacts@phd-05f54734-bf47-4090-a47f-bf40d6620ee7"]
file = phd-tests/framework/src/zfs.rs
line = 304
path = phd_tests::migrate::from_base::can_migrate_from_base
target = phd_framework::zfs
verb = snapshot
|
| 122 | 2026-09-08T19:41:27.018Z | DEBG | phd-runner: [TEST - EVENT] executing ZFS command
args = ["phd-artifacts@phd-05f54734-bf47-4090-a47f-bf40d6620ee7", "phd-artifacts/phd-clone-3750044e-6a12-4252-a0e0-f3392494465b"]
file = phd-tests/framework/src/zfs.rs
line = 304
path = phd_tests::migrate::from_base::can_migrate_from_base
target = phd_framework::zfs
verb = clone
|
| 123 | 2026-09-08T19:41:27.035Z | DEBG | phd-runner: [TEST - EVENT] executing ZFS command
args = ["phd-artifacts/phd-clone-3750044e-6a12-4252-a0e0-f3392494465b"]
file = phd-tests/framework/src/zfs.rs
line = 304
path = phd_tests::migrate::from_base::can_migrate_from_base
target = phd_framework::zfs
verb = list
|
| 124 | 2026-09-08T19:41:27.046Z | DEBG | phd-runner: [TEST - EVENT] parsing zfs list output
file = phd-tests/framework/src/zfs.rs
line = 238
path = phd_tests::migrate::from_base::can_migrate_from_base
stdout = NAME USED AVAIL REFER MOUNTPOINT\nphd-artifacts/phd-clone-3750044e-6a12-4252-a0e0-f3392494465b 0B 25.3T 1.30G /phd-artifacts/phd-clone-3750044e-6a12-4252-a0e0-f3392494465b\n
target = phd_framework::zfs
|
| 125 | 2026-09-08T19:41:27.047Z | INFO | phd-runner: [NEW - START]
file = phd-tests/framework/src/test_vm/mod.rs
line = 300
path = phd_tests::migrate::from_base::can_migrate_from_base
target = phd_framework::test_vm
|
| 126 | 2026-09-08T19:41:27.047Z | INFO | phd-runner: [NEW - EVENT] phd_framework::test_vm
environment = EnvironmentSpec { location: Local, propolis_artifact: "__BASE_PROPOLIS", metrics: None }
file = phd-tests/framework/src/test_vm/mod.rs
guest_os_kind = Alpine
line = 318
path = phd_tests::migrate::from_base::can_migrate_from_base
target = phd_framework::test_vm
vm_name = migration_from_base
|
| 127 | 2026-09-08T19:41:27.047Z | DEBG | phd-runner: [NEW - EVENT] Verified artifact already exists
file = phd-tests/framework/src/artifacts/store.rs
line = 45
path = /phd-artifacts/279b1c4728a24b4f7a44b54ce9f8f9718dc7bbf7c63d48a3324f98ccba625d72/propolis-server
target = phd_framework::artifacts::store
|
| 128 | 2026-09-08T19:41:27.047Z | INFO | phd-runner: [NEW - EVENT] Launching Propolis server
bootrom_path = "/phd-artifacts/740187046a7267d0de72d3455070333547dbc0ea023531471fb2b2a61effa448/OVMF_CODE.fd"
file = phd-tests/framework/src/test_vm/server.rs
line = 66
path = phd_tests::migrate::from_base::can_migrate_from_base
server_addr = 127.0.0.1:9000
server_path = "/phd-artifacts/279b1c4728a24b4f7a44b54ce9f8f9718dc7bbf7c63d48a3324f98ccba625d72/propolis-server"
target = phd_framework::test_vm::server
|
| 129 | 2026-09-08T19:41:27.047Z | INFO | phd-runner: [NEW - EVENT] Opening server log files
file = phd-tests/framework/src/log_config.rs
line = 84
path = phd_tests::migrate::from_base::can_migrate_from_base
stderr_path = "/tmp/propolis-phd/phd_tests::migrate::from_base::can_migrate_from_base/migration_from_base.stderr.log"
stdout_path = "/tmp/propolis-phd/phd_tests::migrate::from_base::can_migrate_from_base/migration_from_base.stdout.log"
target = phd_framework::log_config
|
| 130 | 2026-09-08T19:41:27.089Z | INFO | phd-runner: [NEW - EVENT] Launched server with pid 927
file = phd-tests/framework/src/test_vm/server.rs
line = 127
path = phd_tests::migrate::from_base::can_migrate_from_base
target = phd_framework::test_vm::server
|
| 131 | 2026-09-08T19:41:27.103Z | INFO | phd-runner: [NEW - END]
elapsed_milliseconds = 56
file = phd-tests/framework/src/test_vm/mod.rs
line = 300
path = phd_tests::migrate::from_base::can_migrate_from_base
target = phd_framework::test_vm
|
| 132 | 2026-09-08T19:41:27.103Z | INFO | phd-runner: [INSTANCE_ENSURE_INTERNAL - START]
file = phd-tests/framework/src/test_vm/mod.rs
line = 412
path = phd_tests::migrate::from_base::can_migrate_from_base
target = phd_framework::test_vm
vm = migration_from_base
vm_id = fc79fc91-8e5b-4315-9ffa-3c7fde2366f7
|
| 133 | 2026-09-08T19:41:27.104Z | INFO | phd-runner: [INSTANCE_ENSURE_INTERNAL - EVENT] retriable error from instance_spec_ensure
e = Communication Error: error sending request for url (http://127.0.0.1:9000/instance)
file = phd-tests/framework/src/test_vm/mod.rs
line = 455
path = phd_tests::migrate::from_base::can_migrate_from_base
target = phd_framework::test_vm
vm = migration_from_base
vm_id = fc79fc91-8e5b-4315-9ffa-3c7fde2366f7
|
| 134 | 2026-09-08T19:41:27.794Z | INFO | phd-runner: [SERIAL CONSOLE TASK - START]
file = phd-tests/framework/src/serial/mod.rs
line = 200
target = phd_framework::serial
|
| 135 | 2026-09-08T19:41:27.795Z | INFO | phd-runner: [INSTANCE_ENSURE_INTERNAL - EVENT] Started instance
file = phd-tests/framework/src/test_vm/mod.rs
instance_description.instance = Instance { properties: InstanceProperties { id: fc79fc91-8e5b-4315-9ffa-3c7fde2366f7, name: "phd-vm-fc79fc91-8e5b-4315-9ffa-3c7fde2366f7", description: "Pheidippides-managed VM", metadata: InstanceMetadata { silo_id: 008f6c71-c565-491b-9c86-9bec10814da0, project_id: c5f6192d-06b2-45dc-bd6b-f6fb31fe34a6, sled_id: e70b2e03-6ba3-4703-a4a5-c5df77498e35, sled_serial: "e70b2e03-6ba3-4703-a4a5-c5df77498e35", sled_revision: 1, sled_model: "pheidippes" } }, state: Creating }
line = 514
path = phd_tests::migrate::from_base::can_migrate_from_base
target = phd_framework::test_vm
vm = migration_from_base
vm_id = fc79fc91-8e5b-4315-9ffa-3c7fde2366f7
|
| 136 | 2026-09-08T19:41:27.795Z | INFO | phd-runner: [PUT_INSTANCE_STATE - START]
file = phd-tests/framework/src/test_vm/mod.rs
line = 575
path = phd_tests::migrate::from_base::can_migrate_from_base
target = phd_framework::test_vm
vm = migration_from_base
vm_id = fc79fc91-8e5b-4315-9ffa-3c7fde2366f7
|
| 137 | 2026-09-08T19:41:27.795Z | INFO | phd-runner: [PUT_INSTANCE_STATE - EVENT] Requesting instance state change
file = phd-tests/framework/src/test_vm/mod.rs
line = 580
path = phd_tests::migrate::from_base::can_migrate_from_base
state = Run
target = phd_framework::test_vm
vm = migration_from_base
vm_id = fc79fc91-8e5b-4315-9ffa-3c7fde2366f7
|
| 138 | 2026-09-08T19:41:27.796Z | INFO | phd-runner: [PUT_INSTANCE_STATE - END]
elapsed_milliseconds = 0
file = phd-tests/framework/src/test_vm/mod.rs
line = 575
path = phd_tests::migrate::from_base::can_migrate_from_base
target = phd_framework::test_vm
vm = migration_from_base
vm_id = fc79fc91-8e5b-4315-9ffa-3c7fde2366f7
|
| 139 | 2026-09-08T19:41:27.796Z | INFO | phd-runner: [WAIT_TO_BOOT - START]
file = phd-tests/framework/src/test_vm/mod.rs
line = 890
path = phd_tests::migrate::from_base::can_migrate_from_base
target = phd_framework::test_vm
|
| 140 | 2026-09-08T19:41:27.796Z | INFO | phd-runner: [WAIT_TO_BOOT - EVENT] waiting for guest to boot
file = phd-tests/framework/src/test_vm/mod.rs
line = 839
path = phd_tests::migrate::from_base::can_migrate_from_base
target = phd_framework::test_vm
timeout_duration = 300s
vm = migration_from_base
vm_id = fc79fc91-8e5b-4315-9ffa-3c7fde2366f7
|
| 141 | 2026-09-08T19:41:27.796Z | DEBG | phd-runner: [WAIT_TO_BOOT - EVENT] executing command in boot sequence
file = phd-tests/framework/src/test_vm/mod.rs
line = 847
path = phd_tests::migrate::from_base::can_migrate_from_base
step = WaitFor("localhost login: ")
target = phd_framework::test_vm
|
| 142 | 2026-09-08T19:41:27.796Z | INFO | phd-runner: [WAIT_FOR_SERIAL_OUTPUT - START]
file = phd-tests/framework/src/test_vm/mod.rs
line = 913
path = phd_tests::migrate::from_base::can_migrate_from_base
target = phd_framework::test_vm
vm = migration_from_base
vm_id = fc79fc91-8e5b-4315-9ffa-3c7fde2366f7
|
| 143 | 2026-09-08T19:41:27.796Z | INFO | phd-runner: [WAIT_FOR_SERIAL_OUTPUT - EVENT] Waiting for output on serial console
file = phd-tests/framework/src/test_vm/mod.rs
line = 920
path = phd_tests::migrate::from_base::can_migrate_from_base
target = phd_framework::test_vm
timeout_duration = CallerTimeout
vm = migration_from_base
vm_id = fc79fc91-8e5b-4315-9ffa-3c7fde2366f7
|
| 144 | 2026-09-08T19:41:32.375Z | INFO | phd-runner: [WAIT_FOR_SERIAL_OUTPUT - END]
elapsed_milliseconds = 4578
file = phd-tests/framework/src/test_vm/mod.rs
line = 913
path = phd_tests::migrate::from_base::can_migrate_from_base
target = phd_framework::test_vm
vm = migration_from_base
vm_id = fc79fc91-8e5b-4315-9ffa-3c7fde2366f7
|
| 145 | 2026-09-08T19:41:32.376Z | DEBG | phd-runner: [WAIT_TO_BOOT - EVENT] executing command in boot sequence
file = phd-tests/framework/src/test_vm/mod.rs
line = 847
path = phd_tests::migrate::from_base::can_migrate_from_base
step = WriteStr("root")
target = phd_framework::test_vm
|
| 146 | 2026-09-08T19:41:32.376Z | DEBG | phd-runner: [WAIT_TO_BOOT - EVENT] executing command in boot sequence
file = phd-tests/framework/src/test_vm/mod.rs
line = 847
path = phd_tests::migrate::from_base::can_migrate_from_base
step = WaitFor("localhost:~#")
target = phd_framework::test_vm
|
| 147 | 2026-09-08T19:41:32.376Z | INFO | phd-runner: [WAIT_FOR_SERIAL_OUTPUT - START]
file = phd-tests/framework/src/test_vm/mod.rs
line = 913
path = phd_tests::migrate::from_base::can_migrate_from_base
target = phd_framework::test_vm
vm = migration_from_base
vm_id = fc79fc91-8e5b-4315-9ffa-3c7fde2366f7
|
| 148 | 2026-09-08T19:41:32.376Z | INFO | phd-runner: [WAIT_FOR_SERIAL_OUTPUT - EVENT] Waiting for output on serial console
file = phd-tests/framework/src/test_vm/mod.rs
line = 920
path = phd_tests::migrate::from_base::can_migrate_from_base
target = phd_framework::test_vm
timeout_duration = CallerTimeout
vm = migration_from_base
vm_id = fc79fc91-8e5b-4315-9ffa-3c7fde2366f7
|
| 149 | 2026-09-08T19:41:32.394Z | INFO | phd-runner: [WAIT_FOR_SERIAL_OUTPUT - END]
elapsed_milliseconds = 18
file = phd-tests/framework/src/test_vm/mod.rs
line = 913
path = phd_tests::migrate::from_base::can_migrate_from_base
target = phd_framework::test_vm
vm = migration_from_base
vm_id = fc79fc91-8e5b-4315-9ffa-3c7fde2366f7
|
| 150 | 2026-09-08T19:41:32.395Z | DEBG | phd-runner: [WAIT_TO_BOOT - EVENT] executing command in boot sequence
file = phd-tests/framework/src/test_vm/mod.rs
line = 847
path = phd_tests::migrate::from_base::can_migrate_from_base
step = WriteStr("stty -F `tty` cols 9999")
target = phd_framework::test_vm
|
| 151 | 2026-09-08T19:41:32.395Z | DEBG | phd-runner: [WAIT_TO_BOOT - EVENT] executing command in boot sequence
file = phd-tests/framework/src/test_vm/mod.rs
line = 847
path = phd_tests::migrate::from_base::can_migrate_from_base
step = WaitFor("localhost:~#")
target = phd_framework::test_vm
|
| 152 | 2026-09-08T19:41:32.395Z | INFO | phd-runner: [WAIT_FOR_SERIAL_OUTPUT - START]
file = phd-tests/framework/src/test_vm/mod.rs
line = 913
path = phd_tests::migrate::from_base::can_migrate_from_base
target = phd_framework::test_vm
vm = migration_from_base
vm_id = fc79fc91-8e5b-4315-9ffa-3c7fde2366f7
|
| 153 | 2026-09-08T19:41:32.395Z | INFO | phd-runner: [WAIT_FOR_SERIAL_OUTPUT - EVENT] Waiting for output on serial console
file = phd-tests/framework/src/test_vm/mod.rs
line = 920
path = phd_tests::migrate::from_base::can_migrate_from_base
target = phd_framework::test_vm
timeout_duration = CallerTimeout
vm = migration_from_base
vm_id = fc79fc91-8e5b-4315-9ffa-3c7fde2366f7
|
| 154 | 2026-09-08T19:41:32.428Z | INFO | phd-runner: [WAIT_FOR_SERIAL_OUTPUT - END]
elapsed_milliseconds = 33
file = phd-tests/framework/src/test_vm/mod.rs
line = 913
path = phd_tests::migrate::from_base::can_migrate_from_base
target = phd_framework::test_vm
vm = migration_from_base
vm_id = fc79fc91-8e5b-4315-9ffa-3c7fde2366f7
|
| 155 | 2026-09-08T19:41:32.428Z | INFO | phd-runner: [WAIT_TO_BOOT - EVENT] Guest has booted
file = phd-tests/framework/src/test_vm/mod.rs
line = 887
path = phd_tests::migrate::from_base::can_migrate_from_base
target = phd_framework::test_vm
|
| 156 | 2026-09-08T19:41:32.429Z | INFO | phd-runner: [WAIT_TO_BOOT - END]
elapsed_milliseconds = 4631
file = phd-tests/framework/src/test_vm/mod.rs
line = 890
path = phd_tests::migrate::from_base::can_migrate_from_base
target = phd_framework::test_vm
|
| 157 | 2026-09-08T19:41:32.429Z | INFO | phd-runner: [WAIT_FOR_SERIAL_OUTPUT - START]
file = phd-tests/framework/src/test_vm/mod.rs
line = 913
path = phd_tests::migrate::from_base::can_migrate_from_base
target = phd_framework::test_vm
vm = migration_from_base
vm_id = fc79fc91-8e5b-4315-9ffa-3c7fde2366f7
|
| 158 | 2026-09-08T19:41:32.429Z | INFO | phd-runner: [WAIT_FOR_SERIAL_OUTPUT - EVENT] Waiting for output on serial console
file = phd-tests/framework/src/test_vm/mod.rs
line = 920
path = phd_tests::migrate::from_base::can_migrate_from_base
target = phd_framework::test_vm
timeout_duration = Explicit(15s)
vm = migration_from_base
vm_id = fc79fc91-8e5b-4315-9ffa-3c7fde2366f7
|
| 159 | 2026-09-08T19:41:32.440Z | INFO | phd-runner: [WAIT_FOR_SERIAL_OUTPUT - END]
elapsed_milliseconds = 10
file = phd-tests/framework/src/test_vm/mod.rs
line = 913
path = phd_tests::migrate::from_base::can_migrate_from_base
target = phd_framework::test_vm
vm = migration_from_base
vm_id = fc79fc91-8e5b-4315-9ffa-3c7fde2366f7
|
| 160 | 2026-09-08T19:41:32.440Z | INFO | phd-runner: [WAIT_FOR_SERIAL_OUTPUT - START]
file = phd-tests/framework/src/test_vm/mod.rs
line = 913
path = phd_tests::migrate::from_base::can_migrate_from_base
target = phd_framework::test_vm
vm = migration_from_base
vm_id = fc79fc91-8e5b-4315-9ffa-3c7fde2366f7
|
| 161 | 2026-09-08T19:41:32.440Z | INFO | phd-runner: [WAIT_FOR_SERIAL_OUTPUT - EVENT] Waiting for output on serial console
file = phd-tests/framework/src/test_vm/mod.rs
line = 920
path = phd_tests::migrate::from_base::can_migrate_from_base
target = phd_framework::test_vm
timeout_duration = Explicit(300s)
vm = migration_from_base
vm_id = fc79fc91-8e5b-4315-9ffa-3c7fde2366f7
|
| 162 | 2026-09-08T19:41:32.472Z | INFO | phd-runner: [WAIT_FOR_SERIAL_OUTPUT - END]
elapsed_milliseconds = 32
file = phd-tests/framework/src/test_vm/mod.rs
line = 913
path = phd_tests::migrate::from_base::can_migrate_from_base
target = phd_framework::test_vm
vm = migration_from_base
vm_id = fc79fc91-8e5b-4315-9ffa-3c7fde2366f7
|
| 163 | 2026-09-08T19:41:32.473Z | INFO | phd-runner: [WAIT_FOR_SERIAL_OUTPUT - START]
file = phd-tests/framework/src/test_vm/mod.rs
line = 913
path = phd_tests::migrate::from_base::can_migrate_from_base
target = phd_framework::test_vm
vm = migration_from_base
vm_id = fc79fc91-8e5b-4315-9ffa-3c7fde2366f7
|
| 164 | 2026-09-08T19:41:32.474Z | INFO | phd-runner: [WAIT_FOR_SERIAL_OUTPUT - EVENT] Waiting for output on serial console
file = phd-tests/framework/src/test_vm/mod.rs
line = 920
path = phd_tests::migrate::from_base::can_migrate_from_base
target = phd_framework::test_vm
timeout_duration = Explicit(15s)
vm = migration_from_base
vm_id = fc79fc91-8e5b-4315-9ffa-3c7fde2366f7
|
| 165 | 2026-09-08T19:41:32.483Z | INFO | phd-runner: [WAIT_FOR_SERIAL_OUTPUT - END]
elapsed_milliseconds = 9
file = phd-tests/framework/src/test_vm/mod.rs
line = 913
path = phd_tests::migrate::from_base::can_migrate_from_base
target = phd_framework::test_vm
vm = migration_from_base
vm_id = fc79fc91-8e5b-4315-9ffa-3c7fde2366f7
|
| 166 | 2026-09-08T19:41:32.484Z | INFO | phd-runner: [WAIT_FOR_SERIAL_OUTPUT - START]
file = phd-tests/framework/src/test_vm/mod.rs
line = 913
path = phd_tests::migrate::from_base::can_migrate_from_base
target = phd_framework::test_vm
vm = migration_from_base
vm_id = fc79fc91-8e5b-4315-9ffa-3c7fde2366f7
|
| 167 | 2026-09-08T19:41:32.484Z | INFO | phd-runner: [WAIT_FOR_SERIAL_OUTPUT - EVENT] Waiting for output on serial console
file = phd-tests/framework/src/test_vm/mod.rs
line = 920
path = phd_tests::migrate::from_base::can_migrate_from_base
target = phd_framework::test_vm
timeout_duration = Explicit(300s)
vm = migration_from_base
vm_id = fc79fc91-8e5b-4315-9ffa-3c7fde2366f7
|
| 168 | 2026-09-08T19:41:32.516Z | INFO | phd-runner: [WAIT_FOR_SERIAL_OUTPUT - END]
elapsed_milliseconds = 32
file = phd-tests/framework/src/test_vm/mod.rs
line = 913
path = phd_tests::migrate::from_base::can_migrate_from_base
target = phd_framework::test_vm
vm = migration_from_base
vm_id = fc79fc91-8e5b-4315-9ffa-3c7fde2366f7
|
| 169 | 2026-09-08T19:41:32.516Z | INFO | phd-runner: [WAIT_FOR_SERIAL_OUTPUT - START]
file = phd-tests/framework/src/test_vm/mod.rs
line = 913
path = phd_tests::migrate::from_base::can_migrate_from_base
target = phd_framework::test_vm
vm = migration_from_base
vm_id = fc79fc91-8e5b-4315-9ffa-3c7fde2366f7
|
| 170 | 2026-09-08T19:41:32.516Z | INFO | phd-runner: [WAIT_FOR_SERIAL_OUTPUT - EVENT] Waiting for output on serial console
file = phd-tests/framework/src/test_vm/mod.rs
line = 920
path = phd_tests::migrate::from_base::can_migrate_from_base
target = phd_framework::test_vm
timeout_duration = Explicit(15s)
vm = migration_from_base
vm_id = fc79fc91-8e5b-4315-9ffa-3c7fde2366f7
|
| 171 | 2026-09-08T19:41:32.527Z | INFO | phd-runner: [WAIT_FOR_SERIAL_OUTPUT - END]
elapsed_milliseconds = 10
file = phd-tests/framework/src/test_vm/mod.rs
line = 913
path = phd_tests::migrate::from_base::can_migrate_from_base
target = phd_framework::test_vm
vm = migration_from_base
vm_id = fc79fc91-8e5b-4315-9ffa-3c7fde2366f7
|
| 172 | 2026-09-08T19:41:32.527Z | INFO | phd-runner: [WAIT_FOR_SERIAL_OUTPUT - START]
file = phd-tests/framework/src/test_vm/mod.rs
line = 913
path = phd_tests::migrate::from_base::can_migrate_from_base
target = phd_framework::test_vm
vm = migration_from_base
vm_id = fc79fc91-8e5b-4315-9ffa-3c7fde2366f7
|
| 173 | 2026-09-08T19:41:32.527Z | INFO | phd-runner: [WAIT_FOR_SERIAL_OUTPUT - EVENT] Waiting for output on serial console
file = phd-tests/framework/src/test_vm/mod.rs
line = 920
path = phd_tests::migrate::from_base::can_migrate_from_base
target = phd_framework::test_vm
timeout_duration = Explicit(300s)
vm = migration_from_base
vm_id = fc79fc91-8e5b-4315-9ffa-3c7fde2366f7
|
| 174 | 2026-09-08T19:41:32.560Z | INFO | phd-runner: [WAIT_FOR_SERIAL_OUTPUT - END]
elapsed_milliseconds = 33
file = phd-tests/framework/src/test_vm/mod.rs
line = 913
path = phd_tests::migrate::from_base::can_migrate_from_base
target = phd_framework::test_vm
vm = migration_from_base
vm_id = fc79fc91-8e5b-4315-9ffa-3c7fde2366f7
|
| 175 | 2026-09-08T19:41:32.561Z | INFO | phd-runner: [WAIT_FOR_SERIAL_OUTPUT - START]
file = phd-tests/framework/src/test_vm/mod.rs
line = 913
path = phd_tests::migrate::from_base::can_migrate_from_base
target = phd_framework::test_vm
vm = migration_from_base
vm_id = fc79fc91-8e5b-4315-9ffa-3c7fde2366f7
|
| 176 | 2026-09-08T19:41:32.561Z | INFO | phd-runner: [WAIT_FOR_SERIAL_OUTPUT - EVENT] Waiting for output on serial console
file = phd-tests/framework/src/test_vm/mod.rs
line = 920
path = phd_tests::migrate::from_base::can_migrate_from_base
target = phd_framework::test_vm
timeout_duration = Explicit(15s)
vm = migration_from_base
vm_id = fc79fc91-8e5b-4315-9ffa-3c7fde2366f7
|
| 177 | 2026-09-08T19:41:32.571Z | INFO | phd-runner: [WAIT_FOR_SERIAL_OUTPUT - END]
elapsed_milliseconds = 10
file = phd-tests/framework/src/test_vm/mod.rs
line = 913
path = phd_tests::migrate::from_base::can_migrate_from_base
target = phd_framework::test_vm
vm = migration_from_base
vm_id = fc79fc91-8e5b-4315-9ffa-3c7fde2366f7
|
| 178 | 2026-09-08T19:41:32.572Z | INFO | phd-runner: [WAIT_FOR_SERIAL_OUTPUT - START]
file = phd-tests/framework/src/test_vm/mod.rs
line = 913
path = phd_tests::migrate::from_base::can_migrate_from_base
target = phd_framework::test_vm
vm = migration_from_base
vm_id = fc79fc91-8e5b-4315-9ffa-3c7fde2366f7
|
| 179 | 2026-09-08T19:41:32.572Z | INFO | phd-runner: [WAIT_FOR_SERIAL_OUTPUT - EVENT] Waiting for output on serial console
file = phd-tests/framework/src/test_vm/mod.rs
line = 920
path = phd_tests::migrate::from_base::can_migrate_from_base
target = phd_framework::test_vm
timeout_duration = Explicit(300s)
vm = migration_from_base
vm_id = fc79fc91-8e5b-4315-9ffa-3c7fde2366f7
|
| 180 | 2026-09-08T19:41:32.604Z | INFO | phd-runner: [WAIT_FOR_SERIAL_OUTPUT - END]
elapsed_milliseconds = 32
file = phd-tests/framework/src/test_vm/mod.rs
line = 913
path = phd_tests::migrate::from_base::can_migrate_from_base
target = phd_framework::test_vm
vm = migration_from_base
vm_id = fc79fc91-8e5b-4315-9ffa-3c7fde2366f7
|
| 181 | 2026-09-08T19:41:32.604Z | INFO | phd-runner: [WAIT_FOR_SERIAL_OUTPUT - START]
file = phd-tests/framework/src/test_vm/mod.rs
line = 913
path = phd_tests::migrate::from_base::can_migrate_from_base
target = phd_framework::test_vm
vm = migration_from_base
vm_id = fc79fc91-8e5b-4315-9ffa-3c7fde2366f7
|
| 182 | 2026-09-08T19:41:32.604Z | INFO | phd-runner: [WAIT_FOR_SERIAL_OUTPUT - EVENT] Waiting for output on serial console
file = phd-tests/framework/src/test_vm/mod.rs
line = 920
path = phd_tests::migrate::from_base::can_migrate_from_base
target = phd_framework::test_vm
timeout_duration = Explicit(15s)
vm = migration_from_base
vm_id = fc79fc91-8e5b-4315-9ffa-3c7fde2366f7
|
| 183 | 2026-09-08T19:41:32.615Z | INFO | phd-runner: [WAIT_FOR_SERIAL_OUTPUT - END]
elapsed_milliseconds = 10
file = phd-tests/framework/src/test_vm/mod.rs
line = 913
path = phd_tests::migrate::from_base::can_migrate_from_base
target = phd_framework::test_vm
vm = migration_from_base
vm_id = fc79fc91-8e5b-4315-9ffa-3c7fde2366f7
|
| 184 | 2026-09-08T19:41:32.615Z | INFO | phd-runner: [WAIT_FOR_SERIAL_OUTPUT - START]
file = phd-tests/framework/src/test_vm/mod.rs
line = 913
path = phd_tests::migrate::from_base::can_migrate_from_base
target = phd_framework::test_vm
vm = migration_from_base
vm_id = fc79fc91-8e5b-4315-9ffa-3c7fde2366f7
|
| 185 | 2026-09-08T19:41:32.615Z | INFO | phd-runner: [WAIT_FOR_SERIAL_OUTPUT - EVENT] Waiting for output on serial console
file = phd-tests/framework/src/test_vm/mod.rs
line = 920
path = phd_tests::migrate::from_base::can_migrate_from_base
target = phd_framework::test_vm
timeout_duration = Explicit(300s)
vm = migration_from_base
vm_id = fc79fc91-8e5b-4315-9ffa-3c7fde2366f7
|
| 186 | 2026-09-08T19:41:32.648Z | INFO | phd-runner: [WAIT_FOR_SERIAL_OUTPUT - END]
elapsed_milliseconds = 33
file = phd-tests/framework/src/test_vm/mod.rs
line = 913
path = phd_tests::migrate::from_base::can_migrate_from_base
target = phd_framework::test_vm
vm = migration_from_base
vm_id = fc79fc91-8e5b-4315-9ffa-3c7fde2366f7
|
| 187 | 2026-09-08T19:41:32.650Z | INFO | phd-runner: [WAIT_FOR_SERIAL_OUTPUT - START]
file = phd-tests/framework/src/test_vm/mod.rs
line = 913
path = phd_tests::migrate::from_base::can_migrate_from_base
target = phd_framework::test_vm
vm = migration_from_base
vm_id = fc79fc91-8e5b-4315-9ffa-3c7fde2366f7
|
| 188 | 2026-09-08T19:41:32.650Z | INFO | phd-runner: [WAIT_FOR_SERIAL_OUTPUT - EVENT] Waiting for output on serial console
file = phd-tests/framework/src/test_vm/mod.rs
line = 920
path = phd_tests::migrate::from_base::can_migrate_from_base
target = phd_framework::test_vm
timeout_duration = Explicit(15s)
vm = migration_from_base
vm_id = fc79fc91-8e5b-4315-9ffa-3c7fde2366f7
|
| 189 | 2026-09-08T19:41:32.660Z | INFO | phd-runner: [WAIT_FOR_SERIAL_OUTPUT - END]
elapsed_milliseconds = 9
file = phd-tests/framework/src/test_vm/mod.rs
line = 913
path = phd_tests::migrate::from_base::can_migrate_from_base
target = phd_framework::test_vm
vm = migration_from_base
vm_id = fc79fc91-8e5b-4315-9ffa-3c7fde2366f7
|
| 190 | 2026-09-08T19:41:32.660Z | INFO | phd-runner: [WAIT_FOR_SERIAL_OUTPUT - START]
file = phd-tests/framework/src/test_vm/mod.rs
line = 913
path = phd_tests::migrate::from_base::can_migrate_from_base
target = phd_framework::test_vm
vm = migration_from_base
vm_id = fc79fc91-8e5b-4315-9ffa-3c7fde2366f7
|
| 191 | 2026-09-08T19:41:32.660Z | INFO | phd-runner: [WAIT_FOR_SERIAL_OUTPUT - EVENT] Waiting for output on serial console
file = phd-tests/framework/src/test_vm/mod.rs
line = 920
path = phd_tests::migrate::from_base::can_migrate_from_base
target = phd_framework::test_vm
timeout_duration = Explicit(300s)
vm = migration_from_base
vm_id = fc79fc91-8e5b-4315-9ffa-3c7fde2366f7
|
| 192 | 2026-09-08T19:41:32.694Z | INFO | phd-runner: [WAIT_FOR_SERIAL_OUTPUT - END]
elapsed_milliseconds = 33
file = phd-tests/framework/src/test_vm/mod.rs
line = 913
path = phd_tests::migrate::from_base::can_migrate_from_base
target = phd_framework::test_vm
vm = migration_from_base
vm_id = fc79fc91-8e5b-4315-9ffa-3c7fde2366f7
|
| 193 | 2026-09-08T19:41:32.694Z | INFO | phd-runner: [TEST - EVENT] migrating to new Propolis artifact for lifecycle test
file = phd-tests/framework/src/lifecycle.rs
line = 73
path = phd_tests::migrate::from_base::can_migrate_from_base
propolis_artifact = __DEFAULT_PROPOLIS
target = phd_framework::lifecycle
vm_name = migration_from_base
|
| 194 | 2026-09-08T19:41:32.694Z | INFO | phd-runner: [NEW - START]
file = phd-tests/framework/src/test_vm/mod.rs
line = 300
path = phd_tests::migrate::from_base::can_migrate_from_base
target = phd_framework::test_vm
|
| 195 | 2026-09-08T19:41:32.694Z | INFO | phd-runner: [NEW - EVENT] phd_framework::test_vm
environment = EnvironmentSpec { location: Local, propolis_artifact: "__DEFAULT_PROPOLIS", metrics: None }
file = phd-tests/framework/src/test_vm/mod.rs
guest_os_kind = Alpine
line = 318
path = phd_tests::migrate::from_base::can_migrate_from_base
target = phd_framework::test_vm
vm_name = migration_from_base_lifecycle_0
|
| 196 | 2026-09-08T19:41:32.694Z | DEBG | phd-runner: [NEW - EVENT] Verified artifact already exists
file = phd-tests/framework/src/artifacts/store.rs
line = 45
path = /work/phd-test/propolis-server
target = phd_framework::artifacts::store
|
| 197 | 2026-09-08T19:41:32.694Z | INFO | phd-runner: [NEW - EVENT] Launching Propolis server
bootrom_path = "/phd-artifacts/740187046a7267d0de72d3455070333547dbc0ea023531471fb2b2a61effa448/OVMF_CODE.fd"
file = phd-tests/framework/src/test_vm/server.rs
line = 66
path = phd_tests::migrate::from_base::can_migrate_from_base
server_addr = 127.0.0.1:9002
server_path = "/work/phd-test/propolis-server"
target = phd_framework::test_vm::server
|
| 198 | 2026-09-08T19:41:32.694Z | INFO | phd-runner: [NEW - EVENT] Opening server log files
file = phd-tests/framework/src/log_config.rs
line = 84
path = phd_tests::migrate::from_base::can_migrate_from_base
stderr_path = "/tmp/propolis-phd/phd_tests::migrate::from_base::can_migrate_from_base/migration_from_base_lifecycle_0.stderr.log"
stdout_path = "/tmp/propolis-phd/phd_tests::migrate::from_base::can_migrate_from_base/migration_from_base_lifecycle_0.stdout.log"
target = phd_framework::log_config
|
| 199 | 2026-09-08T19:41:32.737Z | INFO | phd-runner: [NEW - EVENT] Launched server with pid 928
file = phd-tests/framework/src/test_vm/server.rs
line = 127
path = phd_tests::migrate::from_base::can_migrate_from_base
target = phd_framework::test_vm::server
|
| 200 | 2026-09-08T19:41:32.750Z | INFO | phd-runner: [NEW - END]
elapsed_milliseconds = 55
file = phd-tests/framework/src/test_vm/mod.rs
line = 300
path = phd_tests::migrate::from_base::can_migrate_from_base
target = phd_framework::test_vm
|
| 201 | 2026-09-08T19:41:32.750Z | INFO | phd-runner: [MIGRATE_FROM - START]
file = phd-tests/framework/src/test_vm/mod.rs
line = 609
path = phd_tests::migrate::from_base::can_migrate_from_base
source = migration_from_base
source_id = fc79fc91-8e5b-4315-9ffa-3c7fde2366f7
target = phd_framework::test_vm
target_id = 6881da58-88da-4867-ac80-cb91d032c8ee
|
| 202 | 2026-09-08T19:41:32.750Z | INFO | phd-runner: [MIGRATE_FROM - EVENT] Migrating from source at address 127.0.0.1:9000
file = phd-tests/framework/src/test_vm/mod.rs
line = 642
migration_id = 330695f7-a906-4ed2-9827-9c2e5fb3ef94
path = phd_tests::migrate::from_base::can_migrate_from_base
source = migration_from_base
source_id = fc79fc91-8e5b-4315-9ffa-3c7fde2366f7
target = phd_framework::test_vm
target_id = 6881da58-88da-4867-ac80-cb91d032c8ee
timeout_duration = 45s
|
| 203 | 2026-09-08T19:41:32.750Z | INFO | phd-runner: [INSTANCE_ENSURE_INTERNAL - START]
file = phd-tests/framework/src/test_vm/mod.rs
line = 412
path = phd_tests::migrate::from_base::can_migrate_from_base
source = migration_from_base
source_id = fc79fc91-8e5b-4315-9ffa-3c7fde2366f7
target = phd_framework::test_vm
target_id = 6881da58-88da-4867-ac80-cb91d032c8ee
vm = migration_from_base_lifecycle_0
vm_id = 6881da58-88da-4867-ac80-cb91d032c8ee
|
| 204 | 2026-09-08T19:41:32.751Z | INFO | phd-runner: [INSTANCE_ENSURE_INTERNAL - EVENT] retriable error from instance_spec_ensure
e = Communication Error: error sending request for url (http://127.0.0.1:9002/instance)
file = phd-tests/framework/src/test_vm/mod.rs
line = 455
path = phd_tests::migrate::from_base::can_migrate_from_base
source = migration_from_base
source_id = fc79fc91-8e5b-4315-9ffa-3c7fde2366f7
target = phd_framework::test_vm
target_id = 6881da58-88da-4867-ac80-cb91d032c8ee
vm = migration_from_base_lifecycle_0
vm_id = 6881da58-88da-4867-ac80-cb91d032c8ee
|
| 205 | 2026-09-08T19:41:33.229Z | INFO | phd-runner: [INSTANCE_ENSURE_INTERNAL - EVENT] Started instance
file = phd-tests/framework/src/test_vm/mod.rs
instance_description.instance = Instance { properties: InstanceProperties { id: 6881da58-88da-4867-ac80-cb91d032c8ee, name: "phd-vm-6881da58-88da-4867-ac80-cb91d032c8ee", description: "Pheidippides-managed VM", metadata: InstanceMetadata { silo_id: 008f6c71-c565-491b-9c86-9bec10814da0, project_id: c5f6192d-06b2-45dc-bd6b-f6fb31fe34a6, sled_id: a223823c-3112-4bab-aee2-8ea60e810616, sled_serial: "a223823c-3112-4bab-aee2-8ea60e810616", sled_revision: 1, sled_model: "pheidippes" } }, state: Migrating }
line = 514
path = phd_tests::migrate::from_base::can_migrate_from_base
source = migration_from_base
source_id = fc79fc91-8e5b-4315-9ffa-3c7fde2366f7
target = phd_framework::test_vm
target_id = 6881da58-88da-4867-ac80-cb91d032c8ee
vm = migration_from_base_lifecycle_0
vm_id = 6881da58-88da-4867-ac80-cb91d032c8ee
|
| 206 | 2026-09-08T19:41:33.230Z | INFO | phd-runner: [MIGRATE - START]
file = phd-tests/framework/src/test_vm/mod.rs
line = 663
migration_id = 330695f7-a906-4ed2-9827-9c2e5fb3ef94
path = phd_tests::migrate::from_base::can_migrate_from_base
source = migration_from_base
source_id = fc79fc91-8e5b-4315-9ffa-3c7fde2366f7
target = phd_framework::test_vm
target_id = 6881da58-88da-4867-ac80-cb91d032c8ee
|
| 207 | 2026-09-08T19:41:35.718Z | INFO | phd-runner: [MIGRATE_FROM - EVENT] Migration completed successfully
file = phd-tests/framework/src/test_vm/mod.rs
line = 676
path = phd_tests::migrate::from_base::can_migrate_from_base
source = migration_from_base
source_id = fc79fc91-8e5b-4315-9ffa-3c7fde2366f7
target = phd_framework::test_vm
target_id = 6881da58-88da-4867-ac80-cb91d032c8ee
|
| 208 | 2026-09-08T19:41:35.719Z | INFO | phd-runner: [SERIAL CONSOLE TASK - EVENT] serial socket control message
file = phd-tests/framework/src/serial/mod.rs
line = 275
s = {"Migrating":{"destination":"127.0.0.1:9002","from_start":7847}}
target = phd_framework::serial
|
| 209 | 2026-09-08T19:41:35.727Z | INFO | phd-runner: [VM CLEANUP - START]
file = phd-tests/framework/src/test_vm/mod.rs
line = 1172
path = phd_tests::migrate::from_base::can_migrate_from_base
target = phd_framework::test_vm
vm = migration_from_base
vm_id = fc79fc91-8e5b-4315-9ffa-3c7fde2366f7
|
| 210 | 2026-09-08T19:41:35.728Z | INFO | phd-runner: [WAIT_FOR_SERIAL_OUTPUT - START]
file = phd-tests/framework/src/test_vm/mod.rs
line = 913
path = phd_tests::migrate::from_base::can_migrate_from_base
target = phd_framework::test_vm
vm = migration_from_base_lifecycle_0
vm_id = 6881da58-88da-4867-ac80-cb91d032c8ee
|
| 211 | 2026-09-08T19:41:35.728Z | INFO | phd-runner: [WAIT_FOR_SERIAL_OUTPUT - EVENT] Waiting for output on serial console
file = phd-tests/framework/src/test_vm/mod.rs
line = 920
path = phd_tests::migrate::from_base::can_migrate_from_base
target = phd_framework::test_vm
timeout_duration = Explicit(15s)
vm = migration_from_base_lifecycle_0
vm_id = 6881da58-88da-4867-ac80-cb91d032c8ee
|
| 212 | 2026-09-08T19:41:35.729Z | DEBG | phd-runner: [VM CLEANUP - EVENT] Killing Propolis server process
file = phd-tests/framework/src/test_vm/server.rs
line = 177
path = phd_tests::migrate::from_base::can_migrate_from_base
self.address = 127.0.0.1:9000
target = phd_framework::test_vm::server
vm = migration_from_base
vm_id = fc79fc91-8e5b-4315-9ffa-3c7fde2366f7
|
| 213 | 2026-09-08T19:41:35.809Z | INFO | phd-runner: [VM CLEANUP - END]
elapsed_milliseconds = 81
file = phd-tests/framework/src/test_vm/mod.rs
line = 1172
path = phd_tests::migrate::from_base::can_migrate_from_base
target = phd_framework::test_vm
vm = migration_from_base
vm_id = fc79fc91-8e5b-4315-9ffa-3c7fde2366f7
|
| 214 | 2026-09-08T19:41:35.809Z | INFO | phd-runner: [INSTANCE_ENSURE_INTERNAL - END]
elapsed_milliseconds = 8703
file = phd-tests/framework/src/test_vm/mod.rs
line = 412
path = phd_tests::migrate::from_base::can_migrate_from_base
target = phd_framework::test_vm
vm = migration_from_base
vm_id = fc79fc91-8e5b-4315-9ffa-3c7fde2366f7
|
| 215 | 2026-09-08T19:41:35.809Z | INFO | phd-runner: [WAIT_FOR_SERIAL_OUTPUT - END]
elapsed_milliseconds = 81
file = phd-tests/framework/src/test_vm/mod.rs
line = 913
path = phd_tests::migrate::from_base::can_migrate_from_base
target = phd_framework::test_vm
vm = migration_from_base_lifecycle_0
vm_id = 6881da58-88da-4867-ac80-cb91d032c8ee
|
| 216 | 2026-09-08T19:41:35.809Z | INFO | phd-runner: [WAIT_FOR_SERIAL_OUTPUT - START]
file = phd-tests/framework/src/test_vm/mod.rs
line = 913
path = phd_tests::migrate::from_base::can_migrate_from_base
target = phd_framework::test_vm
vm = migration_from_base_lifecycle_0
vm_id = 6881da58-88da-4867-ac80-cb91d032c8ee
|
| 217 | 2026-09-08T19:41:35.810Z | INFO | phd-runner: [WAIT_FOR_SERIAL_OUTPUT - EVENT] Waiting for output on serial console
file = phd-tests/framework/src/test_vm/mod.rs
line = 920
path = phd_tests::migrate::from_base::can_migrate_from_base
target = phd_framework::test_vm
timeout_duration = Explicit(300s)
vm = migration_from_base_lifecycle_0
vm_id = 6881da58-88da-4867-ac80-cb91d032c8ee
|
| 218 | 2026-09-08T19:41:35.839Z | INFO | phd-runner: [WAIT_FOR_SERIAL_OUTPUT - END]
elapsed_milliseconds = 29
file = phd-tests/framework/src/test_vm/mod.rs
line = 913
path = phd_tests::migrate::from_base::can_migrate_from_base
target = phd_framework::test_vm
vm = migration_from_base_lifecycle_0
vm_id = 6881da58-88da-4867-ac80-cb91d032c8ee
|
| 219 | 2026-09-08T19:41:35.840Z | INFO | phd-runner: [VM CLEANUP - START]
file = phd-tests/framework/src/test_vm/mod.rs
line = 1172
path = phd_tests::migrate::from_base::can_migrate_from_base
target = phd_framework::test_vm
vm = migration_from_base_lifecycle_0
vm_id = 6881da58-88da-4867-ac80-cb91d032c8ee
|
| 220 | 2026-09-08T19:41:35.840Z | DEBG | phd-runner: [SERIAL CONSOLE TASK - EVENT] serial console command channel was closed
file = phd-tests/framework/src/serial/mod.rs
line = 213
target = phd_framework::serial
|
| 221 | 2026-09-08T19:41:35.840Z | INFO | phd-runner: test phd_tests::migrate::from_base::can_migrate_from_base ... ok
file = phd-tests/runner/src/execute.rs
line = 141
target = phd_runner::execute
|
| 222 | 2026-09-08T19:41:35.840Z | INFO | phd-runner: [SERIAL CONSOLE TASK - END]
elapsed_milliseconds = 8044
file = phd-tests/framework/src/serial/mod.rs
line = 200
target = phd_framework::serial
|
| 223 | 2026-09-08T19:41:35.840Z | INFO | phd-runner: [TEST_CLEANUP - START]
file = phd-tests/runner/src/fixtures.rs
line = 51
target = phd_runner::fixtures
|
| 224 | 2026-09-08T19:41:35.841Z | DEBG | phd-runner: [VM CLEANUP - EVENT] trying to ensure Propolis server VM is destroyed
file = phd-tests/framework/src/test_vm/mod.rs
line = 1195
path = phd_tests::migrate::from_base::can_migrate_from_base
target = phd_framework::test_vm
vm = migration_from_base_lifecycle_0
vm_id = 6881da58-88da-4867-ac80-cb91d032c8ee
|
| 225 | 2026-09-08T19:41:36.321Z | DEBG | phd-runner: [VM CLEANUP - EVENT] Killing Propolis server process
file = phd-tests/framework/src/test_vm/server.rs
line = 177
path = phd_tests::migrate::from_base::can_migrate_from_base
self.address = 127.0.0.1:9002
target = phd_framework::test_vm::server
vm = migration_from_base_lifecycle_0
vm_id = 6881da58-88da-4867-ac80-cb91d032c8ee
|
| 226 | 2026-09-08T19:41:36.407Z | DEBG | phd-runner: [VM CLEANUP - EVENT] zfs clone dropped
file = phd-tests/framework/src/zfs.rs
line = 83
path = phd_tests::migrate::from_base::can_migrate_from_base
target = phd_framework::zfs
vm = migration_from_base_lifecycle_0
vm_id = 6881da58-88da-4867-ac80-cb91d032c8ee
|
| 227 | 2026-09-08T19:41:36.407Z | DEBG | phd-runner: [VM CLEANUP - EVENT] executing ZFS command
args = ["phd-artifacts/phd-clone-3750044e-6a12-4252-a0e0-f3392494465b"]
file = phd-tests/framework/src/zfs.rs
line = 304
path = phd_tests::migrate::from_base::can_migrate_from_base
target = phd_framework::zfs
verb = destroy
vm = migration_from_base_lifecycle_0
vm_id = 6881da58-88da-4867-ac80-cb91d032c8ee
|
| 228 | 2026-09-08T19:41:36.435Z | DEBG | phd-runner: [VM CLEANUP - EVENT] zfs snapshot dropped
file = phd-tests/framework/src/zfs.rs
line = 57
path = phd_tests::migrate::from_base::can_migrate_from_base
target = phd_framework::zfs
vm = migration_from_base_lifecycle_0
vm_id = 6881da58-88da-4867-ac80-cb91d032c8ee
|
| 229 | 2026-09-08T19:41:36.436Z | DEBG | phd-runner: [VM CLEANUP - EVENT] executing ZFS command
args = ["phd-artifacts@phd-05f54734-bf47-4090-a47f-bf40d6620ee7"]
file = phd-tests/framework/src/zfs.rs
line = 304
path = phd_tests::migrate::from_base::can_migrate_from_base
target = phd_framework::zfs
verb = destroy
vm = migration_from_base_lifecycle_0
vm_id = 6881da58-88da-4867-ac80-cb91d032c8ee
|
| 230 | 2026-09-08T19:41:36.454Z | INFO | phd-runner: [VM CLEANUP - END]
elapsed_milliseconds = 614
file = phd-tests/framework/src/test_vm/mod.rs
line = 1172
path = phd_tests::migrate::from_base::can_migrate_from_base
target = phd_framework::test_vm
vm = migration_from_base_lifecycle_0
vm_id = 6881da58-88da-4867-ac80-cb91d032c8ee
|
| 231 | 2026-09-08T19:41:36.454Z | INFO | phd-runner: [INSTANCE_ENSURE_INTERNAL - END]
elapsed_milliseconds = 3703
file = phd-tests/framework/src/test_vm/mod.rs
line = 412
path = phd_tests::migrate::from_base::can_migrate_from_base
source = migration_from_base
source_id = fc79fc91-8e5b-4315-9ffa-3c7fde2366f7
target = phd_framework::test_vm
target_id = 6881da58-88da-4867-ac80-cb91d032c8ee
vm = migration_from_base_lifecycle_0
vm_id = 6881da58-88da-4867-ac80-cb91d032c8ee
|
| 232 | 2026-09-08T19:41:36.455Z | INFO | phd-runner: [TEST_CLEANUP - END]
elapsed_milliseconds = 614
file = phd-tests/runner/src/fixtures.rs
line = 51
target = phd_runner::fixtures
|
| 233 | 2026-09-08T19:41:36.455Z | INFO | phd-runner: Starting test phd_tests::migrate::from_base::migration_from_base_and_back
file = phd-tests/runner/src/execute.rs
line = 91
target = phd_runner::execute
|
| 234 | 2026-09-08T19:41:36.455Z | INFO | phd-runner: [TEST_SETUP - START]
file = phd-tests/runner/src/fixtures.rs
line = 41
target = phd_runner::fixtures
|
| 235 | 2026-09-08T19:41:36.455Z | INFO | phd-runner: [TEST_SETUP - END]
elapsed_milliseconds = 0
file = phd-tests/runner/src/fixtures.rs
line = 41
target = phd_runner::fixtures
|
| 236 | 2026-09-08T19:41:36.455Z | INFO | phd-runner: [TEST - START]
file = phd-tests/tests/src/migrate.rs
line = 52
path = phd_tests::migrate::from_base::migration_from_base_and_back
target = phd_tests::migrate::from_base
|
| 237 | 2026-09-08T19:41:36.455Z | DEBG | phd-runner: [TEST - EVENT] Verified artifact already exists
file = phd-tests/framework/src/artifacts/store.rs
line = 45
path = /phd-artifacts/740187046a7267d0de72d3455070333547dbc0ea023531471fb2b2a61effa448/OVMF_CODE.fd
target = phd_framework::artifacts::store
|
| 238 | 2026-09-08T19:41:36.455Z | DEBG | phd-runner: [TEST - EVENT] Verified artifact already exists
file = phd-tests/framework/src/artifacts/store.rs
line = 45
path = /phd-artifacts/ba8007f74f9b54fbae3b2520da577831b4834778a498d732f091260c61aa7ca1/alpine.iso
target = phd_framework::artifacts::store
|
| 239 | 2026-09-08T19:41:36.455Z | DEBG | phd-runner: [TEST - EVENT] Verified artifact already exists
file = phd-tests/framework/src/artifacts/store.rs
line = 45
path = /phd-artifacts/ba8007f74f9b54fbae3b2520da577831b4834778a498d732f091260c61aa7ca1/alpine.iso
target = phd_framework::artifacts::store
|
| 240 | 2026-09-08T19:41:36.455Z | DEBG | phd-runner: [TEST - EVENT] executing ZFS command
args = ["/phd-artifacts/ba8007f74f9b54fbae3b2520da577831b4834778a498d732f091260c61aa7ca1/alpine.iso"]
file = phd-tests/framework/src/zfs.rs
line = 304
path = phd_tests::migrate::from_base::migration_from_base_and_back
target = phd_framework::zfs
verb = list
|
| 241 | 2026-09-08T19:41:36.467Z | DEBG | phd-runner: [TEST - EVENT] parsing zfs list output
file = phd-tests/framework/src/zfs.rs
line = 238
path = phd_tests::migrate::from_base::migration_from_base_and_back
stdout = NAME USED AVAIL REFER MOUNTPOINT\nphd-artifacts 1.30G 25.3T 1.30G /phd-artifacts\n
target = phd_framework::zfs
|
| 242 | 2026-09-08T19:41:36.467Z | DEBG | phd-runner: [TEST - EVENT] executing ZFS command
args = ["phd-artifacts@phd-10573c21-93c0-48fd-8541-7102e5182df3"]
file = phd-tests/framework/src/zfs.rs
line = 304
path = phd_tests::migrate::from_base::migration_from_base_and_back
target = phd_framework::zfs
verb = snapshot
|
| 243 | 2026-09-08T19:41:36.488Z | DEBG | phd-runner: [TEST - EVENT] executing ZFS command
args = ["phd-artifacts@phd-10573c21-93c0-48fd-8541-7102e5182df3", "phd-artifacts/phd-clone-c4d09cd8-32c9-421d-be06-d24478bb8cfe"]
file = phd-tests/framework/src/zfs.rs
line = 304
path = phd_tests::migrate::from_base::migration_from_base_and_back
target = phd_framework::zfs
verb = clone
|
| 244 | 2026-09-08T19:41:36.506Z | DEBG | phd-runner: [TEST - EVENT] executing ZFS command
args = ["phd-artifacts/phd-clone-c4d09cd8-32c9-421d-be06-d24478bb8cfe"]
file = phd-tests/framework/src/zfs.rs
line = 304
path = phd_tests::migrate::from_base::migration_from_base_and_back
target = phd_framework::zfs
verb = list
|
| 245 | 2026-09-08T19:41:36.518Z | DEBG | phd-runner: [TEST - EVENT] parsing zfs list output
file = phd-tests/framework/src/zfs.rs
line = 238
path = phd_tests::migrate::from_base::migration_from_base_and_back
stdout = NAME USED AVAIL REFER MOUNTPOINT\nphd-artifacts/phd-clone-c4d09cd8-32c9-421d-be06-d24478bb8cfe 0B 25.3T 1.30G /phd-artifacts/phd-clone-c4d09cd8-32c9-421d-be06-d24478bb8cfe\n
target = phd_framework::zfs
|
| 246 | 2026-09-08T19:41:36.519Z | INFO | phd-runner: [NEW - START]
file = phd-tests/framework/src/test_vm/mod.rs
line = 300
path = phd_tests::migrate::from_base::migration_from_base_and_back
target = phd_framework::test_vm
|
| 247 | 2026-09-08T19:41:36.519Z | INFO | phd-runner: [NEW - EVENT] phd_framework::test_vm
environment = EnvironmentSpec { location: Local, propolis_artifact: "__BASE_PROPOLIS", metrics: None }
file = phd-tests/framework/src/test_vm/mod.rs
guest_os_kind = Alpine
line = 318
path = phd_tests::migrate::from_base::migration_from_base_and_back
target = phd_framework::test_vm
vm_name = migration_from_base_and_back
|
| 248 | 2026-09-08T19:41:36.519Z | DEBG | phd-runner: [NEW - EVENT] Verified artifact already exists
file = phd-tests/framework/src/artifacts/store.rs
line = 45
path = /phd-artifacts/279b1c4728a24b4f7a44b54ce9f8f9718dc7bbf7c63d48a3324f98ccba625d72/propolis-server
target = phd_framework::artifacts::store
|
| 249 | 2026-09-08T19:41:36.519Z | INFO | phd-runner: [NEW - EVENT] Launching Propolis server
bootrom_path = "/phd-artifacts/740187046a7267d0de72d3455070333547dbc0ea023531471fb2b2a61effa448/OVMF_CODE.fd"
file = phd-tests/framework/src/test_vm/server.rs
line = 66
path = phd_tests::migrate::from_base::migration_from_base_and_back
server_addr = 127.0.0.1:9000
server_path = "/phd-artifacts/279b1c4728a24b4f7a44b54ce9f8f9718dc7bbf7c63d48a3324f98ccba625d72/propolis-server"
target = phd_framework::test_vm::server
|
| 250 | 2026-09-08T19:41:36.519Z | INFO | phd-runner: [NEW - EVENT] Opening server log files
file = phd-tests/framework/src/log_config.rs
line = 84
path = phd_tests::migrate::from_base::migration_from_base_and_back
stderr_path = "/tmp/propolis-phd/phd_tests::migrate::from_base::migration_from_base_and_back/migration_from_base_and_back.stderr.log"
stdout_path = "/tmp/propolis-phd/phd_tests::migrate::from_base::migration_from_base_and_back/migration_from_base_and_back.stdout.log"
target = phd_framework::log_config
|
| 251 | 2026-09-08T19:41:36.564Z | INFO | phd-runner: [NEW - EVENT] Launched server with pid 937
file = phd-tests/framework/src/test_vm/server.rs
line = 127
path = phd_tests::migrate::from_base::migration_from_base_and_back
target = phd_framework::test_vm::server
|
| 252 | 2026-09-08T19:41:36.578Z | INFO | phd-runner: [NEW - END]
elapsed_milliseconds = 59
file = phd-tests/framework/src/test_vm/mod.rs
line = 300
path = phd_tests::migrate::from_base::migration_from_base_and_back
target = phd_framework::test_vm
|
| 253 | 2026-09-08T19:41:36.578Z | INFO | phd-runner: [INSTANCE_ENSURE_INTERNAL - START]
file = phd-tests/framework/src/test_vm/mod.rs
line = 412
path = phd_tests::migrate::from_base::migration_from_base_and_back
target = phd_framework::test_vm
vm = migration_from_base_and_back
vm_id = f5caf15f-329e-4900-8e46-5cab9651c751
|
| 254 | 2026-09-08T19:41:36.579Z | INFO | phd-runner: [INSTANCE_ENSURE_INTERNAL - EVENT] retriable error from instance_spec_ensure
e = Communication Error: error sending request for url (http://127.0.0.1:9000/instance)
file = phd-tests/framework/src/test_vm/mod.rs
line = 455
path = phd_tests::migrate::from_base::migration_from_base_and_back
target = phd_framework::test_vm
vm = migration_from_base_and_back
vm_id = f5caf15f-329e-4900-8e46-5cab9651c751
|
| 255 | 2026-09-08T19:41:37.142Z | INFO | phd-runner: [SERIAL CONSOLE TASK - START]
file = phd-tests/framework/src/serial/mod.rs
line = 200
target = phd_framework::serial
|
| 256 | 2026-09-08T19:41:37.143Z | INFO | phd-runner: [INSTANCE_ENSURE_INTERNAL - EVENT] Started instance
file = phd-tests/framework/src/test_vm/mod.rs
instance_description.instance = Instance { properties: InstanceProperties { id: f5caf15f-329e-4900-8e46-5cab9651c751, name: "phd-vm-f5caf15f-329e-4900-8e46-5cab9651c751", description: "Pheidippides-managed VM", metadata: InstanceMetadata { silo_id: 5c1483ba-c2a2-4954-8fc9-5ffa23da16f8, project_id: 2dfffbbd-f8d8-42e5-8760-6e2d5cd4e7b3, sled_id: ee829054-c021-48bc-b654-1882e4ed63af, sled_serial: "ee829054-c021-48bc-b654-1882e4ed63af", sled_revision: 1, sled_model: "pheidippes" } }, state: Creating }
line = 514
path = phd_tests::migrate::from_base::migration_from_base_and_back
target = phd_framework::test_vm
vm = migration_from_base_and_back
vm_id = f5caf15f-329e-4900-8e46-5cab9651c751
|
| 257 | 2026-09-08T19:41:37.144Z | INFO | phd-runner: [PUT_INSTANCE_STATE - START]
file = phd-tests/framework/src/test_vm/mod.rs
line = 575
path = phd_tests::migrate::from_base::migration_from_base_and_back
target = phd_framework::test_vm
vm = migration_from_base_and_back
vm_id = f5caf15f-329e-4900-8e46-5cab9651c751
|
| 258 | 2026-09-08T19:41:37.144Z | INFO | phd-runner: [PUT_INSTANCE_STATE - EVENT] Requesting instance state change
file = phd-tests/framework/src/test_vm/mod.rs
line = 580
path = phd_tests::migrate::from_base::migration_from_base_and_back
state = Run
target = phd_framework::test_vm
vm = migration_from_base_and_back
vm_id = f5caf15f-329e-4900-8e46-5cab9651c751
|
| 259 | 2026-09-08T19:41:37.145Z | INFO | phd-runner: [PUT_INSTANCE_STATE - END]
elapsed_milliseconds = 0
file = phd-tests/framework/src/test_vm/mod.rs
line = 575
path = phd_tests::migrate::from_base::migration_from_base_and_back
target = phd_framework::test_vm
vm = migration_from_base_and_back
vm_id = f5caf15f-329e-4900-8e46-5cab9651c751
|
| 260 | 2026-09-08T19:41:37.145Z | INFO | phd-runner: [WAIT_TO_BOOT - START]
file = phd-tests/framework/src/test_vm/mod.rs
line = 890
path = phd_tests::migrate::from_base::migration_from_base_and_back
target = phd_framework::test_vm
|
| 261 | 2026-09-08T19:41:37.145Z | INFO | phd-runner: [WAIT_TO_BOOT - EVENT] waiting for guest to boot
file = phd-tests/framework/src/test_vm/mod.rs
line = 839
path = phd_tests::migrate::from_base::migration_from_base_and_back
target = phd_framework::test_vm
timeout_duration = 300s
vm = migration_from_base_and_back
vm_id = f5caf15f-329e-4900-8e46-5cab9651c751
|
| 262 | 2026-09-08T19:41:37.145Z | DEBG | phd-runner: [WAIT_TO_BOOT - EVENT] executing command in boot sequence
file = phd-tests/framework/src/test_vm/mod.rs
line = 847
path = phd_tests::migrate::from_base::migration_from_base_and_back
step = WaitFor("localhost login: ")
target = phd_framework::test_vm
|
| 263 | 2026-09-08T19:41:37.145Z | INFO | phd-runner: [WAIT_FOR_SERIAL_OUTPUT - START]
file = phd-tests/framework/src/test_vm/mod.rs
line = 913
path = phd_tests::migrate::from_base::migration_from_base_and_back
target = phd_framework::test_vm
vm = migration_from_base_and_back
vm_id = f5caf15f-329e-4900-8e46-5cab9651c751
|
| 264 | 2026-09-08T19:41:37.145Z | INFO | phd-runner: [WAIT_FOR_SERIAL_OUTPUT - EVENT] Waiting for output on serial console
file = phd-tests/framework/src/test_vm/mod.rs
line = 920
path = phd_tests::migrate::from_base::migration_from_base_and_back
target = phd_framework::test_vm
timeout_duration = CallerTimeout
vm = migration_from_base_and_back
vm_id = f5caf15f-329e-4900-8e46-5cab9651c751
|
| 265 | 2026-09-08T19:41:41.746Z | INFO | phd-runner: [WAIT_FOR_SERIAL_OUTPUT - END]
elapsed_milliseconds = 4599
file = phd-tests/framework/src/test_vm/mod.rs
line = 913
path = phd_tests::migrate::from_base::migration_from_base_and_back
target = phd_framework::test_vm
vm = migration_from_base_and_back
vm_id = f5caf15f-329e-4900-8e46-5cab9651c751
|
| 266 | 2026-09-08T19:41:41.746Z | DEBG | phd-runner: [WAIT_TO_BOOT - EVENT] executing command in boot sequence
file = phd-tests/framework/src/test_vm/mod.rs
line = 847
path = phd_tests::migrate::from_base::migration_from_base_and_back
step = WriteStr("root")
target = phd_framework::test_vm
|
| 267 | 2026-09-08T19:41:41.746Z | DEBG | phd-runner: [WAIT_TO_BOOT - EVENT] executing command in boot sequence
file = phd-tests/framework/src/test_vm/mod.rs
line = 847
path = phd_tests::migrate::from_base::migration_from_base_and_back
step = WaitFor("localhost:~#")
target = phd_framework::test_vm
|
| 268 | 2026-09-08T19:41:41.746Z | INFO | phd-runner: [WAIT_FOR_SERIAL_OUTPUT - START]
file = phd-tests/framework/src/test_vm/mod.rs
line = 913
path = phd_tests::migrate::from_base::migration_from_base_and_back
target = phd_framework::test_vm
vm = migration_from_base_and_back
vm_id = f5caf15f-329e-4900-8e46-5cab9651c751
|
| 269 | 2026-09-08T19:41:41.746Z | INFO | phd-runner: [WAIT_FOR_SERIAL_OUTPUT - EVENT] Waiting for output on serial console
file = phd-tests/framework/src/test_vm/mod.rs
line = 920
path = phd_tests::migrate::from_base::migration_from_base_and_back
target = phd_framework::test_vm
timeout_duration = CallerTimeout
vm = migration_from_base_and_back
vm_id = f5caf15f-329e-4900-8e46-5cab9651c751
|
| 270 | 2026-09-08T19:41:41.764Z | INFO | phd-runner: [WAIT_FOR_SERIAL_OUTPUT - END]
elapsed_milliseconds = 17
file = phd-tests/framework/src/test_vm/mod.rs
line = 913
path = phd_tests::migrate::from_base::migration_from_base_and_back
target = phd_framework::test_vm
vm = migration_from_base_and_back
vm_id = f5caf15f-329e-4900-8e46-5cab9651c751
|
| 271 | 2026-09-08T19:41:41.764Z | DEBG | phd-runner: [WAIT_TO_BOOT - EVENT] executing command in boot sequence
file = phd-tests/framework/src/test_vm/mod.rs
line = 847
path = phd_tests::migrate::from_base::migration_from_base_and_back
step = WriteStr("stty -F `tty` cols 9999")
target = phd_framework::test_vm
|
| 272 | 2026-09-08T19:41:41.765Z | DEBG | phd-runner: [WAIT_TO_BOOT - EVENT] executing command in boot sequence
file = phd-tests/framework/src/test_vm/mod.rs
line = 847
path = phd_tests::migrate::from_base::migration_from_base_and_back
step = WaitFor("localhost:~#")
target = phd_framework::test_vm
|
| 273 | 2026-09-08T19:41:41.765Z | INFO | phd-runner: [WAIT_FOR_SERIAL_OUTPUT - START]
file = phd-tests/framework/src/test_vm/mod.rs
line = 913
path = phd_tests::migrate::from_base::migration_from_base_and_back
target = phd_framework::test_vm
vm = migration_from_base_and_back
vm_id = f5caf15f-329e-4900-8e46-5cab9651c751
|
| 274 | 2026-09-08T19:41:41.765Z | INFO | phd-runner: [WAIT_FOR_SERIAL_OUTPUT - EVENT] Waiting for output on serial console
file = phd-tests/framework/src/test_vm/mod.rs
line = 920
path = phd_tests::migrate::from_base::migration_from_base_and_back
target = phd_framework::test_vm
timeout_duration = CallerTimeout
vm = migration_from_base_and_back
vm_id = f5caf15f-329e-4900-8e46-5cab9651c751
|
| 275 | 2026-09-08T19:41:41.797Z | INFO | phd-runner: [WAIT_FOR_SERIAL_OUTPUT - END]
elapsed_milliseconds = 32
file = phd-tests/framework/src/test_vm/mod.rs
line = 913
path = phd_tests::migrate::from_base::migration_from_base_and_back
target = phd_framework::test_vm
vm = migration_from_base_and_back
vm_id = f5caf15f-329e-4900-8e46-5cab9651c751
|
| 276 | 2026-09-08T19:41:41.797Z | INFO | phd-runner: [WAIT_TO_BOOT - EVENT] Guest has booted
file = phd-tests/framework/src/test_vm/mod.rs
line = 887
path = phd_tests::migrate::from_base::migration_from_base_and_back
target = phd_framework::test_vm
|
| 277 | 2026-09-08T19:41:41.798Z | INFO | phd-runner: [WAIT_TO_BOOT - END]
elapsed_milliseconds = 4652
file = phd-tests/framework/src/test_vm/mod.rs
line = 890
path = phd_tests::migrate::from_base::migration_from_base_and_back
target = phd_framework::test_vm
|
| 278 | 2026-09-08T19:41:41.798Z | INFO | phd-runner: [WAIT_FOR_SERIAL_OUTPUT - START]
file = phd-tests/framework/src/test_vm/mod.rs
line = 913
path = phd_tests::migrate::from_base::migration_from_base_and_back
target = phd_framework::test_vm
vm = migration_from_base_and_back
vm_id = f5caf15f-329e-4900-8e46-5cab9651c751
|
| 279 | 2026-09-08T19:41:41.798Z | INFO | phd-runner: [WAIT_FOR_SERIAL_OUTPUT - EVENT] Waiting for output on serial console
file = phd-tests/framework/src/test_vm/mod.rs
line = 920
path = phd_tests::migrate::from_base::migration_from_base_and_back
target = phd_framework::test_vm
timeout_duration = Explicit(15s)
vm = migration_from_base_and_back
vm_id = f5caf15f-329e-4900-8e46-5cab9651c751
|
| 280 | 2026-09-08T19:41:41.809Z | INFO | phd-runner: [WAIT_FOR_SERIAL_OUTPUT - END]
elapsed_milliseconds = 11
file = phd-tests/framework/src/test_vm/mod.rs
line = 913
path = phd_tests::migrate::from_base::migration_from_base_and_back
target = phd_framework::test_vm
vm = migration_from_base_and_back
vm_id = f5caf15f-329e-4900-8e46-5cab9651c751
|
| 281 | 2026-09-08T19:41:41.809Z | INFO | phd-runner: [WAIT_FOR_SERIAL_OUTPUT - START]
file = phd-tests/framework/src/test_vm/mod.rs
line = 913
path = phd_tests::migrate::from_base::migration_from_base_and_back
target = phd_framework::test_vm
vm = migration_from_base_and_back
vm_id = f5caf15f-329e-4900-8e46-5cab9651c751
|
| 282 | 2026-09-08T19:41:41.810Z | INFO | phd-runner: [WAIT_FOR_SERIAL_OUTPUT - EVENT] Waiting for output on serial console
file = phd-tests/framework/src/test_vm/mod.rs
line = 920
path = phd_tests::migrate::from_base::migration_from_base_and_back
target = phd_framework::test_vm
timeout_duration = Explicit(300s)
vm = migration_from_base_and_back
vm_id = f5caf15f-329e-4900-8e46-5cab9651c751
|
| 283 | 2026-09-08T19:41:41.843Z | INFO | phd-runner: [WAIT_FOR_SERIAL_OUTPUT - END]
elapsed_milliseconds = 33
file = phd-tests/framework/src/test_vm/mod.rs
line = 913
path = phd_tests::migrate::from_base::migration_from_base_and_back
target = phd_framework::test_vm
vm = migration_from_base_and_back
vm_id = f5caf15f-329e-4900-8e46-5cab9651c751
|
| 284 | 2026-09-08T19:41:41.844Z | INFO | phd-runner: [WAIT_FOR_SERIAL_OUTPUT - START]
file = phd-tests/framework/src/test_vm/mod.rs
line = 913
path = phd_tests::migrate::from_base::migration_from_base_and_back
target = phd_framework::test_vm
vm = migration_from_base_and_back
vm_id = f5caf15f-329e-4900-8e46-5cab9651c751
|
| 285 | 2026-09-08T19:41:41.844Z | INFO | phd-runner: [WAIT_FOR_SERIAL_OUTPUT - EVENT] Waiting for output on serial console
file = phd-tests/framework/src/test_vm/mod.rs
line = 920
path = phd_tests::migrate::from_base::migration_from_base_and_back
target = phd_framework::test_vm
timeout_duration = Explicit(15s)
vm = migration_from_base_and_back
vm_id = f5caf15f-329e-4900-8e46-5cab9651c751
|
| 286 | 2026-09-08T19:41:41.854Z | INFO | phd-runner: [WAIT_FOR_SERIAL_OUTPUT - END]
elapsed_milliseconds = 10
file = phd-tests/framework/src/test_vm/mod.rs
line = 913
path = phd_tests::migrate::from_base::migration_from_base_and_back
target = phd_framework::test_vm
vm = migration_from_base_and_back
vm_id = f5caf15f-329e-4900-8e46-5cab9651c751
|
| 287 | 2026-09-08T19:41:41.855Z | INFO | phd-runner: [WAIT_FOR_SERIAL_OUTPUT - START]
file = phd-tests/framework/src/test_vm/mod.rs
line = 913
path = phd_tests::migrate::from_base::migration_from_base_and_back
target = phd_framework::test_vm
vm = migration_from_base_and_back
vm_id = f5caf15f-329e-4900-8e46-5cab9651c751
|
| 288 | 2026-09-08T19:41:41.855Z | INFO | phd-runner: [WAIT_FOR_SERIAL_OUTPUT - EVENT] Waiting for output on serial console
file = phd-tests/framework/src/test_vm/mod.rs
line = 920
path = phd_tests::migrate::from_base::migration_from_base_and_back
target = phd_framework::test_vm
timeout_duration = Explicit(300s)
vm = migration_from_base_and_back
vm_id = f5caf15f-329e-4900-8e46-5cab9651c751
|
| 289 | 2026-09-08T19:41:41.888Z | INFO | phd-runner: [WAIT_FOR_SERIAL_OUTPUT - END]
elapsed_milliseconds = 33
file = phd-tests/framework/src/test_vm/mod.rs
line = 913
path = phd_tests::migrate::from_base::migration_from_base_and_back
target = phd_framework::test_vm
vm = migration_from_base_and_back
vm_id = f5caf15f-329e-4900-8e46-5cab9651c751
|
| 290 | 2026-09-08T19:41:41.888Z | INFO | phd-runner: [WAIT_FOR_SERIAL_OUTPUT - START]
file = phd-tests/framework/src/test_vm/mod.rs
line = 913
path = phd_tests::migrate::from_base::migration_from_base_and_back
target = phd_framework::test_vm
vm = migration_from_base_and_back
vm_id = f5caf15f-329e-4900-8e46-5cab9651c751
|
| 291 | 2026-09-08T19:41:41.888Z | INFO | phd-runner: [WAIT_FOR_SERIAL_OUTPUT - EVENT] Waiting for output on serial console
file = phd-tests/framework/src/test_vm/mod.rs
line = 920
path = phd_tests::migrate::from_base::migration_from_base_and_back
target = phd_framework::test_vm
timeout_duration = Explicit(15s)
vm = migration_from_base_and_back
vm_id = f5caf15f-329e-4900-8e46-5cab9651c751
|
| 292 | 2026-09-08T19:41:41.898Z | INFO | phd-runner: [WAIT_FOR_SERIAL_OUTPUT - END]
elapsed_milliseconds = 10
file = phd-tests/framework/src/test_vm/mod.rs
line = 913
path = phd_tests::migrate::from_base::migration_from_base_and_back
target = phd_framework::test_vm
vm = migration_from_base_and_back
vm_id = f5caf15f-329e-4900-8e46-5cab9651c751
|
| 293 | 2026-09-08T19:41:41.899Z | INFO | phd-runner: [WAIT_FOR_SERIAL_OUTPUT - START]
file = phd-tests/framework/src/test_vm/mod.rs
line = 913
path = phd_tests::migrate::from_base::migration_from_base_and_back
target = phd_framework::test_vm
vm = migration_from_base_and_back
vm_id = f5caf15f-329e-4900-8e46-5cab9651c751
|
| 294 | 2026-09-08T19:41:41.899Z | INFO | phd-runner: [WAIT_FOR_SERIAL_OUTPUT - EVENT] Waiting for output on serial console
file = phd-tests/framework/src/test_vm/mod.rs
line = 920
path = phd_tests::migrate::from_base::migration_from_base_and_back
target = phd_framework::test_vm
timeout_duration = Explicit(300s)
vm = migration_from_base_and_back
vm_id = f5caf15f-329e-4900-8e46-5cab9651c751
|
| 295 | 2026-09-08T19:41:41.932Z | INFO | phd-runner: [WAIT_FOR_SERIAL_OUTPUT - END]
elapsed_milliseconds = 32
file = phd-tests/framework/src/test_vm/mod.rs
line = 913
path = phd_tests::migrate::from_base::migration_from_base_and_back
target = phd_framework::test_vm
vm = migration_from_base_and_back
vm_id = f5caf15f-329e-4900-8e46-5cab9651c751
|
| 296 | 2026-09-08T19:41:41.932Z | INFO | phd-runner: [WAIT_FOR_SERIAL_OUTPUT - START]
file = phd-tests/framework/src/test_vm/mod.rs
line = 913
path = phd_tests::migrate::from_base::migration_from_base_and_back
target = phd_framework::test_vm
vm = migration_from_base_and_back
vm_id = f5caf15f-329e-4900-8e46-5cab9651c751
|
| 297 | 2026-09-08T19:41:41.932Z | INFO | phd-runner: [WAIT_FOR_SERIAL_OUTPUT - EVENT] Waiting for output on serial console
file = phd-tests/framework/src/test_vm/mod.rs
line = 920
path = phd_tests::migrate::from_base::migration_from_base_and_back
target = phd_framework::test_vm
timeout_duration = Explicit(15s)
vm = migration_from_base_and_back
vm_id = f5caf15f-329e-4900-8e46-5cab9651c751
|
| 298 | 2026-09-08T19:41:41.943Z | INFO | phd-runner: [WAIT_FOR_SERIAL_OUTPUT - END]
elapsed_milliseconds = 10
file = phd-tests/framework/src/test_vm/mod.rs
line = 913
path = phd_tests::migrate::from_base::migration_from_base_and_back
target = phd_framework::test_vm
vm = migration_from_base_and_back
vm_id = f5caf15f-329e-4900-8e46-5cab9651c751
|
| 299 | 2026-09-08T19:41:41.943Z | INFO | phd-runner: [WAIT_FOR_SERIAL_OUTPUT - START]
file = phd-tests/framework/src/test_vm/mod.rs
line = 913
path = phd_tests::migrate::from_base::migration_from_base_and_back
target = phd_framework::test_vm
vm = migration_from_base_and_back
vm_id = f5caf15f-329e-4900-8e46-5cab9651c751
|
| 300 | 2026-09-08T19:41:41.943Z | INFO | phd-runner: [WAIT_FOR_SERIAL_OUTPUT - EVENT] Waiting for output on serial console
file = phd-tests/framework/src/test_vm/mod.rs
line = 920
path = phd_tests::migrate::from_base::migration_from_base_and_back
target = phd_framework::test_vm
timeout_duration = Explicit(300s)
vm = migration_from_base_and_back
vm_id = f5caf15f-329e-4900-8e46-5cab9651c751
|
| 301 | 2026-09-08T19:41:41.976Z | INFO | phd-runner: [WAIT_FOR_SERIAL_OUTPUT - END]
elapsed_milliseconds = 32
file = phd-tests/framework/src/test_vm/mod.rs
line = 913
path = phd_tests::migrate::from_base::migration_from_base_and_back
target = phd_framework::test_vm
vm = migration_from_base_and_back
vm_id = f5caf15f-329e-4900-8e46-5cab9651c751
|
| 302 | 2026-09-08T19:41:41.976Z | INFO | phd-runner: [WAIT_FOR_SERIAL_OUTPUT - START]
file = phd-tests/framework/src/test_vm/mod.rs
line = 913
path = phd_tests::migrate::from_base::migration_from_base_and_back
target = phd_framework::test_vm
vm = migration_from_base_and_back
vm_id = f5caf15f-329e-4900-8e46-5cab9651c751
|
| 303 | 2026-09-08T19:41:41.976Z | INFO | phd-runner: [WAIT_FOR_SERIAL_OUTPUT - EVENT] Waiting for output on serial console
file = phd-tests/framework/src/test_vm/mod.rs
line = 920
path = phd_tests::migrate::from_base::migration_from_base_and_back
target = phd_framework::test_vm
timeout_duration = Explicit(15s)
vm = migration_from_base_and_back
vm_id = f5caf15f-329e-4900-8e46-5cab9651c751
|
| 304 | 2026-09-08T19:41:41.987Z | INFO | phd-runner: [WAIT_FOR_SERIAL_OUTPUT - END]
elapsed_milliseconds = 10
file = phd-tests/framework/src/test_vm/mod.rs
line = 913
path = phd_tests::migrate::from_base::migration_from_base_and_back
target = phd_framework::test_vm
vm = migration_from_base_and_back
vm_id = f5caf15f-329e-4900-8e46-5cab9651c751
|
| 305 | 2026-09-08T19:41:41.987Z | INFO | phd-runner: [WAIT_FOR_SERIAL_OUTPUT - START]
file = phd-tests/framework/src/test_vm/mod.rs
line = 913
path = phd_tests::migrate::from_base::migration_from_base_and_back
target = phd_framework::test_vm
vm = migration_from_base_and_back
vm_id = f5caf15f-329e-4900-8e46-5cab9651c751
|
| 306 | 2026-09-08T19:41:41.987Z | INFO | phd-runner: [WAIT_FOR_SERIAL_OUTPUT - EVENT] Waiting for output on serial console
file = phd-tests/framework/src/test_vm/mod.rs
line = 920
path = phd_tests::migrate::from_base::migration_from_base_and_back
target = phd_framework::test_vm
timeout_duration = Explicit(300s)
vm = migration_from_base_and_back
vm_id = f5caf15f-329e-4900-8e46-5cab9651c751
|
| 307 | 2026-09-08T19:41:42.020Z | INFO | phd-runner: [WAIT_FOR_SERIAL_OUTPUT - END]
elapsed_milliseconds = 32
file = phd-tests/framework/src/test_vm/mod.rs
line = 913
path = phd_tests::migrate::from_base::migration_from_base_and_back
target = phd_framework::test_vm
vm = migration_from_base_and_back
vm_id = f5caf15f-329e-4900-8e46-5cab9651c751
|
| 308 | 2026-09-08T19:41:42.021Z | INFO | phd-runner: [WAIT_FOR_SERIAL_OUTPUT - START]
file = phd-tests/framework/src/test_vm/mod.rs
line = 913
path = phd_tests::migrate::from_base::migration_from_base_and_back
target = phd_framework::test_vm
vm = migration_from_base_and_back
vm_id = f5caf15f-329e-4900-8e46-5cab9651c751
|
| 309 | 2026-09-08T19:41:42.021Z | INFO | phd-runner: [WAIT_FOR_SERIAL_OUTPUT - EVENT] Waiting for output on serial console
file = phd-tests/framework/src/test_vm/mod.rs
line = 920
path = phd_tests::migrate::from_base::migration_from_base_and_back
target = phd_framework::test_vm
timeout_duration = Explicit(15s)
vm = migration_from_base_and_back
vm_id = f5caf15f-329e-4900-8e46-5cab9651c751
|
| 310 | 2026-09-08T19:41:42.032Z | INFO | phd-runner: [WAIT_FOR_SERIAL_OUTPUT - END]
elapsed_milliseconds = 10
file = phd-tests/framework/src/test_vm/mod.rs
line = 913
path = phd_tests::migrate::from_base::migration_from_base_and_back
target = phd_framework::test_vm
vm = migration_from_base_and_back
vm_id = f5caf15f-329e-4900-8e46-5cab9651c751
|
| 311 | 2026-09-08T19:41:42.032Z | INFO | phd-runner: [WAIT_FOR_SERIAL_OUTPUT - START]
file = phd-tests/framework/src/test_vm/mod.rs
line = 913
path = phd_tests::migrate::from_base::migration_from_base_and_back
target = phd_framework::test_vm
vm = migration_from_base_and_back
vm_id = f5caf15f-329e-4900-8e46-5cab9651c751
|
| 312 | 2026-09-08T19:41:42.032Z | INFO | phd-runner: [WAIT_FOR_SERIAL_OUTPUT - EVENT] Waiting for output on serial console
file = phd-tests/framework/src/test_vm/mod.rs
line = 920
path = phd_tests::migrate::from_base::migration_from_base_and_back
target = phd_framework::test_vm
timeout_duration = Explicit(300s)
vm = migration_from_base_and_back
vm_id = f5caf15f-329e-4900-8e46-5cab9651c751
|
| 313 | 2026-09-08T19:41:42.065Z | INFO | phd-runner: [WAIT_FOR_SERIAL_OUTPUT - END]
elapsed_milliseconds = 33
file = phd-tests/framework/src/test_vm/mod.rs
line = 913
path = phd_tests::migrate::from_base::migration_from_base_and_back
target = phd_framework::test_vm
vm = migration_from_base_and_back
vm_id = f5caf15f-329e-4900-8e46-5cab9651c751
|
| 314 | 2026-09-08T19:41:42.066Z | INFO | phd-runner: [TEST - EVENT] migrating to new Propolis artifact for lifecycle test
file = phd-tests/framework/src/lifecycle.rs
line = 73
path = phd_tests::migrate::from_base::migration_from_base_and_back
propolis_artifact = __DEFAULT_PROPOLIS
target = phd_framework::lifecycle
vm_name = migration_from_base_and_back
|
| 315 | 2026-09-08T19:41:42.066Z | INFO | phd-runner: [NEW - START]
file = phd-tests/framework/src/test_vm/mod.rs
line = 300
path = phd_tests::migrate::from_base::migration_from_base_and_back
target = phd_framework::test_vm
|
| 316 | 2026-09-08T19:41:42.066Z | INFO | phd-runner: [NEW - EVENT] phd_framework::test_vm
environment = EnvironmentSpec { location: Local, propolis_artifact: "__DEFAULT_PROPOLIS", metrics: None }
file = phd-tests/framework/src/test_vm/mod.rs
guest_os_kind = Alpine
line = 318
path = phd_tests::migrate::from_base::migration_from_base_and_back
target = phd_framework::test_vm
vm_name = migration_from_base_and_back_lifecycle_0
|
| 317 | 2026-09-08T19:41:42.066Z | DEBG | phd-runner: [NEW - EVENT] Verified artifact already exists
file = phd-tests/framework/src/artifacts/store.rs
line = 45
path = /work/phd-test/propolis-server
target = phd_framework::artifacts::store
|
| 318 | 2026-09-08T19:41:42.066Z | INFO | phd-runner: [NEW - EVENT] Launching Propolis server
bootrom_path = "/phd-artifacts/740187046a7267d0de72d3455070333547dbc0ea023531471fb2b2a61effa448/OVMF_CODE.fd"
file = phd-tests/framework/src/test_vm/server.rs
line = 66
path = phd_tests::migrate::from_base::migration_from_base_and_back
server_addr = 127.0.0.1:9002
server_path = "/work/phd-test/propolis-server"
target = phd_framework::test_vm::server
|
| 319 | 2026-09-08T19:41:42.066Z | INFO | phd-runner: [NEW - EVENT] Opening server log files
file = phd-tests/framework/src/log_config.rs
line = 84
path = phd_tests::migrate::from_base::migration_from_base_and_back
stderr_path = "/tmp/propolis-phd/phd_tests::migrate::from_base::migration_from_base_and_back/migration_from_base_and_back_lifecycle_0.stderr.log"
stdout_path = "/tmp/propolis-phd/phd_tests::migrate::from_base::migration_from_base_and_back/migration_from_base_and_back_lifecycle_0.stdout.log"
target = phd_framework::log_config
|
| 320 | 2026-09-08T19:41:42.109Z | INFO | phd-runner: [NEW - EVENT] Launched server with pid 938
file = phd-tests/framework/src/test_vm/server.rs
line = 127
path = phd_tests::migrate::from_base::migration_from_base_and_back
target = phd_framework::test_vm::server
|
| 321 | 2026-09-08T19:41:42.122Z | INFO | phd-runner: [NEW - END]
elapsed_milliseconds = 56
file = phd-tests/framework/src/test_vm/mod.rs
line = 300
path = phd_tests::migrate::from_base::migration_from_base_and_back
target = phd_framework::test_vm
|
| 322 | 2026-09-08T19:41:42.122Z | INFO | phd-runner: [MIGRATE_FROM - START]
file = phd-tests/framework/src/test_vm/mod.rs
line = 609
path = phd_tests::migrate::from_base::migration_from_base_and_back
source = migration_from_base_and_back
source_id = f5caf15f-329e-4900-8e46-5cab9651c751
target = phd_framework::test_vm
target_id = 22d6b4fe-f885-4ec0-bdb2-d377123a82d5
|
| 323 | 2026-09-08T19:41:42.122Z | INFO | phd-runner: [MIGRATE_FROM - EVENT] Migrating from source at address 127.0.0.1:9000
file = phd-tests/framework/src/test_vm/mod.rs
line = 642
migration_id = ad6720ab-a6c7-4e8c-8e5d-4e7df1d12c72
path = phd_tests::migrate::from_base::migration_from_base_and_back
source = migration_from_base_and_back
source_id = f5caf15f-329e-4900-8e46-5cab9651c751
target = phd_framework::test_vm
target_id = 22d6b4fe-f885-4ec0-bdb2-d377123a82d5
timeout_duration = 45s
|
| 324 | 2026-09-08T19:41:42.122Z | INFO | phd-runner: [INSTANCE_ENSURE_INTERNAL - START]
file = phd-tests/framework/src/test_vm/mod.rs
line = 412
path = phd_tests::migrate::from_base::migration_from_base_and_back
source = migration_from_base_and_back
source_id = f5caf15f-329e-4900-8e46-5cab9651c751
target = phd_framework::test_vm
target_id = 22d6b4fe-f885-4ec0-bdb2-d377123a82d5
vm = migration_from_base_and_back_lifecycle_0
vm_id = 22d6b4fe-f885-4ec0-bdb2-d377123a82d5
|
| 325 | 2026-09-08T19:41:42.123Z | INFO | phd-runner: [INSTANCE_ENSURE_INTERNAL - EVENT] retriable error from instance_spec_ensure
e = Communication Error: error sending request for url (http://127.0.0.1:9002/instance)
file = phd-tests/framework/src/test_vm/mod.rs
line = 455
path = phd_tests::migrate::from_base::migration_from_base_and_back
source = migration_from_base_and_back
source_id = f5caf15f-329e-4900-8e46-5cab9651c751
target = phd_framework::test_vm
target_id = 22d6b4fe-f885-4ec0-bdb2-d377123a82d5
vm = migration_from_base_and_back_lifecycle_0
vm_id = 22d6b4fe-f885-4ec0-bdb2-d377123a82d5
|
| 326 | 2026-09-08T19:41:42.927Z | INFO | phd-runner: [INSTANCE_ENSURE_INTERNAL - EVENT] Started instance
file = phd-tests/framework/src/test_vm/mod.rs
instance_description.instance = Instance { properties: InstanceProperties { id: 22d6b4fe-f885-4ec0-bdb2-d377123a82d5, name: "phd-vm-22d6b4fe-f885-4ec0-bdb2-d377123a82d5", description: "Pheidippides-managed VM", metadata: InstanceMetadata { silo_id: 5c1483ba-c2a2-4954-8fc9-5ffa23da16f8, project_id: 2dfffbbd-f8d8-42e5-8760-6e2d5cd4e7b3, sled_id: 65df5e3f-2119-4c53-9fa1-5c24cbc575e8, sled_serial: "65df5e3f-2119-4c53-9fa1-5c24cbc575e8", sled_revision: 1, sled_model: "pheidippes" } }, state: Migrating }
line = 514
path = phd_tests::migrate::from_base::migration_from_base_and_back
source = migration_from_base_and_back
source_id = f5caf15f-329e-4900-8e46-5cab9651c751
target = phd_framework::test_vm
target_id = 22d6b4fe-f885-4ec0-bdb2-d377123a82d5
vm = migration_from_base_and_back_lifecycle_0
vm_id = 22d6b4fe-f885-4ec0-bdb2-d377123a82d5
|
| 327 | 2026-09-08T19:41:42.927Z | INFO | phd-runner: [MIGRATE - START]
file = phd-tests/framework/src/test_vm/mod.rs
line = 663
migration_id = ad6720ab-a6c7-4e8c-8e5d-4e7df1d12c72
path = phd_tests::migrate::from_base::migration_from_base_and_back
source = migration_from_base_and_back
source_id = f5caf15f-329e-4900-8e46-5cab9651c751
target = phd_framework::test_vm
target_id = 22d6b4fe-f885-4ec0-bdb2-d377123a82d5
|
| 328 | 2026-09-08T19:41:45.467Z | INFO | phd-runner: [SERIAL CONSOLE TASK - EVENT] serial socket control message
file = phd-tests/framework/src/serial/mod.rs
line = 275
s = {"Migrating":{"destination":"127.0.0.1:9002","from_start":7847}}
target = phd_framework::serial
|
| 329 | 2026-09-08T19:41:45.602Z | INFO | phd-runner: [MIGRATE_FROM - EVENT] Migration completed successfully
file = phd-tests/framework/src/test_vm/mod.rs
line = 676
path = phd_tests::migrate::from_base::migration_from_base_and_back
source = migration_from_base_and_back
source_id = f5caf15f-329e-4900-8e46-5cab9651c751
target = phd_framework::test_vm
target_id = 22d6b4fe-f885-4ec0-bdb2-d377123a82d5
|
| 330 | 2026-09-08T19:41:45.603Z | INFO | phd-runner: [MIGRATE - END]
elapsed_milliseconds = 2675
file = phd-tests/framework/src/test_vm/mod.rs
line = 663
migration_id = ad6720ab-a6c7-4e8c-8e5d-4e7df1d12c72
path = phd_tests::migrate::from_base::migration_from_base_and_back
source = migration_from_base_and_back
source_id = f5caf15f-329e-4900-8e46-5cab9651c751
target = phd_framework::test_vm
target_id = 22d6b4fe-f885-4ec0-bdb2-d377123a82d5
|
| 331 | 2026-09-08T19:41:45.604Z | INFO | phd-runner: [VM CLEANUP - START]
file = phd-tests/framework/src/test_vm/mod.rs
line = 1172
path = phd_tests::migrate::from_base::migration_from_base_and_back
target = phd_framework::test_vm
vm = migration_from_base_and_back
vm_id = f5caf15f-329e-4900-8e46-5cab9651c751
|
| 332 | 2026-09-08T19:41:45.605Z | INFO | phd-runner: [WAIT_FOR_SERIAL_OUTPUT - START]
file = phd-tests/framework/src/test_vm/mod.rs
line = 913
path = phd_tests::migrate::from_base::migration_from_base_and_back
target = phd_framework::test_vm
vm = migration_from_base_and_back_lifecycle_0
vm_id = 22d6b4fe-f885-4ec0-bdb2-d377123a82d5
|
| 333 | 2026-09-08T19:41:45.605Z | INFO | phd-runner: [WAIT_FOR_SERIAL_OUTPUT - EVENT] Waiting for output on serial console
file = phd-tests/framework/src/test_vm/mod.rs
line = 920
path = phd_tests::migrate::from_base::migration_from_base_and_back
target = phd_framework::test_vm
timeout_duration = Explicit(15s)
vm = migration_from_base_and_back_lifecycle_0
vm_id = 22d6b4fe-f885-4ec0-bdb2-d377123a82d5
|
| 334 | 2026-09-08T19:41:45.606Z | DEBG | phd-runner: [VM CLEANUP - EVENT] Killing Propolis server process
file = phd-tests/framework/src/test_vm/server.rs
line = 177
path = phd_tests::migrate::from_base::migration_from_base_and_back
self.address = 127.0.0.1:9000
target = phd_framework::test_vm::server
vm = migration_from_base_and_back
vm_id = f5caf15f-329e-4900-8e46-5cab9651c751
|
| 335 | 2026-09-08T19:41:45.685Z | INFO | phd-runner: [VM CLEANUP - END]
elapsed_milliseconds = 80
file = phd-tests/framework/src/test_vm/mod.rs
line = 1172
path = phd_tests::migrate::from_base::migration_from_base_and_back
target = phd_framework::test_vm
vm = migration_from_base_and_back
vm_id = f5caf15f-329e-4900-8e46-5cab9651c751
|
| 336 | 2026-09-08T19:41:45.685Z | INFO | phd-runner: [INSTANCE_ENSURE_INTERNAL - END]
elapsed_milliseconds = 9105
file = phd-tests/framework/src/test_vm/mod.rs
line = 412
path = phd_tests::migrate::from_base::migration_from_base_and_back
target = phd_framework::test_vm
vm = migration_from_base_and_back
vm_id = f5caf15f-329e-4900-8e46-5cab9651c751
|
| 337 | 2026-09-08T19:41:45.686Z | INFO | phd-runner: [WAIT_FOR_SERIAL_OUTPUT - END]
elapsed_milliseconds = 80
file = phd-tests/framework/src/test_vm/mod.rs
line = 913
path = phd_tests::migrate::from_base::migration_from_base_and_back
target = phd_framework::test_vm
vm = migration_from_base_and_back_lifecycle_0
vm_id = 22d6b4fe-f885-4ec0-bdb2-d377123a82d5
|
| 338 | 2026-09-08T19:41:45.686Z | INFO | phd-runner: [WAIT_FOR_SERIAL_OUTPUT - START]
file = phd-tests/framework/src/test_vm/mod.rs
line = 913
path = phd_tests::migrate::from_base::migration_from_base_and_back
target = phd_framework::test_vm
vm = migration_from_base_and_back_lifecycle_0
vm_id = 22d6b4fe-f885-4ec0-bdb2-d377123a82d5
|
| 339 | 2026-09-08T19:41:45.686Z | INFO | phd-runner: [WAIT_FOR_SERIAL_OUTPUT - EVENT] Waiting for output on serial console
file = phd-tests/framework/src/test_vm/mod.rs
line = 920
path = phd_tests::migrate::from_base::migration_from_base_and_back
target = phd_framework::test_vm
timeout_duration = Explicit(300s)
vm = migration_from_base_and_back_lifecycle_0
vm_id = 22d6b4fe-f885-4ec0-bdb2-d377123a82d5
|
| 340 | 2026-09-08T19:41:45.716Z | INFO | phd-runner: [WAIT_FOR_SERIAL_OUTPUT - END]
elapsed_milliseconds = 30
file = phd-tests/framework/src/test_vm/mod.rs
line = 913
path = phd_tests::migrate::from_base::migration_from_base_and_back
target = phd_framework::test_vm
vm = migration_from_base_and_back_lifecycle_0
vm_id = 22d6b4fe-f885-4ec0-bdb2-d377123a82d5
|
| 341 | 2026-09-08T19:41:45.716Z | INFO | phd-runner: [TEST - EVENT] migrating to new Propolis artifact for lifecycle test
file = phd-tests/framework/src/lifecycle.rs
line = 73
path = phd_tests::migrate::from_base::migration_from_base_and_back
propolis_artifact = __BASE_PROPOLIS
target = phd_framework::lifecycle
vm_name = migration_from_base_and_back
|
| 342 | 2026-09-08T19:41:45.716Z | INFO | phd-runner: [NEW - START]
file = phd-tests/framework/src/test_vm/mod.rs
line = 300
path = phd_tests::migrate::from_base::migration_from_base_and_back
target = phd_framework::test_vm
|
| 343 | 2026-09-08T19:41:45.716Z | INFO | phd-runner: [NEW - EVENT] phd_framework::test_vm
environment = EnvironmentSpec { location: Local, propolis_artifact: "__BASE_PROPOLIS", metrics: None }
file = phd-tests/framework/src/test_vm/mod.rs
guest_os_kind = Alpine
line = 318
path = phd_tests::migrate::from_base::migration_from_base_and_back
target = phd_framework::test_vm
vm_name = migration_from_base_and_back_lifecycle_1
|
| 344 | 2026-09-08T19:41:45.717Z | DEBG | phd-runner: [NEW - EVENT] Verified artifact already exists
file = phd-tests/framework/src/artifacts/store.rs
line = 45
path = /phd-artifacts/279b1c4728a24b4f7a44b54ce9f8f9718dc7bbf7c63d48a3324f98ccba625d72/propolis-server
target = phd_framework::artifacts::store
|
| 345 | 2026-09-08T19:41:45.717Z | INFO | phd-runner: [NEW - EVENT] Launching Propolis server
bootrom_path = "/phd-artifacts/740187046a7267d0de72d3455070333547dbc0ea023531471fb2b2a61effa448/OVMF_CODE.fd"
file = phd-tests/framework/src/test_vm/server.rs
line = 66
path = phd_tests::migrate::from_base::migration_from_base_and_back
server_addr = 127.0.0.1:9004
server_path = "/phd-artifacts/279b1c4728a24b4f7a44b54ce9f8f9718dc7bbf7c63d48a3324f98ccba625d72/propolis-server"
target = phd_framework::test_vm::server
|
| 346 | 2026-09-08T19:41:45.717Z | INFO | phd-runner: [NEW - EVENT] Opening server log files
file = phd-tests/framework/src/log_config.rs
line = 84
path = phd_tests::migrate::from_base::migration_from_base_and_back
stderr_path = "/tmp/propolis-phd/phd_tests::migrate::from_base::migration_from_base_and_back/migration_from_base_and_back_lifecycle_1.stderr.log"
stdout_path = "/tmp/propolis-phd/phd_tests::migrate::from_base::migration_from_base_and_back/migration_from_base_and_back_lifecycle_1.stdout.log"
target = phd_framework::log_config
|
| 347 | 2026-09-08T19:41:45.762Z | INFO | phd-runner: [NEW - EVENT] Launched server with pid 940
file = phd-tests/framework/src/test_vm/server.rs
line = 127
path = phd_tests::migrate::from_base::migration_from_base_and_back
target = phd_framework::test_vm::server
|
| 348 | 2026-09-08T19:41:45.775Z | INFO | phd-runner: [NEW - END]
elapsed_milliseconds = 58
file = phd-tests/framework/src/test_vm/mod.rs
line = 300
path = phd_tests::migrate::from_base::migration_from_base_and_back
target = phd_framework::test_vm
|
| 349 | 2026-09-08T19:41:45.775Z | INFO | phd-runner: [MIGRATE_FROM - START]
file = phd-tests/framework/src/test_vm/mod.rs
line = 609
path = phd_tests::migrate::from_base::migration_from_base_and_back
source = migration_from_base_and_back_lifecycle_0
source_id = 22d6b4fe-f885-4ec0-bdb2-d377123a82d5
target = phd_framework::test_vm
target_id = 76973457-8919-4061-943d-782e2a4f8c37
|
| 350 | 2026-09-08T19:41:45.775Z | INFO | phd-runner: [MIGRATE_FROM - EVENT] Migrating from source at address 127.0.0.1:9002
file = phd-tests/framework/src/test_vm/mod.rs
line = 642
migration_id = b61295ee-a04b-4bcf-9233-ec3bd3f30aa6
path = phd_tests::migrate::from_base::migration_from_base_and_back
source = migration_from_base_and_back_lifecycle_0
source_id = 22d6b4fe-f885-4ec0-bdb2-d377123a82d5
target = phd_framework::test_vm
target_id = 76973457-8919-4061-943d-782e2a4f8c37
timeout_duration = 45s
|
| 351 | 2026-09-08T19:41:45.776Z | INFO | phd-runner: [INSTANCE_ENSURE_INTERNAL - START]
file = phd-tests/framework/src/test_vm/mod.rs
line = 412
path = phd_tests::migrate::from_base::migration_from_base_and_back
source = migration_from_base_and_back_lifecycle_0
source_id = 22d6b4fe-f885-4ec0-bdb2-d377123a82d5
target = phd_framework::test_vm
target_id = 76973457-8919-4061-943d-782e2a4f8c37
vm = migration_from_base_and_back_lifecycle_1
vm_id = 76973457-8919-4061-943d-782e2a4f8c37
|
| 352 | 2026-09-08T19:41:45.776Z | INFO | phd-runner: [INSTANCE_ENSURE_INTERNAL - EVENT] retriable error from instance_spec_ensure
e = Communication Error: error sending request for url (http://127.0.0.1:9004/instance)
file = phd-tests/framework/src/test_vm/mod.rs
line = 455
path = phd_tests::migrate::from_base::migration_from_base_and_back
source = migration_from_base_and_back_lifecycle_0
source_id = 22d6b4fe-f885-4ec0-bdb2-d377123a82d5
target = phd_framework::test_vm
target_id = 76973457-8919-4061-943d-782e2a4f8c37
vm = migration_from_base_and_back_lifecycle_1
vm_id = 76973457-8919-4061-943d-782e2a4f8c37
|
| 353 | 2026-09-08T19:41:46.556Z | INFO | phd-runner: [INSTANCE_ENSURE_INTERNAL - EVENT] Started instance
file = phd-tests/framework/src/test_vm/mod.rs
instance_description.instance = Instance { properties: InstanceProperties { id: 76973457-8919-4061-943d-782e2a4f8c37, name: "phd-vm-76973457-8919-4061-943d-782e2a4f8c37", description: "Pheidippides-managed VM", metadata: InstanceMetadata { silo_id: 5c1483ba-c2a2-4954-8fc9-5ffa23da16f8, project_id: 2dfffbbd-f8d8-42e5-8760-6e2d5cd4e7b3, sled_id: 7623d52e-9263-4bea-87fc-d3018ccee76d, sled_serial: "7623d52e-9263-4bea-87fc-d3018ccee76d", sled_revision: 1, sled_model: "pheidippes" } }, state: Migrating }
line = 514
path = phd_tests::migrate::from_base::migration_from_base_and_back
source = migration_from_base_and_back_lifecycle_0
source_id = 22d6b4fe-f885-4ec0-bdb2-d377123a82d5
target = phd_framework::test_vm
target_id = 76973457-8919-4061-943d-782e2a4f8c37
vm = migration_from_base_and_back_lifecycle_1
vm_id = 76973457-8919-4061-943d-782e2a4f8c37
|
| 354 | 2026-09-08T19:41:46.556Z | INFO | phd-runner: [MIGRATE - START]
file = phd-tests/framework/src/test_vm/mod.rs
line = 663
migration_id = b61295ee-a04b-4bcf-9233-ec3bd3f30aa6
path = phd_tests::migrate::from_base::migration_from_base_and_back
source = migration_from_base_and_back_lifecycle_0
source_id = 22d6b4fe-f885-4ec0-bdb2-d377123a82d5
target = phd_framework::test_vm
target_id = 76973457-8919-4061-943d-782e2a4f8c37
|
| 355 | 2026-09-08T19:41:49.095Z | INFO | phd-runner: [SERIAL CONSOLE TASK - EVENT] serial socket control message
file = phd-tests/framework/src/serial/mod.rs
line = 275
s = {"Migrating":{"destination":"127.0.0.1:9004","from_start":7894}}
target = phd_framework::serial
|
| 356 | 2026-09-08T19:41:49.123Z | INFO | phd-runner: [MIGRATE_FROM - EVENT] Migration completed successfully
file = phd-tests/framework/src/test_vm/mod.rs
line = 676
path = phd_tests::migrate::from_base::migration_from_base_and_back
source = migration_from_base_and_back_lifecycle_0
source_id = 22d6b4fe-f885-4ec0-bdb2-d377123a82d5
target = phd_framework::test_vm
target_id = 76973457-8919-4061-943d-782e2a4f8c37
|
| 357 | 2026-09-08T19:41:49.123Z | INFO | phd-runner: [MIGRATE - END]
elapsed_milliseconds = 2567
file = phd-tests/framework/src/test_vm/mod.rs
line = 663
migration_id = b61295ee-a04b-4bcf-9233-ec3bd3f30aa6
path = phd_tests::migrate::from_base::migration_from_base_and_back
source = migration_from_base_and_back_lifecycle_0
source_id = 22d6b4fe-f885-4ec0-bdb2-d377123a82d5
target = phd_framework::test_vm
target_id = 76973457-8919-4061-943d-782e2a4f8c37
|
| 358 | 2026-09-08T19:41:49.125Z | INFO | phd-runner: [VM CLEANUP - START]
file = phd-tests/framework/src/test_vm/mod.rs
line = 1172
path = phd_tests::migrate::from_base::migration_from_base_and_back
target = phd_framework::test_vm
vm = migration_from_base_and_back_lifecycle_0
vm_id = 22d6b4fe-f885-4ec0-bdb2-d377123a82d5
|
| 359 | 2026-09-08T19:41:49.126Z | INFO | phd-runner: [WAIT_FOR_SERIAL_OUTPUT - START]
file = phd-tests/framework/src/test_vm/mod.rs
line = 913
path = phd_tests::migrate::from_base::migration_from_base_and_back
target = phd_framework::test_vm
vm = migration_from_base_and_back_lifecycle_1
vm_id = 76973457-8919-4061-943d-782e2a4f8c37
|
| 360 | 2026-09-08T19:41:49.126Z | INFO | phd-runner: [WAIT_FOR_SERIAL_OUTPUT - EVENT] Waiting for output on serial console
file = phd-tests/framework/src/test_vm/mod.rs
line = 920
path = phd_tests::migrate::from_base::migration_from_base_and_back
target = phd_framework::test_vm
timeout_duration = Explicit(15s)
vm = migration_from_base_and_back_lifecycle_1
vm_id = 76973457-8919-4061-943d-782e2a4f8c37
|
| 361 | 2026-09-08T19:41:49.127Z | DEBG | phd-runner: [VM CLEANUP - EVENT] Killing Propolis server process
file = phd-tests/framework/src/test_vm/server.rs
line = 177
path = phd_tests::migrate::from_base::migration_from_base_and_back
self.address = 127.0.0.1:9002
target = phd_framework::test_vm::server
vm = migration_from_base_and_back_lifecycle_0
vm_id = 22d6b4fe-f885-4ec0-bdb2-d377123a82d5
|
| 362 | 2026-09-08T19:41:49.215Z | INFO | phd-runner: [VM CLEANUP - END]
elapsed_milliseconds = 88
file = phd-tests/framework/src/test_vm/mod.rs
line = 1172
path = phd_tests::migrate::from_base::migration_from_base_and_back
target = phd_framework::test_vm
vm = migration_from_base_and_back_lifecycle_0
vm_id = 22d6b4fe-f885-4ec0-bdb2-d377123a82d5
|
| 363 | 2026-09-08T19:41:49.215Z | INFO | phd-runner: [INSTANCE_ENSURE_INTERNAL - END]
elapsed_milliseconds = 7092
file = phd-tests/framework/src/test_vm/mod.rs
line = 412
path = phd_tests::migrate::from_base::migration_from_base_and_back
source = migration_from_base_and_back
source_id = f5caf15f-329e-4900-8e46-5cab9651c751
target = phd_framework::test_vm
target_id = 22d6b4fe-f885-4ec0-bdb2-d377123a82d5
vm = migration_from_base_and_back_lifecycle_0
vm_id = 22d6b4fe-f885-4ec0-bdb2-d377123a82d5
|
| 364 | 2026-09-08T19:41:49.215Z | INFO | phd-runner: [MIGRATE_FROM - END]
elapsed_milliseconds = 7092
file = phd-tests/framework/src/test_vm/mod.rs
line = 609
path = phd_tests::migrate::from_base::migration_from_base_and_back
source = migration_from_base_and_back
source_id = f5caf15f-329e-4900-8e46-5cab9651c751
target = phd_framework::test_vm
target_id = 22d6b4fe-f885-4ec0-bdb2-d377123a82d5
|
| 365 | 2026-09-08T19:41:49.215Z | INFO | phd-runner: [WAIT_FOR_SERIAL_OUTPUT - END]
elapsed_milliseconds = 89
file = phd-tests/framework/src/test_vm/mod.rs
line = 913
path = phd_tests::migrate::from_base::migration_from_base_and_back
target = phd_framework::test_vm
vm = migration_from_base_and_back_lifecycle_1
vm_id = 76973457-8919-4061-943d-782e2a4f8c37
|
| 366 | 2026-09-08T19:41:49.216Z | INFO | phd-runner: [WAIT_FOR_SERIAL_OUTPUT - START]
file = phd-tests/framework/src/test_vm/mod.rs
line = 913
path = phd_tests::migrate::from_base::migration_from_base_and_back
target = phd_framework::test_vm
vm = migration_from_base_and_back_lifecycle_1
vm_id = 76973457-8919-4061-943d-782e2a4f8c37
|
| 367 | 2026-09-08T19:41:49.216Z | INFO | phd-runner: [WAIT_FOR_SERIAL_OUTPUT - EVENT] Waiting for output on serial console
file = phd-tests/framework/src/test_vm/mod.rs
line = 920
path = phd_tests::migrate::from_base::migration_from_base_and_back
target = phd_framework::test_vm
timeout_duration = Explicit(300s)
vm = migration_from_base_and_back_lifecycle_1
vm_id = 76973457-8919-4061-943d-782e2a4f8c37
|
| 368 | 2026-09-08T19:41:49.249Z | INFO | phd-runner: [WAIT_FOR_SERIAL_OUTPUT - END]
elapsed_milliseconds = 33
file = phd-tests/framework/src/test_vm/mod.rs
line = 913
path = phd_tests::migrate::from_base::migration_from_base_and_back
target = phd_framework::test_vm
vm = migration_from_base_and_back_lifecycle_1
vm_id = 76973457-8919-4061-943d-782e2a4f8c37
|
| 369 | 2026-09-08T19:41:49.249Z | INFO | phd-runner: [TEST - EVENT] migrating to new Propolis artifact for lifecycle test
file = phd-tests/framework/src/lifecycle.rs
line = 73
path = phd_tests::migrate::from_base::migration_from_base_and_back
propolis_artifact = __DEFAULT_PROPOLIS
target = phd_framework::lifecycle
vm_name = migration_from_base_and_back
|
| 370 | 2026-09-08T19:41:49.249Z | INFO | phd-runner: [NEW - START]
file = phd-tests/framework/src/test_vm/mod.rs
line = 300
path = phd_tests::migrate::from_base::migration_from_base_and_back
target = phd_framework::test_vm
|
| 371 | 2026-09-08T19:41:49.249Z | INFO | phd-runner: [NEW - EVENT] phd_framework::test_vm
environment = EnvironmentSpec { location: Local, propolis_artifact: "__DEFAULT_PROPOLIS", metrics: None }
file = phd-tests/framework/src/test_vm/mod.rs
guest_os_kind = Alpine
line = 318
path = phd_tests::migrate::from_base::migration_from_base_and_back
target = phd_framework::test_vm
vm_name = migration_from_base_and_back_lifecycle_2
|
| 372 | 2026-09-08T19:41:49.249Z | DEBG | phd-runner: [NEW - EVENT] Verified artifact already exists
file = phd-tests/framework/src/artifacts/store.rs
line = 45
path = /work/phd-test/propolis-server
target = phd_framework::artifacts::store
|
| 373 | 2026-09-08T19:41:49.250Z | INFO | phd-runner: [NEW - EVENT] Launching Propolis server
bootrom_path = "/phd-artifacts/740187046a7267d0de72d3455070333547dbc0ea023531471fb2b2a61effa448/OVMF_CODE.fd"
file = phd-tests/framework/src/test_vm/server.rs
line = 66
path = phd_tests::migrate::from_base::migration_from_base_and_back
server_addr = 127.0.0.1:9006
server_path = "/work/phd-test/propolis-server"
target = phd_framework::test_vm::server
|
| 374 | 2026-09-08T19:41:49.250Z | INFO | phd-runner: [NEW - EVENT] Opening server log files
file = phd-tests/framework/src/log_config.rs
line = 84
path = phd_tests::migrate::from_base::migration_from_base_and_back
stderr_path = "/tmp/propolis-phd/phd_tests::migrate::from_base::migration_from_base_and_back/migration_from_base_and_back_lifecycle_2.stderr.log"
stdout_path = "/tmp/propolis-phd/phd_tests::migrate::from_base::migration_from_base_and_back/migration_from_base_and_back_lifecycle_2.stdout.log"
target = phd_framework::log_config
|
| 375 | 2026-09-08T19:41:49.298Z | INFO | phd-runner: [NEW - EVENT] Launched server with pid 942
file = phd-tests/framework/src/test_vm/server.rs
line = 127
path = phd_tests::migrate::from_base::migration_from_base_and_back
target = phd_framework::test_vm::server
|
| 376 | 2026-09-08T19:41:49.312Z | INFO | phd-runner: [NEW - END]
elapsed_milliseconds = 62
file = phd-tests/framework/src/test_vm/mod.rs
line = 300
path = phd_tests::migrate::from_base::migration_from_base_and_back
target = phd_framework::test_vm
|
| 377 | 2026-09-08T19:41:49.312Z | INFO | phd-runner: [MIGRATE_FROM - START]
file = phd-tests/framework/src/test_vm/mod.rs
line = 609
path = phd_tests::migrate::from_base::migration_from_base_and_back
source = migration_from_base_and_back_lifecycle_1
source_id = 76973457-8919-4061-943d-782e2a4f8c37
target = phd_framework::test_vm
target_id = 7852c2da-5e89-4f4d-be47-45a5dae4b892
|
| 378 | 2026-09-08T19:41:49.312Z | INFO | phd-runner: [MIGRATE_FROM - EVENT] Migrating from source at address 127.0.0.1:9004
file = phd-tests/framework/src/test_vm/mod.rs
line = 642
migration_id = 915a7a2f-2466-48aa-8259-fe51d11c1056
path = phd_tests::migrate::from_base::migration_from_base_and_back
source = migration_from_base_and_back_lifecycle_1
source_id = 76973457-8919-4061-943d-782e2a4f8c37
target = phd_framework::test_vm
target_id = 7852c2da-5e89-4f4d-be47-45a5dae4b892
timeout_duration = 45s
|
| 379 | 2026-09-08T19:41:49.312Z | INFO | phd-runner: [INSTANCE_ENSURE_INTERNAL - START]
file = phd-tests/framework/src/test_vm/mod.rs
line = 412
path = phd_tests::migrate::from_base::migration_from_base_and_back
source = migration_from_base_and_back_lifecycle_1
source_id = 76973457-8919-4061-943d-782e2a4f8c37
target = phd_framework::test_vm
target_id = 7852c2da-5e89-4f4d-be47-45a5dae4b892
vm = migration_from_base_and_back_lifecycle_2
vm_id = 7852c2da-5e89-4f4d-be47-45a5dae4b892
|
| 380 | 2026-09-08T19:41:49.313Z | INFO | phd-runner: [INSTANCE_ENSURE_INTERNAL - EVENT] retriable error from instance_spec_ensure
e = Communication Error: error sending request for url (http://127.0.0.1:9006/instance)
file = phd-tests/framework/src/test_vm/mod.rs
line = 455
path = phd_tests::migrate::from_base::migration_from_base_and_back
source = migration_from_base_and_back_lifecycle_1
source_id = 76973457-8919-4061-943d-782e2a4f8c37
target = phd_framework::test_vm
target_id = 7852c2da-5e89-4f4d-be47-45a5dae4b892
vm = migration_from_base_and_back_lifecycle_2
vm_id = 7852c2da-5e89-4f4d-be47-45a5dae4b892
|
| 381 | 2026-09-08T19:41:50.188Z | INFO | phd-runner: [INSTANCE_ENSURE_INTERNAL - EVENT] Started instance
file = phd-tests/framework/src/test_vm/mod.rs
instance_description.instance = Instance { properties: InstanceProperties { id: 7852c2da-5e89-4f4d-be47-45a5dae4b892, name: "phd-vm-7852c2da-5e89-4f4d-be47-45a5dae4b892", description: "Pheidippides-managed VM", metadata: InstanceMetadata { silo_id: 5c1483ba-c2a2-4954-8fc9-5ffa23da16f8, project_id: 2dfffbbd-f8d8-42e5-8760-6e2d5cd4e7b3, sled_id: c3b55ca0-5b3f-42b1-8493-e397c0c508e7, sled_serial: "c3b55ca0-5b3f-42b1-8493-e397c0c508e7", sled_revision: 1, sled_model: "pheidippes" } }, state: Migrating }
line = 514
path = phd_tests::migrate::from_base::migration_from_base_and_back
source = migration_from_base_and_back_lifecycle_1
source_id = 76973457-8919-4061-943d-782e2a4f8c37
target = phd_framework::test_vm
target_id = 7852c2da-5e89-4f4d-be47-45a5dae4b892
vm = migration_from_base_and_back_lifecycle_2
vm_id = 7852c2da-5e89-4f4d-be47-45a5dae4b892
|
| 382 | 2026-09-08T19:41:50.188Z | INFO | phd-runner: [MIGRATE - START]
file = phd-tests/framework/src/test_vm/mod.rs
line = 663
migration_id = 915a7a2f-2466-48aa-8259-fe51d11c1056
path = phd_tests::migrate::from_base::migration_from_base_and_back
source = migration_from_base_and_back_lifecycle_1
source_id = 76973457-8919-4061-943d-782e2a4f8c37
target = phd_framework::test_vm
target_id = 7852c2da-5e89-4f4d-be47-45a5dae4b892
|
| 383 | 2026-09-08T19:41:52.738Z | INFO | phd-runner: [SERIAL CONSOLE TASK - EVENT] serial socket control message
file = phd-tests/framework/src/serial/mod.rs
line = 275
s = {"Migrating":{"destination":"127.0.0.1:9006","from_start":7941}}
target = phd_framework::serial
|
| 384 | 2026-09-08T19:41:54.408Z | INFO | phd-runner: [MIGRATE_FROM - EVENT] Migration completed successfully
file = phd-tests/framework/src/test_vm/mod.rs
line = 676
path = phd_tests::migrate::from_base::migration_from_base_and_back
source = migration_from_base_and_back_lifecycle_1
source_id = 76973457-8919-4061-943d-782e2a4f8c37
target = phd_framework::test_vm
target_id = 7852c2da-5e89-4f4d-be47-45a5dae4b892
|
| 385 | 2026-09-08T19:41:54.408Z | INFO | phd-runner: [MIGRATE - END]
elapsed_milliseconds = 4219
file = phd-tests/framework/src/test_vm/mod.rs
line = 663
migration_id = 915a7a2f-2466-48aa-8259-fe51d11c1056
path = phd_tests::migrate::from_base::migration_from_base_and_back
source = migration_from_base_and_back_lifecycle_1
source_id = 76973457-8919-4061-943d-782e2a4f8c37
target = phd_framework::test_vm
target_id = 7852c2da-5e89-4f4d-be47-45a5dae4b892
|
| 386 | 2026-09-08T19:41:54.410Z | INFO | phd-runner: [VM CLEANUP - START]
file = phd-tests/framework/src/test_vm/mod.rs
line = 1172
path = phd_tests::migrate::from_base::migration_from_base_and_back
target = phd_framework::test_vm
vm = migration_from_base_and_back_lifecycle_1
vm_id = 76973457-8919-4061-943d-782e2a4f8c37
|
| 387 | 2026-09-08T19:41:54.410Z | INFO | phd-runner: [WAIT_FOR_SERIAL_OUTPUT - START]
file = phd-tests/framework/src/test_vm/mod.rs
line = 913
path = phd_tests::migrate::from_base::migration_from_base_and_back
target = phd_framework::test_vm
vm = migration_from_base_and_back_lifecycle_2
vm_id = 7852c2da-5e89-4f4d-be47-45a5dae4b892
|
| 388 | 2026-09-08T19:41:54.411Z | INFO | phd-runner: [WAIT_FOR_SERIAL_OUTPUT - EVENT] Waiting for output on serial console
file = phd-tests/framework/src/test_vm/mod.rs
line = 920
path = phd_tests::migrate::from_base::migration_from_base_and_back
target = phd_framework::test_vm
timeout_duration = Explicit(15s)
vm = migration_from_base_and_back_lifecycle_2
vm_id = 7852c2da-5e89-4f4d-be47-45a5dae4b892
|
| 389 | 2026-09-08T19:41:54.412Z | DEBG | phd-runner: [VM CLEANUP - EVENT] Killing Propolis server process
file = phd-tests/framework/src/test_vm/server.rs
line = 177
path = phd_tests::migrate::from_base::migration_from_base_and_back
self.address = 127.0.0.1:9004
target = phd_framework::test_vm::server
vm = migration_from_base_and_back_lifecycle_1
vm_id = 76973457-8919-4061-943d-782e2a4f8c37
|
| 390 | 2026-09-08T19:41:54.491Z | INFO | phd-runner: [VM CLEANUP - END]
elapsed_milliseconds = 80
file = phd-tests/framework/src/test_vm/mod.rs
line = 1172
path = phd_tests::migrate::from_base::migration_from_base_and_back
target = phd_framework::test_vm
vm = migration_from_base_and_back_lifecycle_1
vm_id = 76973457-8919-4061-943d-782e2a4f8c37
|
| 391 | 2026-09-08T19:41:54.491Z | INFO | phd-runner: [INSTANCE_ENSURE_INTERNAL - END]
elapsed_milliseconds = 8714
file = phd-tests/framework/src/test_vm/mod.rs
line = 412
path = phd_tests::migrate::from_base::migration_from_base_and_back
source = migration_from_base_and_back_lifecycle_0
source_id = 22d6b4fe-f885-4ec0-bdb2-d377123a82d5
target = phd_framework::test_vm
target_id = 76973457-8919-4061-943d-782e2a4f8c37
vm = migration_from_base_and_back_lifecycle_1
vm_id = 76973457-8919-4061-943d-782e2a4f8c37
|
| 392 | 2026-09-08T19:41:54.491Z | INFO | phd-runner: [MIGRATE_FROM - END]
elapsed_milliseconds = 8715
file = phd-tests/framework/src/test_vm/mod.rs
line = 609
path = phd_tests::migrate::from_base::migration_from_base_and_back
source = migration_from_base_and_back_lifecycle_0
source_id = 22d6b4fe-f885-4ec0-bdb2-d377123a82d5
target = phd_framework::test_vm
target_id = 76973457-8919-4061-943d-782e2a4f8c37
|
| 393 | 2026-09-08T19:41:54.491Z | INFO | phd-runner: [WAIT_FOR_SERIAL_OUTPUT - END]
elapsed_milliseconds = 80
file = phd-tests/framework/src/test_vm/mod.rs
line = 913
path = phd_tests::migrate::from_base::migration_from_base_and_back
target = phd_framework::test_vm
vm = migration_from_base_and_back_lifecycle_2
vm_id = 7852c2da-5e89-4f4d-be47-45a5dae4b892
|
| 394 | 2026-09-08T19:41:54.492Z | INFO | phd-runner: [WAIT_FOR_SERIAL_OUTPUT - START]
file = phd-tests/framework/src/test_vm/mod.rs
line = 913
path = phd_tests::migrate::from_base::migration_from_base_and_back
target = phd_framework::test_vm
vm = migration_from_base_and_back_lifecycle_2
vm_id = 7852c2da-5e89-4f4d-be47-45a5dae4b892
|
| 395 | 2026-09-08T19:41:54.492Z | INFO | phd-runner: [WAIT_FOR_SERIAL_OUTPUT - EVENT] Waiting for output on serial console
file = phd-tests/framework/src/test_vm/mod.rs
line = 920
path = phd_tests::migrate::from_base::migration_from_base_and_back
target = phd_framework::test_vm
timeout_duration = Explicit(300s)
vm = migration_from_base_and_back_lifecycle_2
vm_id = 7852c2da-5e89-4f4d-be47-45a5dae4b892
|
| 396 | 2026-09-08T19:41:54.522Z | INFO | phd-runner: [WAIT_FOR_SERIAL_OUTPUT - END]
elapsed_milliseconds = 30
file = phd-tests/framework/src/test_vm/mod.rs
line = 913
path = phd_tests::migrate::from_base::migration_from_base_and_back
target = phd_framework::test_vm
vm = migration_from_base_and_back_lifecycle_2
vm_id = 7852c2da-5e89-4f4d-be47-45a5dae4b892
|
| 397 | 2026-09-08T19:41:54.522Z | INFO | phd-runner: [VM CLEANUP - START]
file = phd-tests/framework/src/test_vm/mod.rs
line = 1172
path = phd_tests::migrate::from_base::migration_from_base_and_back
target = phd_framework::test_vm
vm = migration_from_base_and_back_lifecycle_2
vm_id = 7852c2da-5e89-4f4d-be47-45a5dae4b892
|
| 398 | 2026-09-08T19:41:54.522Z | DEBG | phd-runner: [SERIAL CONSOLE TASK - EVENT] serial console command channel was closed
file = phd-tests/framework/src/serial/mod.rs
line = 213
target = phd_framework::serial
|
| 399 | 2026-09-08T19:41:54.523Z | INFO | phd-runner: [SERIAL CONSOLE TASK - END]
elapsed_milliseconds = 17378
file = phd-tests/framework/src/serial/mod.rs
line = 200
target = phd_framework::serial
|
| 400 | 2026-09-08T19:41:54.523Z | INFO | phd-runner: test phd_tests::migrate::from_base::migration_from_base_and_back ... ok
file = phd-tests/runner/src/execute.rs
line = 141
target = phd_runner::execute
|
| 401 | 2026-09-08T19:41:54.523Z | INFO | phd-runner: [TEST_CLEANUP - START]
file = phd-tests/runner/src/fixtures.rs
line = 51
target = phd_runner::fixtures
|
| 402 | 2026-09-08T19:41:54.524Z | DEBG | phd-runner: [VM CLEANUP - EVENT] trying to ensure Propolis server VM is destroyed
file = phd-tests/framework/src/test_vm/mod.rs
line = 1195
path = phd_tests::migrate::from_base::migration_from_base_and_back
target = phd_framework::test_vm
vm = migration_from_base_and_back_lifecycle_2
vm_id = 7852c2da-5e89-4f4d-be47-45a5dae4b892
|
| 403 | 2026-09-08T19:41:54.861Z | DEBG | phd-runner: [VM CLEANUP - EVENT] Killing Propolis server process
file = phd-tests/framework/src/test_vm/server.rs
line = 177
path = phd_tests::migrate::from_base::migration_from_base_and_back
self.address = 127.0.0.1:9006
target = phd_framework::test_vm::server
vm = migration_from_base_and_back_lifecycle_2
vm_id = 7852c2da-5e89-4f4d-be47-45a5dae4b892
|
| 404 | 2026-09-08T19:41:54.943Z | DEBG | phd-runner: [VM CLEANUP - EVENT] zfs clone dropped
file = phd-tests/framework/src/zfs.rs
line = 83
path = phd_tests::migrate::from_base::migration_from_base_and_back
target = phd_framework::zfs
vm = migration_from_base_and_back_lifecycle_2
vm_id = 7852c2da-5e89-4f4d-be47-45a5dae4b892
|
| 405 | 2026-09-08T19:41:54.943Z | DEBG | phd-runner: [VM CLEANUP - EVENT] executing ZFS command
args = ["phd-artifacts/phd-clone-c4d09cd8-32c9-421d-be06-d24478bb8cfe"]
file = phd-tests/framework/src/zfs.rs
line = 304
path = phd_tests::migrate::from_base::migration_from_base_and_back
target = phd_framework::zfs
verb = destroy
vm = migration_from_base_and_back_lifecycle_2
vm_id = 7852c2da-5e89-4f4d-be47-45a5dae4b892
|
| 406 | 2026-09-08T19:41:54.971Z | DEBG | phd-runner: [VM CLEANUP - EVENT] zfs snapshot dropped
file = phd-tests/framework/src/zfs.rs
line = 57
path = phd_tests::migrate::from_base::migration_from_base_and_back
target = phd_framework::zfs
vm = migration_from_base_and_back_lifecycle_2
vm_id = 7852c2da-5e89-4f4d-be47-45a5dae4b892
|
| 407 | 2026-09-08T19:41:54.971Z | DEBG | phd-runner: [VM CLEANUP - EVENT] executing ZFS command
args = ["phd-artifacts@phd-10573c21-93c0-48fd-8541-7102e5182df3"]
file = phd-tests/framework/src/zfs.rs
line = 304
path = phd_tests::migrate::from_base::migration_from_base_and_back
target = phd_framework::zfs
verb = destroy
vm = migration_from_base_and_back_lifecycle_2
vm_id = 7852c2da-5e89-4f4d-be47-45a5dae4b892
|
| 408 | 2026-09-08T19:41:54.990Z | INFO | phd-runner: [VM CLEANUP - END]
elapsed_milliseconds = 467
file = phd-tests/framework/src/test_vm/mod.rs
line = 1172
path = phd_tests::migrate::from_base::migration_from_base_and_back
target = phd_framework::test_vm
vm = migration_from_base_and_back_lifecycle_2
vm_id = 7852c2da-5e89-4f4d-be47-45a5dae4b892
|
| 409 | 2026-09-08T19:41:54.990Z | INFO | phd-runner: [INSTANCE_ENSURE_INTERNAL - END]
elapsed_milliseconds = 5677
file = phd-tests/framework/src/test_vm/mod.rs
line = 412
path = phd_tests::migrate::from_base::migration_from_base_and_back
source = migration_from_base_and_back_lifecycle_1
source_id = 76973457-8919-4061-943d-782e2a4f8c37
target = phd_framework::test_vm
target_id = 7852c2da-5e89-4f4d-be47-45a5dae4b892
vm = migration_from_base_and_back_lifecycle_2
vm_id = 7852c2da-5e89-4f4d-be47-45a5dae4b892
|
| 410 | 2026-09-08T19:41:54.990Z | INFO | phd-runner: [TEST_CLEANUP - END]
elapsed_milliseconds = 467
file = phd-tests/runner/src/fixtures.rs
line = 51
target = phd_runner::fixtures
|
| 411 | 2026-09-08T19:41:54.990Z | INFO | phd-runner: [MIGRATE_FROM - END]
elapsed_milliseconds = 5677
file = phd-tests/framework/src/test_vm/mod.rs
line = 609
path = phd_tests::migrate::from_base::migration_from_base_and_back
source = migration_from_base_and_back_lifecycle_1
source_id = 76973457-8919-4061-943d-782e2a4f8c37
target = phd_framework::test_vm
target_id = 7852c2da-5e89-4f4d-be47-45a5dae4b892
|
| 412 | 2026-09-08T19:41:54.990Z | INFO | phd-runner: [EXECUTION_CLEANUP - START]
file = phd-tests/runner/src/fixtures.rs
line = 35
target = phd_runner::fixtures
|
| 413 | 2026-09-08T19:41:54.990Z | INFO | phd-runner: [TEST - END]
elapsed_milliseconds = 18533
file = phd-tests/tests/src/migrate.rs
line = 52
path = phd_tests::migrate::from_base::migration_from_base_and_back
target = phd_tests::migrate::from_base
|
| 414 | 2026-09-08T19:41:54.990Z | INFO | phd-runner: [EXECUTION_CLEANUP - END]
elapsed_milliseconds = 0
file = phd-tests/runner/src/fixtures.rs
line = 35
target = phd_runner::fixtures
|
| 415 | | test result: ok. 3 passed; 0 failed; 0 skipped; 0 not run; finished in 84.92s |
| 416 | | |
| 417 | 2026-09-08T19:41:54.992Z | DEBG | phd-runner: phd_runner
exit_code = 0
file = phd-tests/runner/src/main.rs
line = 41
target = phd_runner
|