| 1 | 2026-09-16T17:54:28.935Z | INFO | phd-runner: phd_runner
file = phd-tests/runner/src/main.rs
line = 36
runner_args = ProcessArgs { command: Run(RunOptions { propolis_server_cmd: "/work/phd-test/propolis-server", base_propolis_branch: Some("master"), base_propolis_commit: None, base_propolis_cmd: None, crucible_downstairs_cmd: None, crucible_downstairs_commit: Some(Auto), tmp_directory: "/tmp/propolis-phd", artifact_directory: Some("/phd-artifacts"), output_mode: TmpFile, default_guest_cpus: 2, default_guest_memory_mib: 512, artifact_toml_path: "/work/phd-test/artifacts.toml", default_guest_artifact: "alpine", default_bootrom_artifact: "ovmf", include_filter: ["phd_tests::migrate::from_base"], exclude_filter: [], max_buildomat_wait_secs: 1200, manual_stop_on_failure: false }), disable_ansi: false, emit_bunyan: true }
target = phd_runner
|
| 2 | 2026-09-16T17:54:28.961Z | DEBG | phd-runner: Created new artifact store from manifest
file = phd-tests/framework/src/artifacts/store.rs
line = 219
store = Store { local_dir: "/phd-artifacts", artifacts: {"alpine": Mutex { data: StoredArtifact { description: Artifact { filename: "alpine.iso", kind: GuestOs(Alpine), source: RemoteServer { sha256: "ba8007f74f9b54fbae3b2520da577831b4834778a498d732f091260c61aa7ca1" }, untar: None }, cached_path: None } }, "ovmf": Mutex { data: StoredArtifact { description: Artifact { filename: "OVMF_CODE.fd", kind: Bootrom, source: Buildomat(BuildomatArtifact { repo: Repo("oxidecomputer/edk2"), series: Series("image_debug"), commit: Commit("bf64f45b1a58e69d126a3c6ca1e4512c88668132"), sha256: "740187046a7267d0de72d3455070333547dbc0ea023531471fb2b2a61effa448" }), untar: None }, cached_path: None } }}, downloader: DownloadConfig { timeout: 600s, buildomat_backoff: ExponentialBackoff { current_interval: 1s, initial_interval: 1s, randomization_factor: 0.5, multiplier: 1.5, max_interval: 60s, start_time: Instant { tv_sec: 255, tv_nsec: 389647517 }, max_elapsed_time: Some(1200s), clock: SystemClock }, remote_server_uris: ["https://oxide-omicron-build.s3.amazonaws.com"] } }
target = phd_framework::artifacts::store
|
| 3 | 2026-09-16T17:54:28.962Z | INFO | phd-runner: Adding Propolis server from local command
file = phd-tests/framework/src/artifacts/store.rs
line = 227
propolis_server_cmd = /work/phd-test/propolis-server
target = phd_framework::artifacts::store
|
| 4 | 2026-09-16T17:54:28.963Z | INFO | phd-runner: Adding crucible-downstairs from Buildomat Git revision
commit = ad8a31742adc45e925e63443a5b43c8e30604022
file = phd-tests/framework/src/artifacts/store.rs
line = 311
target = phd_framework::artifacts::store
|
| 5 | 2026-09-16T17:54:28.969Z | DEBG | phd-runner: Downloading file from Buildomat...
file = phd-tests/framework/src/artifacts/buildomat.rs
line = 215
target = phd_framework::artifacts::buildomat
timeout = 600s
uri = https://buildomat.eng.oxide.computer/public/file/oxidecomputer/crucible/nightly-image/ad8a31742adc45e925e63443a5b43c8e30604022/crucible-nightly.sha256.txt
|
| 6 | 2026-09-16T17:54:29.266Z | INFO | phd-runner: Adding 'current' Propolis server from Buildomat Git branch 'master'
file = phd-tests/framework/src/artifacts/store.rs
line = 248
target = phd_framework::artifacts::store
|
| 7 | 2026-09-16T17:54:29.892Z | DEBG | phd-runner: Downloading file from Buildomat...
file = phd-tests/framework/src/artifacts/buildomat.rs
line = 215
target = phd_framework::artifacts::buildomat
timeout = 600s
uri = https://buildomat.eng.oxide.computer/public/file/oxidecomputer/propolis/phd_build/a35415e00c5f6df2ce9adcec8cad12519d44a197/propolis-server.sha256.txt
|
| 8 | 2026-09-16T17:54:30.057Z | INFO | phd-runner: [EXECUTION_SETUP - START]
file = phd-tests/runner/src/fixtures.rs
line = 25
target = phd_runner::fixtures
|
| 9 | 2026-09-16T17:54:30.058Z | INFO | phd-runner: [EXECUTION_SETUP - END]
elapsed_milliseconds = 0
file = phd-tests/runner/src/fixtures.rs
line = 25
target = phd_runner::fixtures
|
| 10 | 2026-09-16T17:54:30.060Z | INFO | phd-runner: Running 3 test(s)
file = phd-tests/runner/src/execute.rs
line = 83
target = phd_runner::execute
|
| 11 | 2026-09-16T17:54:30.061Z | INFO | phd-runner: Starting test phd_tests::migrate::from_base::serial_history
file = phd-tests/runner/src/execute.rs
line = 91
target = phd_runner::execute
|
| 12 | 2026-09-16T17:54:30.061Z | INFO | phd-runner: [TEST_SETUP - START]
file = phd-tests/runner/src/fixtures.rs
line = 41
target = phd_runner::fixtures
|
| 13 | 2026-09-16T17:54:30.061Z | INFO | phd-runner: [TEST_SETUP - END]
elapsed_milliseconds = 0
file = phd-tests/runner/src/fixtures.rs
line = 41
target = phd_runner::fixtures
|
| 14 | 2026-09-16T17:54:30.062Z | INFO | phd-runner: [TEST - START]
file = phd-tests/tests/src/migrate.rs
line = 40
path = phd_tests::migrate::from_base::serial_history
target = phd_tests::migrate::from_base
|
| 15 | 2026-09-16T17:54:30.063Z | DEBG | phd-runner: [TEST - EVENT] checking for existing copy of artifact
file = phd-tests/framework/src/artifacts/store.rs
line = 89
maybe_path = /phd-artifacts/740187046a7267d0de72d3455070333547dbc0ea023531471fb2b2a61effa448/OVMF_CODE.fd
path = phd_tests::migrate::from_base::serial_history
target = phd_framework::artifacts::store
|
| 16 | 2026-09-16T17:54:30.064Z | DEBG | phd-runner: [TEST - EVENT] Downloading file from Buildomat...
file = phd-tests/framework/src/artifacts/buildomat.rs
line = 215
path = phd_tests::migrate::from_base::serial_history
target = phd_framework::artifacts::buildomat
timeout = 600s
uri = https://buildomat.eng.oxide.computer/public/file/oxidecomputer/edk2/image_debug/bf64f45b1a58e69d126a3c6ca1e4512c88668132/OVMF_CODE.fd
|
| 17 | 2026-09-16T17:54:32.809Z | DEBG | phd-runner: [TEST - EVENT] checking for existing copy of artifact
file = phd-tests/framework/src/artifacts/store.rs
line = 89
maybe_path = /phd-artifacts/ba8007f74f9b54fbae3b2520da577831b4834778a498d732f091260c61aa7ca1/alpine.iso
path = phd_tests::migrate::from_base::serial_history
target = phd_framework::artifacts::store
|
| 18 | 2026-09-16T17:54:32.822Z | DEBG | phd-runner: [TEST - EVENT] Downloading alpine.iso from https://oxide-omicron-build.s3.amazonaws.com/alpine.iso
file = phd-tests/framework/src/artifacts/store.rs
line = 614
path = phd_tests::migrate::from_base::serial_history
target = phd_framework::artifacts::store
timeout = 600s
|
| 19 | 2026-09-16T17:54:39.415Z | DEBG | phd-runner: [TEST - EVENT] Verified artifact already exists
file = phd-tests/framework/src/artifacts/store.rs
line = 45
path = /phd-artifacts/ba8007f74f9b54fbae3b2520da577831b4834778a498d732f091260c61aa7ca1/alpine.iso
target = phd_framework::artifacts::store
|
| 20 | 2026-09-16T17:54:39.415Z | DEBG | phd-runner: [TEST - EVENT] executing ZFS command
args = ["/phd-artifacts/ba8007f74f9b54fbae3b2520da577831b4834778a498d732f091260c61aa7ca1/alpine.iso"]
file = phd-tests/framework/src/zfs.rs
line = 304
path = phd_tests::migrate::from_base::serial_history
target = phd_framework::zfs
verb = list
|
| 21 | 2026-09-16T17:54:39.431Z | DEBG | phd-runner: [TEST - EVENT] parsing zfs list output
file = phd-tests/framework/src/zfs.rs
line = 238
path = phd_tests::migrate::from_base::serial_history
stdout = NAME USED AVAIL REFER MOUNTPOINT\nphd-artifacts 4.23M 25.3T 2M /phd-artifacts\n
target = phd_framework::zfs
|
| 22 | 2026-09-16T17:54:39.432Z | DEBG | phd-runner: [TEST - EVENT] executing ZFS command
args = ["phd-artifacts@phd-6a086a22-1150-419f-9893-5078ecee6cc4"]
file = phd-tests/framework/src/zfs.rs
line = 304
path = phd_tests::migrate::from_base::serial_history
target = phd_framework::zfs
verb = snapshot
|
| 23 | 2026-09-16T17:54:39.454Z | DEBG | phd-runner: [TEST - EVENT] executing ZFS command
args = ["phd-artifacts@phd-6a086a22-1150-419f-9893-5078ecee6cc4", "phd-artifacts/phd-clone-44a1da1c-521a-48a5-b8c6-38b624a28d57"]
file = phd-tests/framework/src/zfs.rs
line = 304
path = phd_tests::migrate::from_base::serial_history
target = phd_framework::zfs
verb = clone
|
| 24 | 2026-09-16T17:54:39.473Z | DEBG | phd-runner: [TEST - EVENT] executing ZFS command
args = ["phd-artifacts/phd-clone-44a1da1c-521a-48a5-b8c6-38b624a28d57"]
file = phd-tests/framework/src/zfs.rs
line = 304
path = phd_tests::migrate::from_base::serial_history
target = phd_framework::zfs
verb = list
|
| 25 | 2026-09-16T17:54:39.484Z | DEBG | phd-runner: [TEST - EVENT] parsing zfs list output
file = phd-tests/framework/src/zfs.rs
line = 238
path = phd_tests::migrate::from_base::serial_history
stdout = NAME USED AVAIL REFER MOUNTPOINT\nphd-artifacts/phd-clone-44a1da1c-521a-48a5-b8c6-38b624a28d57 0B 25.3T 49.0M /phd-artifacts/phd-clone-44a1da1c-521a-48a5-b8c6-38b624a28d57\n
target = phd_framework::zfs
|
| 26 | 2026-09-16T17:54:39.488Z | INFO | phd-runner: [NEW - START]
file = phd-tests/framework/src/test_vm/mod.rs
line = 300
path = phd_tests::migrate::from_base::serial_history
target = phd_framework::test_vm
|
| 27 | 2026-09-16T17:54:39.489Z | INFO | phd-runner: [NEW - EVENT] phd_framework::test_vm
environment = EnvironmentSpec { location: Local, propolis_artifact: "__BASE_PROPOLIS", metrics: None }
file = phd-tests/framework/src/test_vm/mod.rs
guest_os_kind = Alpine
line = 318
path = phd_tests::migrate::from_base::serial_history
target = phd_framework::test_vm
vm_name = migration_serial_history_base
|
| 28 | 2026-09-16T17:54:39.489Z | DEBG | phd-runner: [NEW - EVENT] checking for existing copy of artifact
file = phd-tests/framework/src/artifacts/store.rs
line = 89
maybe_path = /phd-artifacts/9ae9fafe7388ed9e46be3e2216caab7a75f3f243a766be6e0a4a4eef637cce0c/propolis-server.tar.gz
path = phd_tests::migrate::from_base::serial_history
target = phd_framework::artifacts::store
|
| 29 | 2026-09-16T17:54:39.489Z | DEBG | phd-runner: [NEW - EVENT] Downloading file from Buildomat...
file = phd-tests/framework/src/artifacts/buildomat.rs
line = 215
path = phd_tests::migrate::from_base::serial_history
target = phd_framework::artifacts::buildomat
timeout = 600s
uri = https://buildomat.eng.oxide.computer/public/file/oxidecomputer/propolis/phd_build/a35415e00c5f6df2ce9adcec8cad12519d44a197/propolis-server.tar.gz
|
| 30 | 2026-09-16T17:55:03.684Z | DEBG | phd-runner: [NEW - EVENT] Extracting artifact from tarball
extracted_path = /phd-artifacts/9ae9fafe7388ed9e46be3e2216caab7a75f3f243a766be6e0a4a4eef637cce0c/propolis-server
file = phd-tests/framework/src/artifacts/store.rs
line = 160
path = phd_tests::migrate::from_base::serial_history
target = phd_framework::artifacts::store
untar_path = propolis-server
|
| 31 | 2026-09-16T17:55:03.684Z | DEBG | phd-runner: [NEW - EVENT] Extracting gzipped tarball...
file = phd-tests/framework/src/artifacts/store.rs
line = 514
path = phd_tests::migrate::from_base::serial_history
target = phd_framework::artifacts::store
|
| 32 | 2026-09-16T17:55:28.836Z | INFO | phd-runner: [NEW - EVENT] Launching Propolis server
bootrom_path = "/phd-artifacts/740187046a7267d0de72d3455070333547dbc0ea023531471fb2b2a61effa448/OVMF_CODE.fd"
file = phd-tests/framework/src/test_vm/server.rs
line = 66
path = phd_tests::migrate::from_base::serial_history
server_addr = 127.0.0.1:9000
server_path = "/phd-artifacts/9ae9fafe7388ed9e46be3e2216caab7a75f3f243a766be6e0a4a4eef637cce0c/propolis-server"
target = phd_framework::test_vm::server
|
| 33 | 2026-09-16T17:55:28.836Z | INFO | phd-runner: [NEW - EVENT] Opening server log files
file = phd-tests/framework/src/log_config.rs
line = 84
path = phd_tests::migrate::from_base::serial_history
stderr_path = "/tmp/propolis-phd/phd_tests::migrate::from_base::serial_history/migration_serial_history_base.stderr.log"
stdout_path = "/tmp/propolis-phd/phd_tests::migrate::from_base::serial_history/migration_serial_history_base.stdout.log"
target = phd_framework::log_config
|
| 34 | 2026-09-16T17:55:29.009Z | INFO | phd-runner: [NEW - EVENT] Launched server with pid 917
file = phd-tests/framework/src/test_vm/server.rs
line = 127
path = phd_tests::migrate::from_base::serial_history
target = phd_framework::test_vm::server
|
| 35 | 2026-09-16T17:55:29.024Z | INFO | phd-runner: [INSTANCE_ENSURE_INTERNAL - START]
file = phd-tests/framework/src/test_vm/mod.rs
line = 412
path = phd_tests::migrate::from_base::serial_history
target = phd_framework::test_vm
vm = migration_serial_history_base
vm_id = 3da6354b-c1fe-4a9e-8ce3-cf9096e9f951
|
| 36 | 2026-09-16T17:55:29.036Z | INFO | phd-runner: [INSTANCE_ENSURE_INTERNAL - EVENT] retriable error from instance_spec_ensure
e = Communication Error: error sending request for url (http://127.0.0.1:9000/instance)
file = phd-tests/framework/src/test_vm/mod.rs
line = 455
path = phd_tests::migrate::from_base::serial_history
target = phd_framework::test_vm
vm = migration_serial_history_base
vm_id = 3da6354b-c1fe-4a9e-8ce3-cf9096e9f951
|
| 37 | 2026-09-16T17:55:29.040Z | INFO | phd-runner: [NEW - END]
elapsed_milliseconds = 49553
file = phd-tests/framework/src/test_vm/mod.rs
line = 300
path = phd_tests::migrate::from_base::serial_history
target = phd_framework::test_vm
|
| 38 | 2026-09-16T17:55:29.657Z | INFO | phd-runner: [SERIAL CONSOLE TASK - START]
file = phd-tests/framework/src/serial/mod.rs
line = 200
target = phd_framework::serial
|
| 39 | 2026-09-16T17:55:29.665Z | INFO | phd-runner: [INSTANCE_ENSURE_INTERNAL - EVENT] Started instance
file = phd-tests/framework/src/test_vm/mod.rs
instance_description.instance = Instance { properties: InstanceProperties { id: 3da6354b-c1fe-4a9e-8ce3-cf9096e9f951, name: "phd-vm-3da6354b-c1fe-4a9e-8ce3-cf9096e9f951", description: "Pheidippides-managed VM", metadata: InstanceMetadata { silo_id: ee58ca94-e260-47ef-9f40-7d5b42c00441, project_id: ba2d1ee6-b442-4055-be29-cd275b3fd586, sled_id: dd29ebb6-5d80-481c-bf96-6dd800a83f15, sled_serial: "dd29ebb6-5d80-481c-bf96-6dd800a83f15", sled_revision: 1, sled_model: "pheidippes" } }, state: Creating }
line = 514
path = phd_tests::migrate::from_base::serial_history
target = phd_framework::test_vm
vm = migration_serial_history_base
vm_id = 3da6354b-c1fe-4a9e-8ce3-cf9096e9f951
|
| 40 | 2026-09-16T17:55:29.665Z | INFO | phd-runner: [PUT_INSTANCE_STATE - START]
file = phd-tests/framework/src/test_vm/mod.rs
line = 575
path = phd_tests::migrate::from_base::serial_history
target = phd_framework::test_vm
vm = migration_serial_history_base
vm_id = 3da6354b-c1fe-4a9e-8ce3-cf9096e9f951
|
| 41 | 2026-09-16T17:55:29.665Z | INFO | phd-runner: [PUT_INSTANCE_STATE - EVENT] Requesting instance state change
file = phd-tests/framework/src/test_vm/mod.rs
line = 580
path = phd_tests::migrate::from_base::serial_history
state = Run
target = phd_framework::test_vm
vm = migration_serial_history_base
vm_id = 3da6354b-c1fe-4a9e-8ce3-cf9096e9f951
|
| 42 | 2026-09-16T17:55:29.668Z | INFO | phd-runner: [PUT_INSTANCE_STATE - END]
elapsed_milliseconds = 2
file = phd-tests/framework/src/test_vm/mod.rs
line = 575
path = phd_tests::migrate::from_base::serial_history
target = phd_framework::test_vm
vm = migration_serial_history_base
vm_id = 3da6354b-c1fe-4a9e-8ce3-cf9096e9f951
|
| 43 | 2026-09-16T17:55:29.668Z | INFO | phd-runner: [WAIT_TO_BOOT - START]
file = phd-tests/framework/src/test_vm/mod.rs
line = 890
path = phd_tests::migrate::from_base::serial_history
target = phd_framework::test_vm
|
| 44 | 2026-09-16T17:55:29.668Z | INFO | phd-runner: [WAIT_TO_BOOT - EVENT] waiting for guest to boot
file = phd-tests/framework/src/test_vm/mod.rs
line = 839
path = phd_tests::migrate::from_base::serial_history
target = phd_framework::test_vm
timeout_duration = 300s
vm = migration_serial_history_base
vm_id = 3da6354b-c1fe-4a9e-8ce3-cf9096e9f951
|
| 45 | 2026-09-16T17:55:29.668Z | DEBG | phd-runner: [WAIT_TO_BOOT - EVENT] executing command in boot sequence
file = phd-tests/framework/src/test_vm/mod.rs
line = 847
path = phd_tests::migrate::from_base::serial_history
step = WaitFor("localhost login: ")
target = phd_framework::test_vm
|
| 46 | 2026-09-16T17:55:29.668Z | INFO | phd-runner: [WAIT_FOR_SERIAL_OUTPUT - START]
file = phd-tests/framework/src/test_vm/mod.rs
line = 913
path = phd_tests::migrate::from_base::serial_history
target = phd_framework::test_vm
vm = migration_serial_history_base
vm_id = 3da6354b-c1fe-4a9e-8ce3-cf9096e9f951
|
| 47 | 2026-09-16T17:55:29.668Z | INFO | phd-runner: [WAIT_FOR_SERIAL_OUTPUT - EVENT] Waiting for output on serial console
file = phd-tests/framework/src/test_vm/mod.rs
line = 920
path = phd_tests::migrate::from_base::serial_history
target = phd_framework::test_vm
timeout_duration = CallerTimeout
vm = migration_serial_history_base
vm_id = 3da6354b-c1fe-4a9e-8ce3-cf9096e9f951
|
| 48 | 2026-09-16T17:55:34.226Z | INFO | phd-runner: [WAIT_FOR_SERIAL_OUTPUT - END]
elapsed_milliseconds = 4558
file = phd-tests/framework/src/test_vm/mod.rs
line = 913
path = phd_tests::migrate::from_base::serial_history
target = phd_framework::test_vm
vm = migration_serial_history_base
vm_id = 3da6354b-c1fe-4a9e-8ce3-cf9096e9f951
|
| 49 | 2026-09-16T17:55:34.226Z | DEBG | phd-runner: [WAIT_TO_BOOT - EVENT] executing command in boot sequence
file = phd-tests/framework/src/test_vm/mod.rs
line = 847
path = phd_tests::migrate::from_base::serial_history
step = WriteStr("root")
target = phd_framework::test_vm
|
| 50 | 2026-09-16T17:55:34.229Z | DEBG | phd-runner: [WAIT_TO_BOOT - EVENT] executing command in boot sequence
file = phd-tests/framework/src/test_vm/mod.rs
line = 847
path = phd_tests::migrate::from_base::serial_history
step = WaitFor("localhost:~#")
target = phd_framework::test_vm
|
| 51 | 2026-09-16T17:55:34.229Z | INFO | phd-runner: [WAIT_FOR_SERIAL_OUTPUT - START]
file = phd-tests/framework/src/test_vm/mod.rs
line = 913
path = phd_tests::migrate::from_base::serial_history
target = phd_framework::test_vm
vm = migration_serial_history_base
vm_id = 3da6354b-c1fe-4a9e-8ce3-cf9096e9f951
|
| 52 | 2026-09-16T17:55:34.229Z | INFO | phd-runner: [WAIT_FOR_SERIAL_OUTPUT - EVENT] Waiting for output on serial console
file = phd-tests/framework/src/test_vm/mod.rs
line = 920
path = phd_tests::migrate::from_base::serial_history
target = phd_framework::test_vm
timeout_duration = CallerTimeout
vm = migration_serial_history_base
vm_id = 3da6354b-c1fe-4a9e-8ce3-cf9096e9f951
|
| 53 | 2026-09-16T17:55:34.255Z | INFO | phd-runner: [WAIT_FOR_SERIAL_OUTPUT - END]
elapsed_milliseconds = 25
file = phd-tests/framework/src/test_vm/mod.rs
line = 913
path = phd_tests::migrate::from_base::serial_history
target = phd_framework::test_vm
vm = migration_serial_history_base
vm_id = 3da6354b-c1fe-4a9e-8ce3-cf9096e9f951
|
| 54 | 2026-09-16T17:55:34.255Z | DEBG | phd-runner: [WAIT_TO_BOOT - EVENT] executing command in boot sequence
file = phd-tests/framework/src/test_vm/mod.rs
line = 847
path = phd_tests::migrate::from_base::serial_history
step = WriteStr("stty -F `tty` cols 9999")
target = phd_framework::test_vm
|
| 55 | 2026-09-16T17:55:34.256Z | DEBG | phd-runner: [WAIT_TO_BOOT - EVENT] executing command in boot sequence
file = phd-tests/framework/src/test_vm/mod.rs
line = 847
path = phd_tests::migrate::from_base::serial_history
step = WaitFor("localhost:~#")
target = phd_framework::test_vm
|
| 56 | 2026-09-16T17:55:34.256Z | INFO | phd-runner: [WAIT_FOR_SERIAL_OUTPUT - START]
file = phd-tests/framework/src/test_vm/mod.rs
line = 913
path = phd_tests::migrate::from_base::serial_history
target = phd_framework::test_vm
vm = migration_serial_history_base
vm_id = 3da6354b-c1fe-4a9e-8ce3-cf9096e9f951
|
| 57 | 2026-09-16T17:55:34.256Z | INFO | phd-runner: [WAIT_FOR_SERIAL_OUTPUT - EVENT] Waiting for output on serial console
file = phd-tests/framework/src/test_vm/mod.rs
line = 920
path = phd_tests::migrate::from_base::serial_history
target = phd_framework::test_vm
timeout_duration = CallerTimeout
vm = migration_serial_history_base
vm_id = 3da6354b-c1fe-4a9e-8ce3-cf9096e9f951
|
| 58 | 2026-09-16T17:55:34.289Z | INFO | phd-runner: [WAIT_FOR_SERIAL_OUTPUT - END]
elapsed_milliseconds = 32
file = phd-tests/framework/src/test_vm/mod.rs
line = 913
path = phd_tests::migrate::from_base::serial_history
target = phd_framework::test_vm
vm = migration_serial_history_base
vm_id = 3da6354b-c1fe-4a9e-8ce3-cf9096e9f951
|
| 59 | 2026-09-16T17:55:34.289Z | INFO | phd-runner: [WAIT_TO_BOOT - EVENT] Guest has booted
file = phd-tests/framework/src/test_vm/mod.rs
line = 887
path = phd_tests::migrate::from_base::serial_history
target = phd_framework::test_vm
|
| 60 | 2026-09-16T17:55:34.289Z | INFO | phd-runner: [WAIT_TO_BOOT - END]
elapsed_milliseconds = 4621
file = phd-tests/framework/src/test_vm/mod.rs
line = 890
path = phd_tests::migrate::from_base::serial_history
target = phd_framework::test_vm
|
| 61 | 2026-09-16T17:55:34.290Z | INFO | phd-runner: [WAIT_FOR_SERIAL_OUTPUT - START]
file = phd-tests/framework/src/test_vm/mod.rs
line = 913
path = phd_tests::migrate::from_base::serial_history
target = phd_framework::test_vm
vm = migration_serial_history_base
vm_id = 3da6354b-c1fe-4a9e-8ce3-cf9096e9f951
|
| 62 | 2026-09-16T17:55:34.290Z | INFO | phd-runner: [WAIT_FOR_SERIAL_OUTPUT - EVENT] Waiting for output on serial console
file = phd-tests/framework/src/test_vm/mod.rs
line = 920
path = phd_tests::migrate::from_base::serial_history
target = phd_framework::test_vm
timeout_duration = Explicit(15s)
vm = migration_serial_history_base
vm_id = 3da6354b-c1fe-4a9e-8ce3-cf9096e9f951
|
| 63 | 2026-09-16T17:55:34.299Z | INFO | phd-runner: [WAIT_FOR_SERIAL_OUTPUT - END]
elapsed_milliseconds = 9
file = phd-tests/framework/src/test_vm/mod.rs
line = 913
path = phd_tests::migrate::from_base::serial_history
target = phd_framework::test_vm
vm = migration_serial_history_base
vm_id = 3da6354b-c1fe-4a9e-8ce3-cf9096e9f951
|
| 64 | 2026-09-16T17:55:34.300Z | INFO | phd-runner: [WAIT_FOR_SERIAL_OUTPUT - START]
file = phd-tests/framework/src/test_vm/mod.rs
line = 913
path = phd_tests::migrate::from_base::serial_history
target = phd_framework::test_vm
vm = migration_serial_history_base
vm_id = 3da6354b-c1fe-4a9e-8ce3-cf9096e9f951
|
| 65 | 2026-09-16T17:55:34.300Z | INFO | phd-runner: [WAIT_FOR_SERIAL_OUTPUT - EVENT] Waiting for output on serial console
file = phd-tests/framework/src/test_vm/mod.rs
line = 920
path = phd_tests::migrate::from_base::serial_history
target = phd_framework::test_vm
timeout_duration = Explicit(300s)
vm = migration_serial_history_base
vm_id = 3da6354b-c1fe-4a9e-8ce3-cf9096e9f951
|
| 66 | 2026-09-16T17:55:34.333Z | INFO | phd-runner: [WAIT_FOR_SERIAL_OUTPUT - END]
elapsed_milliseconds = 33
file = phd-tests/framework/src/test_vm/mod.rs
line = 913
path = phd_tests::migrate::from_base::serial_history
target = phd_framework::test_vm
vm = migration_serial_history_base
vm_id = 3da6354b-c1fe-4a9e-8ce3-cf9096e9f951
|
| 67 | 2026-09-16T17:55:34.333Z | INFO | phd-runner: [WAIT_FOR_SERIAL_OUTPUT - START]
file = phd-tests/framework/src/test_vm/mod.rs
line = 913
path = phd_tests::migrate::from_base::serial_history
target = phd_framework::test_vm
vm = migration_serial_history_base
vm_id = 3da6354b-c1fe-4a9e-8ce3-cf9096e9f951
|
| 68 | 2026-09-16T17:55:34.333Z | INFO | phd-runner: [WAIT_FOR_SERIAL_OUTPUT - EVENT] Waiting for output on serial console
file = phd-tests/framework/src/test_vm/mod.rs
line = 920
path = phd_tests::migrate::from_base::serial_history
target = phd_framework::test_vm
timeout_duration = Explicit(15s)
vm = migration_serial_history_base
vm_id = 3da6354b-c1fe-4a9e-8ce3-cf9096e9f951
|
| 69 | 2026-09-16T17:55:34.344Z | INFO | phd-runner: [WAIT_FOR_SERIAL_OUTPUT - END]
elapsed_milliseconds = 10
file = phd-tests/framework/src/test_vm/mod.rs
line = 913
path = phd_tests::migrate::from_base::serial_history
target = phd_framework::test_vm
vm = migration_serial_history_base
vm_id = 3da6354b-c1fe-4a9e-8ce3-cf9096e9f951
|
| 70 | 2026-09-16T17:55:34.344Z | INFO | phd-runner: [WAIT_FOR_SERIAL_OUTPUT - START]
file = phd-tests/framework/src/test_vm/mod.rs
line = 913
path = phd_tests::migrate::from_base::serial_history
target = phd_framework::test_vm
vm = migration_serial_history_base
vm_id = 3da6354b-c1fe-4a9e-8ce3-cf9096e9f951
|
| 71 | 2026-09-16T17:55:34.345Z | INFO | phd-runner: [WAIT_FOR_SERIAL_OUTPUT - EVENT] Waiting for output on serial console
file = phd-tests/framework/src/test_vm/mod.rs
line = 920
path = phd_tests::migrate::from_base::serial_history
target = phd_framework::test_vm
timeout_duration = Explicit(300s)
vm = migration_serial_history_base
vm_id = 3da6354b-c1fe-4a9e-8ce3-cf9096e9f951
|
| 72 | 2026-09-16T17:55:34.377Z | INFO | phd-runner: [WAIT_FOR_SERIAL_OUTPUT - END]
elapsed_milliseconds = 32
file = phd-tests/framework/src/test_vm/mod.rs
line = 913
path = phd_tests::migrate::from_base::serial_history
target = phd_framework::test_vm
vm = migration_serial_history_base
vm_id = 3da6354b-c1fe-4a9e-8ce3-cf9096e9f951
|
| 73 | 2026-09-16T17:55:34.387Z | INFO | phd-runner: [TEST - EVENT] migrating to new Propolis artifact for lifecycle test
file = phd-tests/framework/src/lifecycle.rs
line = 73
path = phd_tests::migrate::from_base::serial_history
propolis_artifact = __DEFAULT_PROPOLIS
target = phd_framework::lifecycle
vm_name = migration_serial_history_base
|
| 74 | 2026-09-16T17:55:34.387Z | INFO | phd-runner: [NEW - START]
file = phd-tests/framework/src/test_vm/mod.rs
line = 300
path = phd_tests::migrate::from_base::serial_history
target = phd_framework::test_vm
|
| 75 | 2026-09-16T17:55:34.387Z | INFO | phd-runner: [NEW - EVENT] phd_framework::test_vm
environment = EnvironmentSpec { location: Local, propolis_artifact: "__DEFAULT_PROPOLIS", metrics: None }
file = phd-tests/framework/src/test_vm/mod.rs
guest_os_kind = Alpine
line = 318
path = phd_tests::migrate::from_base::serial_history
target = phd_framework::test_vm
vm_name = migration_serial_history_base_lifecycle_0
|
| 76 | 2026-09-16T17:55:34.388Z | DEBG | phd-runner: [NEW - EVENT] Examining locally-sourced artifact
file = phd-tests/framework/src/artifacts/store.rs
line = 56
path = /work/phd-test/propolis-server
sha256 = None
target = phd_framework::artifacts::store
|
| 77 | 2026-09-16T17:55:34.388Z | DEBG | phd-runner: [NEW - EVENT] Locally-sourced artifact is valid, caching its path
file = phd-tests/framework/src/artifacts/store.rs
line = 69
path = /work/phd-test/propolis-server
target = phd_framework::artifacts::store
|
| 78 | 2026-09-16T17:55:34.388Z | INFO | phd-runner: [NEW - EVENT] Launching Propolis server
bootrom_path = "/phd-artifacts/740187046a7267d0de72d3455070333547dbc0ea023531471fb2b2a61effa448/OVMF_CODE.fd"
file = phd-tests/framework/src/test_vm/server.rs
line = 66
path = phd_tests::migrate::from_base::serial_history
server_addr = 127.0.0.1:9002
server_path = "/work/phd-test/propolis-server"
target = phd_framework::test_vm::server
|
| 79 | 2026-09-16T17:55:34.388Z | INFO | phd-runner: [NEW - EVENT] Opening server log files
file = phd-tests/framework/src/log_config.rs
line = 84
path = phd_tests::migrate::from_base::serial_history
stderr_path = "/tmp/propolis-phd/phd_tests::migrate::from_base::serial_history/migration_serial_history_base_lifecycle_0.stderr.log"
stdout_path = "/tmp/propolis-phd/phd_tests::migrate::from_base::serial_history/migration_serial_history_base_lifecycle_0.stdout.log"
target = phd_framework::log_config
|
| 80 | 2026-09-16T17:55:34.428Z | INFO | phd-runner: [NEW - EVENT] Launched server with pid 918
file = phd-tests/framework/src/test_vm/server.rs
line = 127
path = phd_tests::migrate::from_base::serial_history
target = phd_framework::test_vm::server
|
| 81 | 2026-09-16T17:55:34.441Z | INFO | phd-runner: [NEW - END]
elapsed_milliseconds = 53
file = phd-tests/framework/src/test_vm/mod.rs
line = 300
path = phd_tests::migrate::from_base::serial_history
target = phd_framework::test_vm
|
| 82 | 2026-09-16T17:55:34.441Z | INFO | phd-runner: [MIGRATE_FROM - START]
file = phd-tests/framework/src/test_vm/mod.rs
line = 609
path = phd_tests::migrate::from_base::serial_history
source = migration_serial_history_base
source_id = 3da6354b-c1fe-4a9e-8ce3-cf9096e9f951
target = phd_framework::test_vm
target_id = afd9b655-5ba1-42ce-8b20-4a0432681045
|
| 83 | 2026-09-16T17:55:34.441Z | INFO | phd-runner: [MIGRATE_FROM - EVENT] Migrating from source at address 127.0.0.1:9000
file = phd-tests/framework/src/test_vm/mod.rs
line = 642
migration_id = 07a69e0c-4b8d-4ad1-a853-bf8303fcc20e
path = phd_tests::migrate::from_base::serial_history
source = migration_serial_history_base
source_id = 3da6354b-c1fe-4a9e-8ce3-cf9096e9f951
target = phd_framework::test_vm
target_id = afd9b655-5ba1-42ce-8b20-4a0432681045
timeout_duration = 45s
|
| 84 | 2026-09-16T17:55:34.441Z | INFO | phd-runner: [INSTANCE_ENSURE_INTERNAL - START]
file = phd-tests/framework/src/test_vm/mod.rs
line = 412
path = phd_tests::migrate::from_base::serial_history
source = migration_serial_history_base
source_id = 3da6354b-c1fe-4a9e-8ce3-cf9096e9f951
target = phd_framework::test_vm
target_id = afd9b655-5ba1-42ce-8b20-4a0432681045
vm = migration_serial_history_base_lifecycle_0
vm_id = afd9b655-5ba1-42ce-8b20-4a0432681045
|
| 85 | 2026-09-16T17:55:34.442Z | INFO | phd-runner: [INSTANCE_ENSURE_INTERNAL - EVENT] retriable error from instance_spec_ensure
e = Communication Error: error sending request for url (http://127.0.0.1:9002/instance)
file = phd-tests/framework/src/test_vm/mod.rs
line = 455
path = phd_tests::migrate::from_base::serial_history
source = migration_serial_history_base
source_id = 3da6354b-c1fe-4a9e-8ce3-cf9096e9f951
target = phd_framework::test_vm
target_id = afd9b655-5ba1-42ce-8b20-4a0432681045
vm = migration_serial_history_base_lifecycle_0
vm_id = afd9b655-5ba1-42ce-8b20-4a0432681045
|
| 86 | 2026-09-16T17:55:35.194Z | INFO | phd-runner: [INSTANCE_ENSURE_INTERNAL - EVENT] Started instance
file = phd-tests/framework/src/test_vm/mod.rs
instance_description.instance = Instance { properties: InstanceProperties { id: afd9b655-5ba1-42ce-8b20-4a0432681045, name: "phd-vm-afd9b655-5ba1-42ce-8b20-4a0432681045", description: "Pheidippides-managed VM", metadata: InstanceMetadata { silo_id: ee58ca94-e260-47ef-9f40-7d5b42c00441, project_id: ba2d1ee6-b442-4055-be29-cd275b3fd586, sled_id: 8c5a874c-52fc-400d-8496-42742d5fa3d7, sled_serial: "8c5a874c-52fc-400d-8496-42742d5fa3d7", sled_revision: 1, sled_model: "pheidippes" } }, state: Migrating }
line = 514
path = phd_tests::migrate::from_base::serial_history
source = migration_serial_history_base
source_id = 3da6354b-c1fe-4a9e-8ce3-cf9096e9f951
target = phd_framework::test_vm
target_id = afd9b655-5ba1-42ce-8b20-4a0432681045
vm = migration_serial_history_base_lifecycle_0
vm_id = afd9b655-5ba1-42ce-8b20-4a0432681045
|
| 87 | 2026-09-16T17:55:35.196Z | INFO | phd-runner: [MIGRATE - START]
file = phd-tests/framework/src/test_vm/mod.rs
line = 663
migration_id = 07a69e0c-4b8d-4ad1-a853-bf8303fcc20e
path = phd_tests::migrate::from_base::serial_history
source = migration_serial_history_base
source_id = 3da6354b-c1fe-4a9e-8ce3-cf9096e9f951
target = phd_framework::test_vm
target_id = afd9b655-5ba1-42ce-8b20-4a0432681045
|
| 88 | 2026-09-16T17:55:37.711Z | INFO | phd-runner: [SERIAL CONSOLE TASK - EVENT] serial socket control message
file = phd-tests/framework/src/serial/mod.rs
line = 275
s = {"Migrating":{"destination":"127.0.0.1:9002","from_start":7756}}
target = phd_framework::serial
|
| 89 | 2026-09-16T17:55:38.503Z | INFO | phd-runner: [MIGRATE_FROM - EVENT] Migration completed successfully
file = phd-tests/framework/src/test_vm/mod.rs
line = 676
path = phd_tests::migrate::from_base::serial_history
source = migration_serial_history_base
source_id = 3da6354b-c1fe-4a9e-8ce3-cf9096e9f951
target = phd_framework::test_vm
target_id = afd9b655-5ba1-42ce-8b20-4a0432681045
|
| 90 | 2026-09-16T17:55:38.503Z | INFO | phd-runner: [MIGRATE - END]
elapsed_milliseconds = 3307
file = phd-tests/framework/src/test_vm/mod.rs
line = 663
migration_id = 07a69e0c-4b8d-4ad1-a853-bf8303fcc20e
path = phd_tests::migrate::from_base::serial_history
source = migration_serial_history_base
source_id = 3da6354b-c1fe-4a9e-8ce3-cf9096e9f951
target = phd_framework::test_vm
target_id = afd9b655-5ba1-42ce-8b20-4a0432681045
|
| 91 | 2026-09-16T17:55:38.506Z | INFO | phd-runner: [VM CLEANUP - START]
file = phd-tests/framework/src/test_vm/mod.rs
line = 1172
path = phd_tests::migrate::from_base::serial_history
target = phd_framework::test_vm
vm = migration_serial_history_base
vm_id = 3da6354b-c1fe-4a9e-8ce3-cf9096e9f951
|
| 92 | 2026-09-16T17:55:38.510Z | DEBG | phd-runner: [VM CLEANUP - EVENT] Killing Propolis server process
file = phd-tests/framework/src/test_vm/server.rs
line = 177
path = phd_tests::migrate::from_base::serial_history
self.address = 127.0.0.1:9000
target = phd_framework::test_vm::server
vm = migration_serial_history_base
vm_id = 3da6354b-c1fe-4a9e-8ce3-cf9096e9f951
|
| 93 | 2026-09-16T17:55:38.585Z | INFO | phd-runner: [VM CLEANUP - END]
elapsed_milliseconds = 76
file = phd-tests/framework/src/test_vm/mod.rs
line = 1172
path = phd_tests::migrate::from_base::serial_history
target = phd_framework::test_vm
vm = migration_serial_history_base
vm_id = 3da6354b-c1fe-4a9e-8ce3-cf9096e9f951
|
| 94 | 2026-09-16T17:55:38.585Z | INFO | phd-runner: [INSTANCE_ENSURE_INTERNAL - END]
elapsed_milliseconds = 9561
file = phd-tests/framework/src/test_vm/mod.rs
line = 412
path = phd_tests::migrate::from_base::serial_history
target = phd_framework::test_vm
vm = migration_serial_history_base
vm_id = 3da6354b-c1fe-4a9e-8ce3-cf9096e9f951
|
| 95 | 2026-09-16T17:55:38.588Z | INFO | phd-runner: [VM CLEANUP - START]
file = phd-tests/framework/src/test_vm/mod.rs
line = 1172
path = phd_tests::migrate::from_base::serial_history
target = phd_framework::test_vm
vm = migration_serial_history_base_lifecycle_0
vm_id = afd9b655-5ba1-42ce-8b20-4a0432681045
|
| 96 | 2026-09-16T17:55:38.589Z | DEBG | phd-runner: [SERIAL CONSOLE TASK - EVENT] serial console command channel was closed
file = phd-tests/framework/src/serial/mod.rs
line = 213
target = phd_framework::serial
|
| 97 | 2026-09-16T17:55:38.590Z | INFO | phd-runner: [SERIAL CONSOLE TASK - END]
elapsed_milliseconds = 8932
file = phd-tests/framework/src/serial/mod.rs
line = 200
target = phd_framework::serial
|
| 98 | 2026-09-16T17:55:38.590Z | DEBG | phd-runner: [VM CLEANUP - EVENT] trying to ensure Propolis server VM is destroyed
file = phd-tests/framework/src/test_vm/mod.rs
line = 1195
path = phd_tests::migrate::from_base::serial_history
target = phd_framework::test_vm
vm = migration_serial_history_base_lifecycle_0
vm_id = afd9b655-5ba1-42ce-8b20-4a0432681045
|
| 99 | 2026-09-16T17:55:38.591Z | INFO | phd-runner: test phd_tests::migrate::from_base::serial_history ... ok
file = phd-tests/runner/src/execute.rs
line = 141
target = phd_runner::execute
|
| 100 | 2026-09-16T17:55:38.591Z | INFO | phd-runner: [TEST_CLEANUP - START]
file = phd-tests/runner/src/fixtures.rs
line = 51
target = phd_runner::fixtures
|
| 101 | 2026-09-16T17:55:39.295Z | DEBG | phd-runner: [VM CLEANUP - EVENT] Killing Propolis server process
file = phd-tests/framework/src/test_vm/server.rs
line = 177
path = phd_tests::migrate::from_base::serial_history
self.address = 127.0.0.1:9002
target = phd_framework::test_vm::server
vm = migration_serial_history_base_lifecycle_0
vm_id = afd9b655-5ba1-42ce-8b20-4a0432681045
|
| 102 | 2026-09-16T17:55:39.384Z | DEBG | phd-runner: [VM CLEANUP - EVENT] zfs clone dropped
file = phd-tests/framework/src/zfs.rs
line = 83
path = phd_tests::migrate::from_base::serial_history
target = phd_framework::zfs
vm = migration_serial_history_base_lifecycle_0
vm_id = afd9b655-5ba1-42ce-8b20-4a0432681045
|
| 103 | 2026-09-16T17:55:39.384Z | DEBG | phd-runner: [VM CLEANUP - EVENT] executing ZFS command
args = ["phd-artifacts/phd-clone-44a1da1c-521a-48a5-b8c6-38b624a28d57"]
file = phd-tests/framework/src/zfs.rs
line = 304
path = phd_tests::migrate::from_base::serial_history
target = phd_framework::zfs
verb = destroy
vm = migration_serial_history_base_lifecycle_0
vm_id = afd9b655-5ba1-42ce-8b20-4a0432681045
|
| 104 | 2026-09-16T17:55:39.416Z | DEBG | phd-runner: [VM CLEANUP - EVENT] zfs snapshot dropped
file = phd-tests/framework/src/zfs.rs
line = 57
path = phd_tests::migrate::from_base::serial_history
target = phd_framework::zfs
vm = migration_serial_history_base_lifecycle_0
vm_id = afd9b655-5ba1-42ce-8b20-4a0432681045
|
| 105 | 2026-09-16T17:55:39.416Z | DEBG | phd-runner: [VM CLEANUP - EVENT] executing ZFS command
args = ["phd-artifacts@phd-6a086a22-1150-419f-9893-5078ecee6cc4"]
file = phd-tests/framework/src/zfs.rs
line = 304
path = phd_tests::migrate::from_base::serial_history
target = phd_framework::zfs
verb = destroy
vm = migration_serial_history_base_lifecycle_0
vm_id = afd9b655-5ba1-42ce-8b20-4a0432681045
|
| 106 | 2026-09-16T17:55:39.434Z | INFO | phd-runner: [VM CLEANUP - END]
elapsed_milliseconds = 845
file = phd-tests/framework/src/test_vm/mod.rs
line = 1172
path = phd_tests::migrate::from_base::serial_history
target = phd_framework::test_vm
vm = migration_serial_history_base_lifecycle_0
vm_id = afd9b655-5ba1-42ce-8b20-4a0432681045
|
| 107 | 2026-09-16T17:55:39.434Z | INFO | phd-runner: [INSTANCE_ENSURE_INTERNAL - END]
elapsed_milliseconds = 4992
file = phd-tests/framework/src/test_vm/mod.rs
line = 412
path = phd_tests::migrate::from_base::serial_history
source = migration_serial_history_base
source_id = 3da6354b-c1fe-4a9e-8ce3-cf9096e9f951
target = phd_framework::test_vm
target_id = afd9b655-5ba1-42ce-8b20-4a0432681045
vm = migration_serial_history_base_lifecycle_0
vm_id = afd9b655-5ba1-42ce-8b20-4a0432681045
|
| 108 | 2026-09-16T17:55:39.434Z | INFO | phd-runner: [MIGRATE_FROM - END]
elapsed_milliseconds = 4993
file = phd-tests/framework/src/test_vm/mod.rs
line = 609
path = phd_tests::migrate::from_base::serial_history
source = migration_serial_history_base
source_id = 3da6354b-c1fe-4a9e-8ce3-cf9096e9f951
target = phd_framework::test_vm
target_id = afd9b655-5ba1-42ce-8b20-4a0432681045
|
| 109 | 2026-09-16T17:55:39.434Z | INFO | phd-runner: [TEST - END]
elapsed_milliseconds = 69374
file = phd-tests/tests/src/migrate.rs
line = 40
path = phd_tests::migrate::from_base::serial_history
target = phd_tests::migrate::from_base
|
| 110 | 2026-09-16T17:55:39.434Z | INFO | phd-runner: [TEST_CLEANUP - END]
elapsed_milliseconds = 843
file = phd-tests/runner/src/fixtures.rs
line = 51
target = phd_runner::fixtures
|
| 111 | 2026-09-16T17:55:39.435Z | INFO | phd-runner: Starting test phd_tests::migrate::from_base::can_migrate_from_base
file = phd-tests/runner/src/execute.rs
line = 91
target = phd_runner::execute
|
| 112 | 2026-09-16T17:55:39.435Z | INFO | phd-runner: [TEST_SETUP - START]
file = phd-tests/runner/src/fixtures.rs
line = 41
target = phd_runner::fixtures
|
| 113 | 2026-09-16T17:55:39.435Z | INFO | phd-runner: [TEST_SETUP - END]
elapsed_milliseconds = 0
file = phd-tests/runner/src/fixtures.rs
line = 41
target = phd_runner::fixtures
|
| 114 | 2026-09-16T17:55:39.435Z | INFO | phd-runner: [TEST - START]
file = phd-tests/tests/src/migrate.rs
line = 34
path = phd_tests::migrate::from_base::can_migrate_from_base
target = phd_tests::migrate::from_base
|
| 115 | 2026-09-16T17:55:39.435Z | DEBG | phd-runner: [TEST - EVENT] Verified artifact already exists
file = phd-tests/framework/src/artifacts/store.rs
line = 45
path = /phd-artifacts/740187046a7267d0de72d3455070333547dbc0ea023531471fb2b2a61effa448/OVMF_CODE.fd
target = phd_framework::artifacts::store
|
| 116 | 2026-09-16T17:55:39.435Z | DEBG | phd-runner: [TEST - EVENT] Verified artifact already exists
file = phd-tests/framework/src/artifacts/store.rs
line = 45
path = /phd-artifacts/ba8007f74f9b54fbae3b2520da577831b4834778a498d732f091260c61aa7ca1/alpine.iso
target = phd_framework::artifacts::store
|
| 117 | 2026-09-16T17:55:39.435Z | DEBG | phd-runner: [TEST - EVENT] Verified artifact already exists
file = phd-tests/framework/src/artifacts/store.rs
line = 45
path = /phd-artifacts/ba8007f74f9b54fbae3b2520da577831b4834778a498d732f091260c61aa7ca1/alpine.iso
target = phd_framework::artifacts::store
|
| 118 | 2026-09-16T17:55:39.435Z | DEBG | phd-runner: [TEST - EVENT] executing ZFS command
args = ["/phd-artifacts/ba8007f74f9b54fbae3b2520da577831b4834778a498d732f091260c61aa7ca1/alpine.iso"]
file = phd-tests/framework/src/zfs.rs
line = 304
path = phd_tests::migrate::from_base::can_migrate_from_base
target = phd_framework::zfs
verb = list
|
| 119 | 2026-09-16T17:55:39.446Z | DEBG | phd-runner: [TEST - EVENT] parsing zfs list output
file = phd-tests/framework/src/zfs.rs
line = 238
path = phd_tests::migrate::from_base::can_migrate_from_base
stdout = NAME USED AVAIL REFER MOUNTPOINT\nphd-artifacts 1.30G 25.3T 1.30G /phd-artifacts\n
target = phd_framework::zfs
|
| 120 | 2026-09-16T17:55:39.447Z | DEBG | phd-runner: [TEST - EVENT] executing ZFS command
args = ["phd-artifacts@phd-82fed69a-60d1-43c6-a99f-eac92ae96367"]
file = phd-tests/framework/src/zfs.rs
line = 304
path = phd_tests::migrate::from_base::can_migrate_from_base
target = phd_framework::zfs
verb = snapshot
|
| 121 | 2026-09-16T17:55:39.464Z | DEBG | phd-runner: [TEST - EVENT] executing ZFS command
args = ["phd-artifacts@phd-82fed69a-60d1-43c6-a99f-eac92ae96367", "phd-artifacts/phd-clone-a58e8d36-7c42-46ea-8fb2-b116a475be4c"]
file = phd-tests/framework/src/zfs.rs
line = 304
path = phd_tests::migrate::from_base::can_migrate_from_base
target = phd_framework::zfs
verb = clone
|
| 122 | 2026-09-16T17:55:39.482Z | DEBG | phd-runner: [TEST - EVENT] executing ZFS command
args = ["phd-artifacts/phd-clone-a58e8d36-7c42-46ea-8fb2-b116a475be4c"]
file = phd-tests/framework/src/zfs.rs
line = 304
path = phd_tests::migrate::from_base::can_migrate_from_base
target = phd_framework::zfs
verb = list
|
| 123 | 2026-09-16T17:55:39.493Z | DEBG | phd-runner: [TEST - EVENT] parsing zfs list output
file = phd-tests/framework/src/zfs.rs
line = 238
path = phd_tests::migrate::from_base::can_migrate_from_base
stdout = NAME USED AVAIL REFER MOUNTPOINT\nphd-artifacts/phd-clone-a58e8d36-7c42-46ea-8fb2-b116a475be4c 0B 25.3T 1.30G /phd-artifacts/phd-clone-a58e8d36-7c42-46ea-8fb2-b116a475be4c\n
target = phd_framework::zfs
|
| 124 | 2026-09-16T17:55:39.494Z | INFO | phd-runner: [NEW - START]
file = phd-tests/framework/src/test_vm/mod.rs
line = 300
path = phd_tests::migrate::from_base::can_migrate_from_base
target = phd_framework::test_vm
|
| 125 | 2026-09-16T17:55:39.494Z | INFO | phd-runner: [NEW - EVENT] phd_framework::test_vm
environment = EnvironmentSpec { location: Local, propolis_artifact: "__BASE_PROPOLIS", metrics: None }
file = phd-tests/framework/src/test_vm/mod.rs
guest_os_kind = Alpine
line = 318
path = phd_tests::migrate::from_base::can_migrate_from_base
target = phd_framework::test_vm
vm_name = migration_from_base
|
| 126 | 2026-09-16T17:55:39.494Z | DEBG | phd-runner: [NEW - EVENT] Verified artifact already exists
file = phd-tests/framework/src/artifacts/store.rs
line = 45
path = /phd-artifacts/9ae9fafe7388ed9e46be3e2216caab7a75f3f243a766be6e0a4a4eef637cce0c/propolis-server
target = phd_framework::artifacts::store
|
| 127 | 2026-09-16T17:55:39.494Z | INFO | phd-runner: [NEW - EVENT] Launching Propolis server
bootrom_path = "/phd-artifacts/740187046a7267d0de72d3455070333547dbc0ea023531471fb2b2a61effa448/OVMF_CODE.fd"
file = phd-tests/framework/src/test_vm/server.rs
line = 66
path = phd_tests::migrate::from_base::can_migrate_from_base
server_addr = 127.0.0.1:9000
server_path = "/phd-artifacts/9ae9fafe7388ed9e46be3e2216caab7a75f3f243a766be6e0a4a4eef637cce0c/propolis-server"
target = phd_framework::test_vm::server
|
| 128 | 2026-09-16T17:55:39.494Z | INFO | phd-runner: [NEW - EVENT] Opening server log files
file = phd-tests/framework/src/log_config.rs
line = 84
path = phd_tests::migrate::from_base::can_migrate_from_base
stderr_path = "/tmp/propolis-phd/phd_tests::migrate::from_base::can_migrate_from_base/migration_from_base.stderr.log"
stdout_path = "/tmp/propolis-phd/phd_tests::migrate::from_base::can_migrate_from_base/migration_from_base.stdout.log"
target = phd_framework::log_config
|
| 129 | 2026-09-16T17:55:39.536Z | INFO | phd-runner: [NEW - EVENT] Launched server with pid 927
file = phd-tests/framework/src/test_vm/server.rs
line = 127
path = phd_tests::migrate::from_base::can_migrate_from_base
target = phd_framework::test_vm::server
|
| 130 | 2026-09-16T17:55:39.550Z | INFO | phd-runner: [NEW - END]
elapsed_milliseconds = 56
file = phd-tests/framework/src/test_vm/mod.rs
line = 300
path = phd_tests::migrate::from_base::can_migrate_from_base
target = phd_framework::test_vm
|
| 131 | 2026-09-16T17:55:39.550Z | INFO | phd-runner: [INSTANCE_ENSURE_INTERNAL - START]
file = phd-tests/framework/src/test_vm/mod.rs
line = 412
path = phd_tests::migrate::from_base::can_migrate_from_base
target = phd_framework::test_vm
vm = migration_from_base
vm_id = 1bdbe88c-3daf-44c4-ac10-65f68539700e
|
| 132 | 2026-09-16T17:55:39.551Z | INFO | phd-runner: [INSTANCE_ENSURE_INTERNAL - EVENT] retriable error from instance_spec_ensure
e = Communication Error: error sending request for url (http://127.0.0.1:9000/instance)
file = phd-tests/framework/src/test_vm/mod.rs
line = 455
path = phd_tests::migrate::from_base::can_migrate_from_base
target = phd_framework::test_vm
vm = migration_from_base
vm_id = 1bdbe88c-3daf-44c4-ac10-65f68539700e
|
| 133 | 2026-09-16T17:55:40.040Z | INFO | phd-runner: [SERIAL CONSOLE TASK - START]
file = phd-tests/framework/src/serial/mod.rs
line = 200
target = phd_framework::serial
|
| 134 | 2026-09-16T17:55:40.042Z | INFO | phd-runner: [INSTANCE_ENSURE_INTERNAL - EVENT] Started instance
file = phd-tests/framework/src/test_vm/mod.rs
instance_description.instance = Instance { properties: InstanceProperties { id: 1bdbe88c-3daf-44c4-ac10-65f68539700e, name: "phd-vm-1bdbe88c-3daf-44c4-ac10-65f68539700e", description: "Pheidippides-managed VM", metadata: InstanceMetadata { silo_id: 892ee8d5-8981-4d82-9534-f65eab54ef15, project_id: 4c73b6bd-6183-472a-8461-0e4aba31df23, sled_id: 295d2cf9-ff0c-4140-9d10-90502eca42b4, sled_serial: "295d2cf9-ff0c-4140-9d10-90502eca42b4", sled_revision: 1, sled_model: "pheidippes" } }, state: Creating }
line = 514
path = phd_tests::migrate::from_base::can_migrate_from_base
target = phd_framework::test_vm
vm = migration_from_base
vm_id = 1bdbe88c-3daf-44c4-ac10-65f68539700e
|
| 135 | 2026-09-16T17:55:40.042Z | INFO | phd-runner: [PUT_INSTANCE_STATE - START]
file = phd-tests/framework/src/test_vm/mod.rs
line = 575
path = phd_tests::migrate::from_base::can_migrate_from_base
target = phd_framework::test_vm
vm = migration_from_base
vm_id = 1bdbe88c-3daf-44c4-ac10-65f68539700e
|
| 136 | 2026-09-16T17:55:40.042Z | INFO | phd-runner: [PUT_INSTANCE_STATE - EVENT] Requesting instance state change
file = phd-tests/framework/src/test_vm/mod.rs
line = 580
path = phd_tests::migrate::from_base::can_migrate_from_base
state = Run
target = phd_framework::test_vm
vm = migration_from_base
vm_id = 1bdbe88c-3daf-44c4-ac10-65f68539700e
|
| 137 | 2026-09-16T17:55:40.043Z | INFO | phd-runner: [PUT_INSTANCE_STATE - END]
elapsed_milliseconds = 1
file = phd-tests/framework/src/test_vm/mod.rs
line = 575
path = phd_tests::migrate::from_base::can_migrate_from_base
target = phd_framework::test_vm
vm = migration_from_base
vm_id = 1bdbe88c-3daf-44c4-ac10-65f68539700e
|
| 138 | 2026-09-16T17:55:40.043Z | INFO | phd-runner: [WAIT_TO_BOOT - START]
file = phd-tests/framework/src/test_vm/mod.rs
line = 890
path = phd_tests::migrate::from_base::can_migrate_from_base
target = phd_framework::test_vm
|
| 139 | 2026-09-16T17:55:40.043Z | INFO | phd-runner: [WAIT_TO_BOOT - EVENT] waiting for guest to boot
file = phd-tests/framework/src/test_vm/mod.rs
line = 839
path = phd_tests::migrate::from_base::can_migrate_from_base
target = phd_framework::test_vm
timeout_duration = 300s
vm = migration_from_base
vm_id = 1bdbe88c-3daf-44c4-ac10-65f68539700e
|
| 140 | 2026-09-16T17:55:40.043Z | DEBG | phd-runner: [WAIT_TO_BOOT - EVENT] executing command in boot sequence
file = phd-tests/framework/src/test_vm/mod.rs
line = 847
path = phd_tests::migrate::from_base::can_migrate_from_base
step = WaitFor("localhost login: ")
target = phd_framework::test_vm
|
| 141 | 2026-09-16T17:55:40.043Z | INFO | phd-runner: [WAIT_FOR_SERIAL_OUTPUT - START]
file = phd-tests/framework/src/test_vm/mod.rs
line = 913
path = phd_tests::migrate::from_base::can_migrate_from_base
target = phd_framework::test_vm
vm = migration_from_base
vm_id = 1bdbe88c-3daf-44c4-ac10-65f68539700e
|
| 142 | 2026-09-16T17:55:40.043Z | INFO | phd-runner: [WAIT_FOR_SERIAL_OUTPUT - EVENT] Waiting for output on serial console
file = phd-tests/framework/src/test_vm/mod.rs
line = 920
path = phd_tests::migrate::from_base::can_migrate_from_base
target = phd_framework::test_vm
timeout_duration = CallerTimeout
vm = migration_from_base
vm_id = 1bdbe88c-3daf-44c4-ac10-65f68539700e
|
| 143 | 2026-09-16T17:55:44.660Z | INFO | phd-runner: [WAIT_FOR_SERIAL_OUTPUT - END]
elapsed_milliseconds = 4617
file = phd-tests/framework/src/test_vm/mod.rs
line = 913
path = phd_tests::migrate::from_base::can_migrate_from_base
target = phd_framework::test_vm
vm = migration_from_base
vm_id = 1bdbe88c-3daf-44c4-ac10-65f68539700e
|
| 144 | 2026-09-16T17:55:44.660Z | DEBG | phd-runner: [WAIT_TO_BOOT - EVENT] executing command in boot sequence
file = phd-tests/framework/src/test_vm/mod.rs
line = 847
path = phd_tests::migrate::from_base::can_migrate_from_base
step = WriteStr("root")
target = phd_framework::test_vm
|
| 145 | 2026-09-16T17:55:44.661Z | DEBG | phd-runner: [WAIT_TO_BOOT - EVENT] executing command in boot sequence
file = phd-tests/framework/src/test_vm/mod.rs
line = 847
path = phd_tests::migrate::from_base::can_migrate_from_base
step = WaitFor("localhost:~#")
target = phd_framework::test_vm
|
| 146 | 2026-09-16T17:55:44.661Z | INFO | phd-runner: [WAIT_FOR_SERIAL_OUTPUT - START]
file = phd-tests/framework/src/test_vm/mod.rs
line = 913
path = phd_tests::migrate::from_base::can_migrate_from_base
target = phd_framework::test_vm
vm = migration_from_base
vm_id = 1bdbe88c-3daf-44c4-ac10-65f68539700e
|
| 147 | 2026-09-16T17:55:44.661Z | INFO | phd-runner: [WAIT_FOR_SERIAL_OUTPUT - EVENT] Waiting for output on serial console
file = phd-tests/framework/src/test_vm/mod.rs
line = 920
path = phd_tests::migrate::from_base::can_migrate_from_base
target = phd_framework::test_vm
timeout_duration = CallerTimeout
vm = migration_from_base
vm_id = 1bdbe88c-3daf-44c4-ac10-65f68539700e
|
| 148 | 2026-09-16T17:55:44.679Z | INFO | phd-runner: [WAIT_FOR_SERIAL_OUTPUT - END]
elapsed_milliseconds = 18
file = phd-tests/framework/src/test_vm/mod.rs
line = 913
path = phd_tests::migrate::from_base::can_migrate_from_base
target = phd_framework::test_vm
vm = migration_from_base
vm_id = 1bdbe88c-3daf-44c4-ac10-65f68539700e
|
| 149 | 2026-09-16T17:55:44.679Z | DEBG | phd-runner: [WAIT_TO_BOOT - EVENT] executing command in boot sequence
file = phd-tests/framework/src/test_vm/mod.rs
line = 847
path = phd_tests::migrate::from_base::can_migrate_from_base
step = WriteStr("stty -F `tty` cols 9999")
target = phd_framework::test_vm
|
| 150 | 2026-09-16T17:55:44.679Z | DEBG | phd-runner: [WAIT_TO_BOOT - EVENT] executing command in boot sequence
file = phd-tests/framework/src/test_vm/mod.rs
line = 847
path = phd_tests::migrate::from_base::can_migrate_from_base
step = WaitFor("localhost:~#")
target = phd_framework::test_vm
|
| 151 | 2026-09-16T17:55:44.679Z | INFO | phd-runner: [WAIT_FOR_SERIAL_OUTPUT - START]
file = phd-tests/framework/src/test_vm/mod.rs
line = 913
path = phd_tests::migrate::from_base::can_migrate_from_base
target = phd_framework::test_vm
vm = migration_from_base
vm_id = 1bdbe88c-3daf-44c4-ac10-65f68539700e
|
| 152 | 2026-09-16T17:55:44.679Z | INFO | phd-runner: [WAIT_FOR_SERIAL_OUTPUT - EVENT] Waiting for output on serial console
file = phd-tests/framework/src/test_vm/mod.rs
line = 920
path = phd_tests::migrate::from_base::can_migrate_from_base
target = phd_framework::test_vm
timeout_duration = CallerTimeout
vm = migration_from_base
vm_id = 1bdbe88c-3daf-44c4-ac10-65f68539700e
|
| 153 | 2026-09-16T17:55:44.712Z | INFO | phd-runner: [WAIT_FOR_SERIAL_OUTPUT - END]
elapsed_milliseconds = 33
file = phd-tests/framework/src/test_vm/mod.rs
line = 913
path = phd_tests::migrate::from_base::can_migrate_from_base
target = phd_framework::test_vm
vm = migration_from_base
vm_id = 1bdbe88c-3daf-44c4-ac10-65f68539700e
|
| 154 | 2026-09-16T17:55:44.712Z | INFO | phd-runner: [WAIT_TO_BOOT - EVENT] Guest has booted
file = phd-tests/framework/src/test_vm/mod.rs
line = 887
path = phd_tests::migrate::from_base::can_migrate_from_base
target = phd_framework::test_vm
|
| 155 | 2026-09-16T17:55:44.713Z | INFO | phd-runner: [WAIT_TO_BOOT - END]
elapsed_milliseconds = 4669
file = phd-tests/framework/src/test_vm/mod.rs
line = 890
path = phd_tests::migrate::from_base::can_migrate_from_base
target = phd_framework::test_vm
|
| 156 | 2026-09-16T17:55:44.713Z | INFO | phd-runner: [WAIT_FOR_SERIAL_OUTPUT - START]
file = phd-tests/framework/src/test_vm/mod.rs
line = 913
path = phd_tests::migrate::from_base::can_migrate_from_base
target = phd_framework::test_vm
vm = migration_from_base
vm_id = 1bdbe88c-3daf-44c4-ac10-65f68539700e
|
| 157 | 2026-09-16T17:55:44.713Z | INFO | phd-runner: [WAIT_FOR_SERIAL_OUTPUT - EVENT] Waiting for output on serial console
file = phd-tests/framework/src/test_vm/mod.rs
line = 920
path = phd_tests::migrate::from_base::can_migrate_from_base
target = phd_framework::test_vm
timeout_duration = Explicit(15s)
vm = migration_from_base
vm_id = 1bdbe88c-3daf-44c4-ac10-65f68539700e
|
| 158 | 2026-09-16T17:55:44.723Z | INFO | phd-runner: [WAIT_FOR_SERIAL_OUTPUT - END]
elapsed_milliseconds = 9
file = phd-tests/framework/src/test_vm/mod.rs
line = 913
path = phd_tests::migrate::from_base::can_migrate_from_base
target = phd_framework::test_vm
vm = migration_from_base
vm_id = 1bdbe88c-3daf-44c4-ac10-65f68539700e
|
| 159 | 2026-09-16T17:55:44.723Z | INFO | phd-runner: [WAIT_FOR_SERIAL_OUTPUT - START]
file = phd-tests/framework/src/test_vm/mod.rs
line = 913
path = phd_tests::migrate::from_base::can_migrate_from_base
target = phd_framework::test_vm
vm = migration_from_base
vm_id = 1bdbe88c-3daf-44c4-ac10-65f68539700e
|
| 160 | 2026-09-16T17:55:44.723Z | INFO | phd-runner: [WAIT_FOR_SERIAL_OUTPUT - EVENT] Waiting for output on serial console
file = phd-tests/framework/src/test_vm/mod.rs
line = 920
path = phd_tests::migrate::from_base::can_migrate_from_base
target = phd_framework::test_vm
timeout_duration = Explicit(300s)
vm = migration_from_base
vm_id = 1bdbe88c-3daf-44c4-ac10-65f68539700e
|
| 161 | 2026-09-16T17:55:44.756Z | INFO | phd-runner: [WAIT_FOR_SERIAL_OUTPUT - END]
elapsed_milliseconds = 32
file = phd-tests/framework/src/test_vm/mod.rs
line = 913
path = phd_tests::migrate::from_base::can_migrate_from_base
target = phd_framework::test_vm
vm = migration_from_base
vm_id = 1bdbe88c-3daf-44c4-ac10-65f68539700e
|
| 162 | 2026-09-16T17:55:44.757Z | INFO | phd-runner: [WAIT_FOR_SERIAL_OUTPUT - START]
file = phd-tests/framework/src/test_vm/mod.rs
line = 913
path = phd_tests::migrate::from_base::can_migrate_from_base
target = phd_framework::test_vm
vm = migration_from_base
vm_id = 1bdbe88c-3daf-44c4-ac10-65f68539700e
|
| 163 | 2026-09-16T17:55:44.757Z | INFO | phd-runner: [WAIT_FOR_SERIAL_OUTPUT - EVENT] Waiting for output on serial console
file = phd-tests/framework/src/test_vm/mod.rs
line = 920
path = phd_tests::migrate::from_base::can_migrate_from_base
target = phd_framework::test_vm
timeout_duration = Explicit(15s)
vm = migration_from_base
vm_id = 1bdbe88c-3daf-44c4-ac10-65f68539700e
|
| 164 | 2026-09-16T17:55:44.767Z | INFO | phd-runner: [WAIT_FOR_SERIAL_OUTPUT - END]
elapsed_milliseconds = 10
file = phd-tests/framework/src/test_vm/mod.rs
line = 913
path = phd_tests::migrate::from_base::can_migrate_from_base
target = phd_framework::test_vm
vm = migration_from_base
vm_id = 1bdbe88c-3daf-44c4-ac10-65f68539700e
|
| 165 | 2026-09-16T17:55:44.767Z | INFO | phd-runner: [WAIT_FOR_SERIAL_OUTPUT - START]
file = phd-tests/framework/src/test_vm/mod.rs
line = 913
path = phd_tests::migrate::from_base::can_migrate_from_base
target = phd_framework::test_vm
vm = migration_from_base
vm_id = 1bdbe88c-3daf-44c4-ac10-65f68539700e
|
| 166 | 2026-09-16T17:55:44.768Z | INFO | phd-runner: [WAIT_FOR_SERIAL_OUTPUT - EVENT] Waiting for output on serial console
file = phd-tests/framework/src/test_vm/mod.rs
line = 920
path = phd_tests::migrate::from_base::can_migrate_from_base
target = phd_framework::test_vm
timeout_duration = Explicit(300s)
vm = migration_from_base
vm_id = 1bdbe88c-3daf-44c4-ac10-65f68539700e
|
| 167 | 2026-09-16T17:55:44.800Z | INFO | phd-runner: [WAIT_FOR_SERIAL_OUTPUT - END]
elapsed_milliseconds = 32
file = phd-tests/framework/src/test_vm/mod.rs
line = 913
path = phd_tests::migrate::from_base::can_migrate_from_base
target = phd_framework::test_vm
vm = migration_from_base
vm_id = 1bdbe88c-3daf-44c4-ac10-65f68539700e
|
| 168 | 2026-09-16T17:55:44.801Z | INFO | phd-runner: [WAIT_FOR_SERIAL_OUTPUT - START]
file = phd-tests/framework/src/test_vm/mod.rs
line = 913
path = phd_tests::migrate::from_base::can_migrate_from_base
target = phd_framework::test_vm
vm = migration_from_base
vm_id = 1bdbe88c-3daf-44c4-ac10-65f68539700e
|
| 169 | 2026-09-16T17:55:44.801Z | INFO | phd-runner: [WAIT_FOR_SERIAL_OUTPUT - EVENT] Waiting for output on serial console
file = phd-tests/framework/src/test_vm/mod.rs
line = 920
path = phd_tests::migrate::from_base::can_migrate_from_base
target = phd_framework::test_vm
timeout_duration = Explicit(15s)
vm = migration_from_base
vm_id = 1bdbe88c-3daf-44c4-ac10-65f68539700e
|
| 170 | 2026-09-16T17:55:44.811Z | INFO | phd-runner: [WAIT_FOR_SERIAL_OUTPUT - END]
elapsed_milliseconds = 10
file = phd-tests/framework/src/test_vm/mod.rs
line = 913
path = phd_tests::migrate::from_base::can_migrate_from_base
target = phd_framework::test_vm
vm = migration_from_base
vm_id = 1bdbe88c-3daf-44c4-ac10-65f68539700e
|
| 171 | 2026-09-16T17:55:44.812Z | INFO | phd-runner: [WAIT_FOR_SERIAL_OUTPUT - START]
file = phd-tests/framework/src/test_vm/mod.rs
line = 913
path = phd_tests::migrate::from_base::can_migrate_from_base
target = phd_framework::test_vm
vm = migration_from_base
vm_id = 1bdbe88c-3daf-44c4-ac10-65f68539700e
|
| 172 | 2026-09-16T17:55:44.812Z | INFO | phd-runner: [WAIT_FOR_SERIAL_OUTPUT - EVENT] Waiting for output on serial console
file = phd-tests/framework/src/test_vm/mod.rs
line = 920
path = phd_tests::migrate::from_base::can_migrate_from_base
target = phd_framework::test_vm
timeout_duration = Explicit(300s)
vm = migration_from_base
vm_id = 1bdbe88c-3daf-44c4-ac10-65f68539700e
|
| 173 | 2026-09-16T17:55:44.845Z | INFO | phd-runner: [WAIT_FOR_SERIAL_OUTPUT - END]
elapsed_milliseconds = 32
file = phd-tests/framework/src/test_vm/mod.rs
line = 913
path = phd_tests::migrate::from_base::can_migrate_from_base
target = phd_framework::test_vm
vm = migration_from_base
vm_id = 1bdbe88c-3daf-44c4-ac10-65f68539700e
|
| 174 | 2026-09-16T17:55:44.845Z | INFO | phd-runner: [WAIT_FOR_SERIAL_OUTPUT - START]
file = phd-tests/framework/src/test_vm/mod.rs
line = 913
path = phd_tests::migrate::from_base::can_migrate_from_base
target = phd_framework::test_vm
vm = migration_from_base
vm_id = 1bdbe88c-3daf-44c4-ac10-65f68539700e
|
| 175 | 2026-09-16T17:55:44.845Z | INFO | phd-runner: [WAIT_FOR_SERIAL_OUTPUT - EVENT] Waiting for output on serial console
file = phd-tests/framework/src/test_vm/mod.rs
line = 920
path = phd_tests::migrate::from_base::can_migrate_from_base
target = phd_framework::test_vm
timeout_duration = Explicit(15s)
vm = migration_from_base
vm_id = 1bdbe88c-3daf-44c4-ac10-65f68539700e
|
| 176 | 2026-09-16T17:55:44.857Z | INFO | phd-runner: [WAIT_FOR_SERIAL_OUTPUT - END]
elapsed_milliseconds = 11
file = phd-tests/framework/src/test_vm/mod.rs
line = 913
path = phd_tests::migrate::from_base::can_migrate_from_base
target = phd_framework::test_vm
vm = migration_from_base
vm_id = 1bdbe88c-3daf-44c4-ac10-65f68539700e
|
| 177 | 2026-09-16T17:55:44.857Z | INFO | phd-runner: [WAIT_FOR_SERIAL_OUTPUT - START]
file = phd-tests/framework/src/test_vm/mod.rs
line = 913
path = phd_tests::migrate::from_base::can_migrate_from_base
target = phd_framework::test_vm
vm = migration_from_base
vm_id = 1bdbe88c-3daf-44c4-ac10-65f68539700e
|
| 178 | 2026-09-16T17:55:44.857Z | INFO | phd-runner: [WAIT_FOR_SERIAL_OUTPUT - EVENT] Waiting for output on serial console
file = phd-tests/framework/src/test_vm/mod.rs
line = 920
path = phd_tests::migrate::from_base::can_migrate_from_base
target = phd_framework::test_vm
timeout_duration = Explicit(300s)
vm = migration_from_base
vm_id = 1bdbe88c-3daf-44c4-ac10-65f68539700e
|
| 179 | 2026-09-16T17:55:44.890Z | INFO | phd-runner: [WAIT_FOR_SERIAL_OUTPUT - END]
elapsed_milliseconds = 32
file = phd-tests/framework/src/test_vm/mod.rs
line = 913
path = phd_tests::migrate::from_base::can_migrate_from_base
target = phd_framework::test_vm
vm = migration_from_base
vm_id = 1bdbe88c-3daf-44c4-ac10-65f68539700e
|
| 180 | 2026-09-16T17:55:44.890Z | INFO | phd-runner: [WAIT_FOR_SERIAL_OUTPUT - START]
file = phd-tests/framework/src/test_vm/mod.rs
line = 913
path = phd_tests::migrate::from_base::can_migrate_from_base
target = phd_framework::test_vm
vm = migration_from_base
vm_id = 1bdbe88c-3daf-44c4-ac10-65f68539700e
|
| 181 | 2026-09-16T17:55:44.890Z | INFO | phd-runner: [WAIT_FOR_SERIAL_OUTPUT - EVENT] Waiting for output on serial console
file = phd-tests/framework/src/test_vm/mod.rs
line = 920
path = phd_tests::migrate::from_base::can_migrate_from_base
target = phd_framework::test_vm
timeout_duration = Explicit(15s)
vm = migration_from_base
vm_id = 1bdbe88c-3daf-44c4-ac10-65f68539700e
|
| 182 | 2026-09-16T17:55:44.901Z | INFO | phd-runner: [WAIT_FOR_SERIAL_OUTPUT - END]
elapsed_milliseconds = 10
file = phd-tests/framework/src/test_vm/mod.rs
line = 913
path = phd_tests::migrate::from_base::can_migrate_from_base
target = phd_framework::test_vm
vm = migration_from_base
vm_id = 1bdbe88c-3daf-44c4-ac10-65f68539700e
|
| 183 | 2026-09-16T17:55:44.901Z | INFO | phd-runner: [WAIT_FOR_SERIAL_OUTPUT - START]
file = phd-tests/framework/src/test_vm/mod.rs
line = 913
path = phd_tests::migrate::from_base::can_migrate_from_base
target = phd_framework::test_vm
vm = migration_from_base
vm_id = 1bdbe88c-3daf-44c4-ac10-65f68539700e
|
| 184 | 2026-09-16T17:55:44.901Z | INFO | phd-runner: [WAIT_FOR_SERIAL_OUTPUT - EVENT] Waiting for output on serial console
file = phd-tests/framework/src/test_vm/mod.rs
line = 920
path = phd_tests::migrate::from_base::can_migrate_from_base
target = phd_framework::test_vm
timeout_duration = Explicit(300s)
vm = migration_from_base
vm_id = 1bdbe88c-3daf-44c4-ac10-65f68539700e
|
| 185 | 2026-09-16T17:55:44.934Z | INFO | phd-runner: [WAIT_FOR_SERIAL_OUTPUT - END]
elapsed_milliseconds = 32
file = phd-tests/framework/src/test_vm/mod.rs
line = 913
path = phd_tests::migrate::from_base::can_migrate_from_base
target = phd_framework::test_vm
vm = migration_from_base
vm_id = 1bdbe88c-3daf-44c4-ac10-65f68539700e
|
| 186 | 2026-09-16T17:55:44.935Z | INFO | phd-runner: [WAIT_FOR_SERIAL_OUTPUT - START]
file = phd-tests/framework/src/test_vm/mod.rs
line = 913
path = phd_tests::migrate::from_base::can_migrate_from_base
target = phd_framework::test_vm
vm = migration_from_base
vm_id = 1bdbe88c-3daf-44c4-ac10-65f68539700e
|
| 187 | 2026-09-16T17:55:44.936Z | INFO | phd-runner: [WAIT_FOR_SERIAL_OUTPUT - EVENT] Waiting for output on serial console
file = phd-tests/framework/src/test_vm/mod.rs
line = 920
path = phd_tests::migrate::from_base::can_migrate_from_base
target = phd_framework::test_vm
timeout_duration = Explicit(15s)
vm = migration_from_base
vm_id = 1bdbe88c-3daf-44c4-ac10-65f68539700e
|
| 188 | 2026-09-16T17:55:44.945Z | INFO | phd-runner: [WAIT_FOR_SERIAL_OUTPUT - END]
elapsed_milliseconds = 9
file = phd-tests/framework/src/test_vm/mod.rs
line = 913
path = phd_tests::migrate::from_base::can_migrate_from_base
target = phd_framework::test_vm
vm = migration_from_base
vm_id = 1bdbe88c-3daf-44c4-ac10-65f68539700e
|
| 189 | 2026-09-16T17:55:44.945Z | INFO | phd-runner: [WAIT_FOR_SERIAL_OUTPUT - START]
file = phd-tests/framework/src/test_vm/mod.rs
line = 913
path = phd_tests::migrate::from_base::can_migrate_from_base
target = phd_framework::test_vm
vm = migration_from_base
vm_id = 1bdbe88c-3daf-44c4-ac10-65f68539700e
|
| 190 | 2026-09-16T17:55:44.945Z | INFO | phd-runner: [WAIT_FOR_SERIAL_OUTPUT - EVENT] Waiting for output on serial console
file = phd-tests/framework/src/test_vm/mod.rs
line = 920
path = phd_tests::migrate::from_base::can_migrate_from_base
target = phd_framework::test_vm
timeout_duration = Explicit(300s)
vm = migration_from_base
vm_id = 1bdbe88c-3daf-44c4-ac10-65f68539700e
|
| 191 | 2026-09-16T17:55:44.979Z | INFO | phd-runner: [WAIT_FOR_SERIAL_OUTPUT - END]
elapsed_milliseconds = 33
file = phd-tests/framework/src/test_vm/mod.rs
line = 913
path = phd_tests::migrate::from_base::can_migrate_from_base
target = phd_framework::test_vm
vm = migration_from_base
vm_id = 1bdbe88c-3daf-44c4-ac10-65f68539700e
|
| 192 | 2026-09-16T17:55:44.979Z | INFO | phd-runner: [TEST - EVENT] migrating to new Propolis artifact for lifecycle test
file = phd-tests/framework/src/lifecycle.rs
line = 73
path = phd_tests::migrate::from_base::can_migrate_from_base
propolis_artifact = __DEFAULT_PROPOLIS
target = phd_framework::lifecycle
vm_name = migration_from_base
|
| 193 | 2026-09-16T17:55:44.979Z | INFO | phd-runner: [NEW - START]
file = phd-tests/framework/src/test_vm/mod.rs
line = 300
path = phd_tests::migrate::from_base::can_migrate_from_base
target = phd_framework::test_vm
|
| 194 | 2026-09-16T17:55:44.980Z | INFO | phd-runner: [NEW - EVENT] phd_framework::test_vm
environment = EnvironmentSpec { location: Local, propolis_artifact: "__DEFAULT_PROPOLIS", metrics: None }
file = phd-tests/framework/src/test_vm/mod.rs
guest_os_kind = Alpine
line = 318
path = phd_tests::migrate::from_base::can_migrate_from_base
target = phd_framework::test_vm
vm_name = migration_from_base_lifecycle_0
|
| 195 | 2026-09-16T17:55:44.980Z | DEBG | phd-runner: [NEW - EVENT] Verified artifact already exists
file = phd-tests/framework/src/artifacts/store.rs
line = 45
path = /work/phd-test/propolis-server
target = phd_framework::artifacts::store
|
| 196 | 2026-09-16T17:55:44.980Z | INFO | phd-runner: [NEW - EVENT] Launching Propolis server
bootrom_path = "/phd-artifacts/740187046a7267d0de72d3455070333547dbc0ea023531471fb2b2a61effa448/OVMF_CODE.fd"
file = phd-tests/framework/src/test_vm/server.rs
line = 66
path = phd_tests::migrate::from_base::can_migrate_from_base
server_addr = 127.0.0.1:9002
server_path = "/work/phd-test/propolis-server"
target = phd_framework::test_vm::server
|
| 197 | 2026-09-16T17:55:44.980Z | INFO | phd-runner: [NEW - EVENT] Opening server log files
file = phd-tests/framework/src/log_config.rs
line = 84
path = phd_tests::migrate::from_base::can_migrate_from_base
stderr_path = "/tmp/propolis-phd/phd_tests::migrate::from_base::can_migrate_from_base/migration_from_base_lifecycle_0.stderr.log"
stdout_path = "/tmp/propolis-phd/phd_tests::migrate::from_base::can_migrate_from_base/migration_from_base_lifecycle_0.stdout.log"
target = phd_framework::log_config
|
| 198 | 2026-09-16T17:55:45.020Z | INFO | phd-runner: [NEW - EVENT] Launched server with pid 928
file = phd-tests/framework/src/test_vm/server.rs
line = 127
path = phd_tests::migrate::from_base::can_migrate_from_base
target = phd_framework::test_vm::server
|
| 199 | 2026-09-16T17:55:45.032Z | INFO | phd-runner: [NEW - END]
elapsed_milliseconds = 52
file = phd-tests/framework/src/test_vm/mod.rs
line = 300
path = phd_tests::migrate::from_base::can_migrate_from_base
target = phd_framework::test_vm
|
| 200 | 2026-09-16T17:55:45.033Z | INFO | phd-runner: [MIGRATE_FROM - START]
file = phd-tests/framework/src/test_vm/mod.rs
line = 609
path = phd_tests::migrate::from_base::can_migrate_from_base
source = migration_from_base
source_id = 1bdbe88c-3daf-44c4-ac10-65f68539700e
target = phd_framework::test_vm
target_id = 834936e0-346a-4216-9ec9-8a4b2ae300b2
|
| 201 | 2026-09-16T17:55:45.033Z | INFO | phd-runner: [MIGRATE_FROM - EVENT] Migrating from source at address 127.0.0.1:9000
file = phd-tests/framework/src/test_vm/mod.rs
line = 642
migration_id = 82c5fbff-1e34-4fd7-a50e-da44d03ebdf7
path = phd_tests::migrate::from_base::can_migrate_from_base
source = migration_from_base
source_id = 1bdbe88c-3daf-44c4-ac10-65f68539700e
target = phd_framework::test_vm
target_id = 834936e0-346a-4216-9ec9-8a4b2ae300b2
timeout_duration = 45s
|
| 202 | 2026-09-16T17:55:45.033Z | INFO | phd-runner: [INSTANCE_ENSURE_INTERNAL - START]
file = phd-tests/framework/src/test_vm/mod.rs
line = 412
path = phd_tests::migrate::from_base::can_migrate_from_base
source = migration_from_base
source_id = 1bdbe88c-3daf-44c4-ac10-65f68539700e
target = phd_framework::test_vm
target_id = 834936e0-346a-4216-9ec9-8a4b2ae300b2
vm = migration_from_base_lifecycle_0
vm_id = 834936e0-346a-4216-9ec9-8a4b2ae300b2
|
| 203 | 2026-09-16T17:55:45.033Z | INFO | phd-runner: [INSTANCE_ENSURE_INTERNAL - EVENT] retriable error from instance_spec_ensure
e = Communication Error: error sending request for url (http://127.0.0.1:9002/instance)
file = phd-tests/framework/src/test_vm/mod.rs
line = 455
path = phd_tests::migrate::from_base::can_migrate_from_base
source = migration_from_base
source_id = 1bdbe88c-3daf-44c4-ac10-65f68539700e
target = phd_framework::test_vm
target_id = 834936e0-346a-4216-9ec9-8a4b2ae300b2
vm = migration_from_base_lifecycle_0
vm_id = 834936e0-346a-4216-9ec9-8a4b2ae300b2
|
| 204 | 2026-09-16T17:55:45.647Z | INFO | phd-runner: [INSTANCE_ENSURE_INTERNAL - EVENT] Started instance
file = phd-tests/framework/src/test_vm/mod.rs
instance_description.instance = Instance { properties: InstanceProperties { id: 834936e0-346a-4216-9ec9-8a4b2ae300b2, name: "phd-vm-834936e0-346a-4216-9ec9-8a4b2ae300b2", description: "Pheidippides-managed VM", metadata: InstanceMetadata { silo_id: 892ee8d5-8981-4d82-9534-f65eab54ef15, project_id: 4c73b6bd-6183-472a-8461-0e4aba31df23, sled_id: 53610005-0dc8-44c7-8e46-0a80ade50caa, sled_serial: "53610005-0dc8-44c7-8e46-0a80ade50caa", sled_revision: 1, sled_model: "pheidippes" } }, state: Migrating }
line = 514
path = phd_tests::migrate::from_base::can_migrate_from_base
source = migration_from_base
source_id = 1bdbe88c-3daf-44c4-ac10-65f68539700e
target = phd_framework::test_vm
target_id = 834936e0-346a-4216-9ec9-8a4b2ae300b2
vm = migration_from_base_lifecycle_0
vm_id = 834936e0-346a-4216-9ec9-8a4b2ae300b2
|
| 205 | 2026-09-16T17:55:45.648Z | INFO | phd-runner: [MIGRATE - START]
file = phd-tests/framework/src/test_vm/mod.rs
line = 663
migration_id = 82c5fbff-1e34-4fd7-a50e-da44d03ebdf7
path = phd_tests::migrate::from_base::can_migrate_from_base
source = migration_from_base
source_id = 1bdbe88c-3daf-44c4-ac10-65f68539700e
target = phd_framework::test_vm
target_id = 834936e0-346a-4216-9ec9-8a4b2ae300b2
|
| 206 | 2026-09-16T17:55:48.153Z | INFO | phd-runner: [SERIAL CONSOLE TASK - EVENT] serial socket control message
file = phd-tests/framework/src/serial/mod.rs
line = 275
s = {"Migrating":{"destination":"127.0.0.1:9002","from_start":7847}}
target = phd_framework::serial
|
| 207 | 2026-09-16T17:55:48.245Z | INFO | phd-runner: [MIGRATE_FROM - EVENT] Migration completed successfully
file = phd-tests/framework/src/test_vm/mod.rs
line = 676
path = phd_tests::migrate::from_base::can_migrate_from_base
source = migration_from_base
source_id = 1bdbe88c-3daf-44c4-ac10-65f68539700e
target = phd_framework::test_vm
target_id = 834936e0-346a-4216-9ec9-8a4b2ae300b2
|
| 208 | 2026-09-16T17:55:48.245Z | INFO | phd-runner: [MIGRATE - END]
elapsed_milliseconds = 2597
file = phd-tests/framework/src/test_vm/mod.rs
line = 663
migration_id = 82c5fbff-1e34-4fd7-a50e-da44d03ebdf7
path = phd_tests::migrate::from_base::can_migrate_from_base
source = migration_from_base
source_id = 1bdbe88c-3daf-44c4-ac10-65f68539700e
target = phd_framework::test_vm
target_id = 834936e0-346a-4216-9ec9-8a4b2ae300b2
|
| 209 | 2026-09-16T17:55:48.247Z | INFO | phd-runner: [VM CLEANUP - START]
file = phd-tests/framework/src/test_vm/mod.rs
line = 1172
path = phd_tests::migrate::from_base::can_migrate_from_base
target = phd_framework::test_vm
vm = migration_from_base
vm_id = 1bdbe88c-3daf-44c4-ac10-65f68539700e
|
| 210 | 2026-09-16T17:55:48.247Z | INFO | phd-runner: [WAIT_FOR_SERIAL_OUTPUT - START]
file = phd-tests/framework/src/test_vm/mod.rs
line = 913
path = phd_tests::migrate::from_base::can_migrate_from_base
target = phd_framework::test_vm
vm = migration_from_base_lifecycle_0
vm_id = 834936e0-346a-4216-9ec9-8a4b2ae300b2
|
| 211 | 2026-09-16T17:55:48.247Z | INFO | phd-runner: [WAIT_FOR_SERIAL_OUTPUT - EVENT] Waiting for output on serial console
file = phd-tests/framework/src/test_vm/mod.rs
line = 920
path = phd_tests::migrate::from_base::can_migrate_from_base
target = phd_framework::test_vm
timeout_duration = Explicit(15s)
vm = migration_from_base_lifecycle_0
vm_id = 834936e0-346a-4216-9ec9-8a4b2ae300b2
|
| 212 | 2026-09-16T17:55:48.249Z | DEBG | phd-runner: [VM CLEANUP - EVENT] Killing Propolis server process
file = phd-tests/framework/src/test_vm/server.rs
line = 177
path = phd_tests::migrate::from_base::can_migrate_from_base
self.address = 127.0.0.1:9000
target = phd_framework::test_vm::server
vm = migration_from_base
vm_id = 1bdbe88c-3daf-44c4-ac10-65f68539700e
|
| 213 | 2026-09-16T17:55:48.327Z | INFO | phd-runner: [VM CLEANUP - END]
elapsed_milliseconds = 79
file = phd-tests/framework/src/test_vm/mod.rs
line = 1172
path = phd_tests::migrate::from_base::can_migrate_from_base
target = phd_framework::test_vm
vm = migration_from_base
vm_id = 1bdbe88c-3daf-44c4-ac10-65f68539700e
|
| 214 | 2026-09-16T17:55:48.328Z | INFO | phd-runner: [INSTANCE_ENSURE_INTERNAL - END]
elapsed_milliseconds = 8776
file = phd-tests/framework/src/test_vm/mod.rs
line = 412
path = phd_tests::migrate::from_base::can_migrate_from_base
target = phd_framework::test_vm
vm = migration_from_base
vm_id = 1bdbe88c-3daf-44c4-ac10-65f68539700e
|
| 215 | 2026-09-16T17:55:50.948Z | INFO | phd-runner: [WAIT_FOR_SERIAL_OUTPUT - END]
elapsed_milliseconds = 2700
file = phd-tests/framework/src/test_vm/mod.rs
line = 913
path = phd_tests::migrate::from_base::can_migrate_from_base
target = phd_framework::test_vm
vm = migration_from_base_lifecycle_0
vm_id = 834936e0-346a-4216-9ec9-8a4b2ae300b2
|
| 216 | 2026-09-16T17:55:50.948Z | INFO | phd-runner: [WAIT_FOR_SERIAL_OUTPUT - START]
file = phd-tests/framework/src/test_vm/mod.rs
line = 913
path = phd_tests::migrate::from_base::can_migrate_from_base
target = phd_framework::test_vm
vm = migration_from_base_lifecycle_0
vm_id = 834936e0-346a-4216-9ec9-8a4b2ae300b2
|
| 217 | 2026-09-16T17:55:50.948Z | INFO | phd-runner: [WAIT_FOR_SERIAL_OUTPUT - EVENT] Waiting for output on serial console
file = phd-tests/framework/src/test_vm/mod.rs
line = 920
path = phd_tests::migrate::from_base::can_migrate_from_base
target = phd_framework::test_vm
timeout_duration = Explicit(300s)
vm = migration_from_base_lifecycle_0
vm_id = 834936e0-346a-4216-9ec9-8a4b2ae300b2
|
| 218 | 2026-09-16T17:55:50.980Z | INFO | phd-runner: [WAIT_FOR_SERIAL_OUTPUT - END]
elapsed_milliseconds = 32
file = phd-tests/framework/src/test_vm/mod.rs
line = 913
path = phd_tests::migrate::from_base::can_migrate_from_base
target = phd_framework::test_vm
vm = migration_from_base_lifecycle_0
vm_id = 834936e0-346a-4216-9ec9-8a4b2ae300b2
|
| 219 | 2026-09-16T17:55:50.980Z | INFO | phd-runner: [VM CLEANUP - START]
file = phd-tests/framework/src/test_vm/mod.rs
line = 1172
path = phd_tests::migrate::from_base::can_migrate_from_base
target = phd_framework::test_vm
vm = migration_from_base_lifecycle_0
vm_id = 834936e0-346a-4216-9ec9-8a4b2ae300b2
|
| 220 | 2026-09-16T17:55:50.981Z | DEBG | phd-runner: [SERIAL CONSOLE TASK - EVENT] serial console command channel was closed
file = phd-tests/framework/src/serial/mod.rs
line = 213
target = phd_framework::serial
|
| 221 | 2026-09-16T17:55:50.981Z | INFO | phd-runner: [SERIAL CONSOLE TASK - END]
elapsed_milliseconds = 10940
file = phd-tests/framework/src/serial/mod.rs
line = 200
target = phd_framework::serial
|
| 222 | 2026-09-16T17:55:50.981Z | INFO | phd-runner: test phd_tests::migrate::from_base::can_migrate_from_base ... ok
file = phd-tests/runner/src/execute.rs
line = 141
target = phd_runner::execute
|
| 223 | 2026-09-16T17:55:50.981Z | INFO | phd-runner: [TEST_CLEANUP - START]
file = phd-tests/runner/src/fixtures.rs
line = 51
target = phd_runner::fixtures
|
| 224 | 2026-09-16T17:55:50.982Z | DEBG | phd-runner: [VM CLEANUP - EVENT] trying to ensure Propolis server VM is destroyed
file = phd-tests/framework/src/test_vm/mod.rs
line = 1195
path = phd_tests::migrate::from_base::can_migrate_from_base
target = phd_framework::test_vm
vm = migration_from_base_lifecycle_0
vm_id = 834936e0-346a-4216-9ec9-8a4b2ae300b2
|
| 225 | 2026-09-16T17:55:51.645Z | DEBG | phd-runner: [VM CLEANUP - EVENT] Killing Propolis server process
file = phd-tests/framework/src/test_vm/server.rs
line = 177
path = phd_tests::migrate::from_base::can_migrate_from_base
self.address = 127.0.0.1:9002
target = phd_framework::test_vm::server
vm = migration_from_base_lifecycle_0
vm_id = 834936e0-346a-4216-9ec9-8a4b2ae300b2
|
| 226 | 2026-09-16T17:55:51.736Z | DEBG | phd-runner: [VM CLEANUP - EVENT] zfs clone dropped
file = phd-tests/framework/src/zfs.rs
line = 83
path = phd_tests::migrate::from_base::can_migrate_from_base
target = phd_framework::zfs
vm = migration_from_base_lifecycle_0
vm_id = 834936e0-346a-4216-9ec9-8a4b2ae300b2
|
| 227 | 2026-09-16T17:55:51.736Z | DEBG | phd-runner: [VM CLEANUP - EVENT] executing ZFS command
args = ["phd-artifacts/phd-clone-a58e8d36-7c42-46ea-8fb2-b116a475be4c"]
file = phd-tests/framework/src/zfs.rs
line = 304
path = phd_tests::migrate::from_base::can_migrate_from_base
target = phd_framework::zfs
verb = destroy
vm = migration_from_base_lifecycle_0
vm_id = 834936e0-346a-4216-9ec9-8a4b2ae300b2
|
| 228 | 2026-09-16T17:55:51.763Z | DEBG | phd-runner: [VM CLEANUP - EVENT] zfs snapshot dropped
file = phd-tests/framework/src/zfs.rs
line = 57
path = phd_tests::migrate::from_base::can_migrate_from_base
target = phd_framework::zfs
vm = migration_from_base_lifecycle_0
vm_id = 834936e0-346a-4216-9ec9-8a4b2ae300b2
|
| 229 | 2026-09-16T17:55:51.763Z | DEBG | phd-runner: [VM CLEANUP - EVENT] executing ZFS command
args = ["phd-artifacts@phd-82fed69a-60d1-43c6-a99f-eac92ae96367"]
file = phd-tests/framework/src/zfs.rs
line = 304
path = phd_tests::migrate::from_base::can_migrate_from_base
target = phd_framework::zfs
verb = destroy
vm = migration_from_base_lifecycle_0
vm_id = 834936e0-346a-4216-9ec9-8a4b2ae300b2
|
| 230 | 2026-09-16T17:55:51.782Z | INFO | phd-runner: [VM CLEANUP - END]
elapsed_milliseconds = 801
file = phd-tests/framework/src/test_vm/mod.rs
line = 1172
path = phd_tests::migrate::from_base::can_migrate_from_base
target = phd_framework::test_vm
vm = migration_from_base_lifecycle_0
vm_id = 834936e0-346a-4216-9ec9-8a4b2ae300b2
|
| 231 | 2026-09-16T17:55:51.782Z | INFO | phd-runner: [INSTANCE_ENSURE_INTERNAL - END]
elapsed_milliseconds = 6749
file = phd-tests/framework/src/test_vm/mod.rs
line = 412
path = phd_tests::migrate::from_base::can_migrate_from_base
source = migration_from_base
source_id = 1bdbe88c-3daf-44c4-ac10-65f68539700e
target = phd_framework::test_vm
target_id = 834936e0-346a-4216-9ec9-8a4b2ae300b2
vm = migration_from_base_lifecycle_0
vm_id = 834936e0-346a-4216-9ec9-8a4b2ae300b2
|
| 232 | 2026-09-16T17:55:51.783Z | INFO | phd-runner: [TEST_CLEANUP - END]
elapsed_milliseconds = 801
file = phd-tests/runner/src/fixtures.rs
line = 51
target = phd_runner::fixtures
|
| 233 | 2026-09-16T17:55:51.783Z | INFO | phd-runner: [MIGRATE_FROM - END]
elapsed_milliseconds = 6749
file = phd-tests/framework/src/test_vm/mod.rs
line = 609
path = phd_tests::migrate::from_base::can_migrate_from_base
source = migration_from_base
source_id = 1bdbe88c-3daf-44c4-ac10-65f68539700e
target = phd_framework::test_vm
target_id = 834936e0-346a-4216-9ec9-8a4b2ae300b2
|
| 234 | 2026-09-16T17:55:51.783Z | INFO | phd-runner: [TEST - END]
elapsed_milliseconds = 12347
file = phd-tests/tests/src/migrate.rs
line = 34
path = phd_tests::migrate::from_base::can_migrate_from_base
target = phd_tests::migrate::from_base
|
| 235 | 2026-09-16T17:55:51.783Z | INFO | phd-runner: Starting test phd_tests::migrate::from_base::migration_from_base_and_back
file = phd-tests/runner/src/execute.rs
line = 91
target = phd_runner::execute
|
| 236 | 2026-09-16T17:55:51.783Z | INFO | phd-runner: [TEST_SETUP - START]
file = phd-tests/runner/src/fixtures.rs
line = 41
target = phd_runner::fixtures
|
| 237 | 2026-09-16T17:55:51.783Z | INFO | phd-runner: [TEST_SETUP - END]
elapsed_milliseconds = 0
file = phd-tests/runner/src/fixtures.rs
line = 41
target = phd_runner::fixtures
|
| 238 | 2026-09-16T17:55:51.783Z | INFO | phd-runner: [TEST - START]
file = phd-tests/tests/src/migrate.rs
line = 52
path = phd_tests::migrate::from_base::migration_from_base_and_back
target = phd_tests::migrate::from_base
|
| 239 | 2026-09-16T17:55:51.783Z | DEBG | phd-runner: [TEST - EVENT] Verified artifact already exists
file = phd-tests/framework/src/artifacts/store.rs
line = 45
path = /phd-artifacts/740187046a7267d0de72d3455070333547dbc0ea023531471fb2b2a61effa448/OVMF_CODE.fd
target = phd_framework::artifacts::store
|
| 240 | 2026-09-16T17:55:51.783Z | DEBG | phd-runner: [TEST - EVENT] Verified artifact already exists
file = phd-tests/framework/src/artifacts/store.rs
line = 45
path = /phd-artifacts/ba8007f74f9b54fbae3b2520da577831b4834778a498d732f091260c61aa7ca1/alpine.iso
target = phd_framework::artifacts::store
|
| 241 | 2026-09-16T17:55:51.783Z | DEBG | phd-runner: [TEST - EVENT] Verified artifact already exists
file = phd-tests/framework/src/artifacts/store.rs
line = 45
path = /phd-artifacts/ba8007f74f9b54fbae3b2520da577831b4834778a498d732f091260c61aa7ca1/alpine.iso
target = phd_framework::artifacts::store
|
| 242 | 2026-09-16T17:55:51.783Z | DEBG | phd-runner: [TEST - EVENT] executing ZFS command
args = ["/phd-artifacts/ba8007f74f9b54fbae3b2520da577831b4834778a498d732f091260c61aa7ca1/alpine.iso"]
file = phd-tests/framework/src/zfs.rs
line = 304
path = phd_tests::migrate::from_base::migration_from_base_and_back
target = phd_framework::zfs
verb = list
|
| 243 | 2026-09-16T17:55:51.795Z | DEBG | phd-runner: [TEST - EVENT] parsing zfs list output
file = phd-tests/framework/src/zfs.rs
line = 238
path = phd_tests::migrate::from_base::migration_from_base_and_back
stdout = NAME USED AVAIL REFER MOUNTPOINT\nphd-artifacts 1.30G 25.3T 1.30G /phd-artifacts\n
target = phd_framework::zfs
|
| 244 | 2026-09-16T17:55:51.795Z | DEBG | phd-runner: [TEST - EVENT] executing ZFS command
args = ["phd-artifacts@phd-64ad0dde-39af-4363-8f15-22caf07675cf"]
file = phd-tests/framework/src/zfs.rs
line = 304
path = phd_tests::migrate::from_base::migration_from_base_and_back
target = phd_framework::zfs
verb = snapshot
|
| 245 | 2026-09-16T17:55:51.813Z | DEBG | phd-runner: [TEST - EVENT] executing ZFS command
args = ["phd-artifacts@phd-64ad0dde-39af-4363-8f15-22caf07675cf", "phd-artifacts/phd-clone-c89de1c9-a5cf-4d49-96fd-b090866781f9"]
file = phd-tests/framework/src/zfs.rs
line = 304
path = phd_tests::migrate::from_base::migration_from_base_and_back
target = phd_framework::zfs
verb = clone
|
| 246 | 2026-09-16T17:55:51.832Z | DEBG | phd-runner: [TEST - EVENT] executing ZFS command
args = ["phd-artifacts/phd-clone-c89de1c9-a5cf-4d49-96fd-b090866781f9"]
file = phd-tests/framework/src/zfs.rs
line = 304
path = phd_tests::migrate::from_base::migration_from_base_and_back
target = phd_framework::zfs
verb = list
|
| 247 | 2026-09-16T17:55:51.843Z | DEBG | phd-runner: [TEST - EVENT] parsing zfs list output
file = phd-tests/framework/src/zfs.rs
line = 238
path = phd_tests::migrate::from_base::migration_from_base_and_back
stdout = NAME USED AVAIL REFER MOUNTPOINT\nphd-artifacts/phd-clone-c89de1c9-a5cf-4d49-96fd-b090866781f9 0B 25.3T 1.30G /phd-artifacts/phd-clone-c89de1c9-a5cf-4d49-96fd-b090866781f9\n
target = phd_framework::zfs
|
| 248 | 2026-09-16T17:55:51.844Z | INFO | phd-runner: [NEW - START]
file = phd-tests/framework/src/test_vm/mod.rs
line = 300
path = phd_tests::migrate::from_base::migration_from_base_and_back
target = phd_framework::test_vm
|
| 249 | 2026-09-16T17:55:51.844Z | INFO | phd-runner: [NEW - EVENT] phd_framework::test_vm
environment = EnvironmentSpec { location: Local, propolis_artifact: "__BASE_PROPOLIS", metrics: None }
file = phd-tests/framework/src/test_vm/mod.rs
guest_os_kind = Alpine
line = 318
path = phd_tests::migrate::from_base::migration_from_base_and_back
target = phd_framework::test_vm
vm_name = migration_from_base_and_back
|
| 250 | 2026-09-16T17:55:51.844Z | DEBG | phd-runner: [NEW - EVENT] Verified artifact already exists
file = phd-tests/framework/src/artifacts/store.rs
line = 45
path = /phd-artifacts/9ae9fafe7388ed9e46be3e2216caab7a75f3f243a766be6e0a4a4eef637cce0c/propolis-server
target = phd_framework::artifacts::store
|
| 251 | 2026-09-16T17:55:51.844Z | INFO | phd-runner: [NEW - EVENT] Launching Propolis server
bootrom_path = "/phd-artifacts/740187046a7267d0de72d3455070333547dbc0ea023531471fb2b2a61effa448/OVMF_CODE.fd"
file = phd-tests/framework/src/test_vm/server.rs
line = 66
path = phd_tests::migrate::from_base::migration_from_base_and_back
server_addr = 127.0.0.1:9000
server_path = "/phd-artifacts/9ae9fafe7388ed9e46be3e2216caab7a75f3f243a766be6e0a4a4eef637cce0c/propolis-server"
target = phd_framework::test_vm::server
|
| 252 | 2026-09-16T17:55:51.844Z | INFO | phd-runner: [NEW - EVENT] Opening server log files
file = phd-tests/framework/src/log_config.rs
line = 84
path = phd_tests::migrate::from_base::migration_from_base_and_back
stderr_path = "/tmp/propolis-phd/phd_tests::migrate::from_base::migration_from_base_and_back/migration_from_base_and_back.stderr.log"
stdout_path = "/tmp/propolis-phd/phd_tests::migrate::from_base::migration_from_base_and_back/migration_from_base_and_back.stdout.log"
target = phd_framework::log_config
|
| 253 | 2026-09-16T17:55:51.885Z | INFO | phd-runner: [NEW - EVENT] Launched server with pid 937
file = phd-tests/framework/src/test_vm/server.rs
line = 127
path = phd_tests::migrate::from_base::migration_from_base_and_back
target = phd_framework::test_vm::server
|
| 254 | 2026-09-16T17:55:51.899Z | INFO | phd-runner: [NEW - END]
elapsed_milliseconds = 54
file = phd-tests/framework/src/test_vm/mod.rs
line = 300
path = phd_tests::migrate::from_base::migration_from_base_and_back
target = phd_framework::test_vm
|
| 255 | 2026-09-16T17:55:51.899Z | INFO | phd-runner: [INSTANCE_ENSURE_INTERNAL - START]
file = phd-tests/framework/src/test_vm/mod.rs
line = 412
path = phd_tests::migrate::from_base::migration_from_base_and_back
target = phd_framework::test_vm
vm = migration_from_base_and_back
vm_id = 8195c98e-2d97-4318-b4b5-fdb3b2fd5bde
|
| 256 | 2026-09-16T17:55:51.899Z | INFO | phd-runner: [INSTANCE_ENSURE_INTERNAL - EVENT] retriable error from instance_spec_ensure
e = Communication Error: error sending request for url (http://127.0.0.1:9000/instance)
file = phd-tests/framework/src/test_vm/mod.rs
line = 455
path = phd_tests::migrate::from_base::migration_from_base_and_back
target = phd_framework::test_vm
vm = migration_from_base_and_back
vm_id = 8195c98e-2d97-4318-b4b5-fdb3b2fd5bde
|
| 257 | 2026-09-16T17:55:52.584Z | INFO | phd-runner: [SERIAL CONSOLE TASK - START]
file = phd-tests/framework/src/serial/mod.rs
line = 200
target = phd_framework::serial
|
| 258 | 2026-09-16T17:55:52.585Z | INFO | phd-runner: [INSTANCE_ENSURE_INTERNAL - EVENT] Started instance
file = phd-tests/framework/src/test_vm/mod.rs
instance_description.instance = Instance { properties: InstanceProperties { id: 8195c98e-2d97-4318-b4b5-fdb3b2fd5bde, name: "phd-vm-8195c98e-2d97-4318-b4b5-fdb3b2fd5bde", description: "Pheidippides-managed VM", metadata: InstanceMetadata { silo_id: f3d27708-4adf-44ab-9d9b-10b562bb76da, project_id: 463ad906-0156-4851-9b28-38118602c059, sled_id: 56061cfa-46f2-4c51-8d21-550157d2a954, sled_serial: "56061cfa-46f2-4c51-8d21-550157d2a954", sled_revision: 1, sled_model: "pheidippes" } }, state: Creating }
line = 514
path = phd_tests::migrate::from_base::migration_from_base_and_back
target = phd_framework::test_vm
vm = migration_from_base_and_back
vm_id = 8195c98e-2d97-4318-b4b5-fdb3b2fd5bde
|
| 259 | 2026-09-16T17:55:52.586Z | INFO | phd-runner: [PUT_INSTANCE_STATE - START]
file = phd-tests/framework/src/test_vm/mod.rs
line = 575
path = phd_tests::migrate::from_base::migration_from_base_and_back
target = phd_framework::test_vm
vm = migration_from_base_and_back
vm_id = 8195c98e-2d97-4318-b4b5-fdb3b2fd5bde
|
| 260 | 2026-09-16T17:55:52.586Z | INFO | phd-runner: [PUT_INSTANCE_STATE - EVENT] Requesting instance state change
file = phd-tests/framework/src/test_vm/mod.rs
line = 580
path = phd_tests::migrate::from_base::migration_from_base_and_back
state = Run
target = phd_framework::test_vm
vm = migration_from_base_and_back
vm_id = 8195c98e-2d97-4318-b4b5-fdb3b2fd5bde
|
| 261 | 2026-09-16T17:55:52.587Z | INFO | phd-runner: [PUT_INSTANCE_STATE - END]
elapsed_milliseconds = 1
file = phd-tests/framework/src/test_vm/mod.rs
line = 575
path = phd_tests::migrate::from_base::migration_from_base_and_back
target = phd_framework::test_vm
vm = migration_from_base_and_back
vm_id = 8195c98e-2d97-4318-b4b5-fdb3b2fd5bde
|
| 262 | 2026-09-16T17:55:52.587Z | INFO | phd-runner: [WAIT_TO_BOOT - START]
file = phd-tests/framework/src/test_vm/mod.rs
line = 890
path = phd_tests::migrate::from_base::migration_from_base_and_back
target = phd_framework::test_vm
|
| 263 | 2026-09-16T17:55:52.587Z | INFO | phd-runner: [WAIT_TO_BOOT - EVENT] waiting for guest to boot
file = phd-tests/framework/src/test_vm/mod.rs
line = 839
path = phd_tests::migrate::from_base::migration_from_base_and_back
target = phd_framework::test_vm
timeout_duration = 300s
vm = migration_from_base_and_back
vm_id = 8195c98e-2d97-4318-b4b5-fdb3b2fd5bde
|
| 264 | 2026-09-16T17:55:52.587Z | DEBG | phd-runner: [WAIT_TO_BOOT - EVENT] executing command in boot sequence
file = phd-tests/framework/src/test_vm/mod.rs
line = 847
path = phd_tests::migrate::from_base::migration_from_base_and_back
step = WaitFor("localhost login: ")
target = phd_framework::test_vm
|
| 265 | 2026-09-16T17:55:52.587Z | INFO | phd-runner: [WAIT_FOR_SERIAL_OUTPUT - START]
file = phd-tests/framework/src/test_vm/mod.rs
line = 913
path = phd_tests::migrate::from_base::migration_from_base_and_back
target = phd_framework::test_vm
vm = migration_from_base_and_back
vm_id = 8195c98e-2d97-4318-b4b5-fdb3b2fd5bde
|
| 266 | 2026-09-16T17:55:52.587Z | INFO | phd-runner: [WAIT_FOR_SERIAL_OUTPUT - EVENT] Waiting for output on serial console
file = phd-tests/framework/src/test_vm/mod.rs
line = 920
path = phd_tests::migrate::from_base::migration_from_base_and_back
target = phd_framework::test_vm
timeout_duration = CallerTimeout
vm = migration_from_base_and_back
vm_id = 8195c98e-2d97-4318-b4b5-fdb3b2fd5bde
|
| 267 | 2026-09-16T17:55:57.190Z | INFO | phd-runner: [WAIT_FOR_SERIAL_OUTPUT - END]
elapsed_milliseconds = 4602
file = phd-tests/framework/src/test_vm/mod.rs
line = 913
path = phd_tests::migrate::from_base::migration_from_base_and_back
target = phd_framework::test_vm
vm = migration_from_base_and_back
vm_id = 8195c98e-2d97-4318-b4b5-fdb3b2fd5bde
|
| 268 | 2026-09-16T17:55:57.190Z | DEBG | phd-runner: [WAIT_TO_BOOT - EVENT] executing command in boot sequence
file = phd-tests/framework/src/test_vm/mod.rs
line = 847
path = phd_tests::migrate::from_base::migration_from_base_and_back
step = WriteStr("root")
target = phd_framework::test_vm
|
| 269 | 2026-09-16T17:55:57.190Z | DEBG | phd-runner: [WAIT_TO_BOOT - EVENT] executing command in boot sequence
file = phd-tests/framework/src/test_vm/mod.rs
line = 847
path = phd_tests::migrate::from_base::migration_from_base_and_back
step = WaitFor("localhost:~#")
target = phd_framework::test_vm
|
| 270 | 2026-09-16T17:55:57.190Z | INFO | phd-runner: [WAIT_FOR_SERIAL_OUTPUT - START]
file = phd-tests/framework/src/test_vm/mod.rs
line = 913
path = phd_tests::migrate::from_base::migration_from_base_and_back
target = phd_framework::test_vm
vm = migration_from_base_and_back
vm_id = 8195c98e-2d97-4318-b4b5-fdb3b2fd5bde
|
| 271 | 2026-09-16T17:55:57.190Z | INFO | phd-runner: [WAIT_FOR_SERIAL_OUTPUT - EVENT] Waiting for output on serial console
file = phd-tests/framework/src/test_vm/mod.rs
line = 920
path = phd_tests::migrate::from_base::migration_from_base_and_back
target = phd_framework::test_vm
timeout_duration = CallerTimeout
vm = migration_from_base_and_back
vm_id = 8195c98e-2d97-4318-b4b5-fdb3b2fd5bde
|
| 272 | 2026-09-16T17:55:57.220Z | INFO | phd-runner: [WAIT_FOR_SERIAL_OUTPUT - END]
elapsed_milliseconds = 29
file = phd-tests/framework/src/test_vm/mod.rs
line = 913
path = phd_tests::migrate::from_base::migration_from_base_and_back
target = phd_framework::test_vm
vm = migration_from_base_and_back
vm_id = 8195c98e-2d97-4318-b4b5-fdb3b2fd5bde
|
| 273 | 2026-09-16T17:55:57.220Z | DEBG | phd-runner: [WAIT_TO_BOOT - EVENT] executing command in boot sequence
file = phd-tests/framework/src/test_vm/mod.rs
line = 847
path = phd_tests::migrate::from_base::migration_from_base_and_back
step = WriteStr("stty -F `tty` cols 9999")
target = phd_framework::test_vm
|
| 274 | 2026-09-16T17:55:57.220Z | DEBG | phd-runner: [WAIT_TO_BOOT - EVENT] executing command in boot sequence
file = phd-tests/framework/src/test_vm/mod.rs
line = 847
path = phd_tests::migrate::from_base::migration_from_base_and_back
step = WaitFor("localhost:~#")
target = phd_framework::test_vm
|
| 275 | 2026-09-16T17:55:57.220Z | INFO | phd-runner: [WAIT_FOR_SERIAL_OUTPUT - START]
file = phd-tests/framework/src/test_vm/mod.rs
line = 913
path = phd_tests::migrate::from_base::migration_from_base_and_back
target = phd_framework::test_vm
vm = migration_from_base_and_back
vm_id = 8195c98e-2d97-4318-b4b5-fdb3b2fd5bde
|
| 276 | 2026-09-16T17:55:57.220Z | INFO | phd-runner: [WAIT_FOR_SERIAL_OUTPUT - EVENT] Waiting for output on serial console
file = phd-tests/framework/src/test_vm/mod.rs
line = 920
path = phd_tests::migrate::from_base::migration_from_base_and_back
target = phd_framework::test_vm
timeout_duration = CallerTimeout
vm = migration_from_base_and_back
vm_id = 8195c98e-2d97-4318-b4b5-fdb3b2fd5bde
|
| 277 | 2026-09-16T17:55:57.252Z | INFO | phd-runner: [WAIT_FOR_SERIAL_OUTPUT - END]
elapsed_milliseconds = 31
file = phd-tests/framework/src/test_vm/mod.rs
line = 913
path = phd_tests::migrate::from_base::migration_from_base_and_back
target = phd_framework::test_vm
vm = migration_from_base_and_back
vm_id = 8195c98e-2d97-4318-b4b5-fdb3b2fd5bde
|
| 278 | 2026-09-16T17:55:57.252Z | INFO | phd-runner: [WAIT_TO_BOOT - EVENT] Guest has booted
file = phd-tests/framework/src/test_vm/mod.rs
line = 887
path = phd_tests::migrate::from_base::migration_from_base_and_back
target = phd_framework::test_vm
|
| 279 | 2026-09-16T17:55:57.252Z | INFO | phd-runner: [WAIT_TO_BOOT - END]
elapsed_milliseconds = 4665
file = phd-tests/framework/src/test_vm/mod.rs
line = 890
path = phd_tests::migrate::from_base::migration_from_base_and_back
target = phd_framework::test_vm
|
| 280 | 2026-09-16T17:55:57.253Z | INFO | phd-runner: [WAIT_FOR_SERIAL_OUTPUT - START]
file = phd-tests/framework/src/test_vm/mod.rs
line = 913
path = phd_tests::migrate::from_base::migration_from_base_and_back
target = phd_framework::test_vm
vm = migration_from_base_and_back
vm_id = 8195c98e-2d97-4318-b4b5-fdb3b2fd5bde
|
| 281 | 2026-09-16T17:55:57.253Z | INFO | phd-runner: [WAIT_FOR_SERIAL_OUTPUT - EVENT] Waiting for output on serial console
file = phd-tests/framework/src/test_vm/mod.rs
line = 920
path = phd_tests::migrate::from_base::migration_from_base_and_back
target = phd_framework::test_vm
timeout_duration = Explicit(15s)
vm = migration_from_base_and_back
vm_id = 8195c98e-2d97-4318-b4b5-fdb3b2fd5bde
|
| 282 | 2026-09-16T17:55:57.263Z | INFO | phd-runner: [WAIT_FOR_SERIAL_OUTPUT - END]
elapsed_milliseconds = 10
file = phd-tests/framework/src/test_vm/mod.rs
line = 913
path = phd_tests::migrate::from_base::migration_from_base_and_back
target = phd_framework::test_vm
vm = migration_from_base_and_back
vm_id = 8195c98e-2d97-4318-b4b5-fdb3b2fd5bde
|
| 283 | 2026-09-16T17:55:57.263Z | INFO | phd-runner: [WAIT_FOR_SERIAL_OUTPUT - START]
file = phd-tests/framework/src/test_vm/mod.rs
line = 913
path = phd_tests::migrate::from_base::migration_from_base_and_back
target = phd_framework::test_vm
vm = migration_from_base_and_back
vm_id = 8195c98e-2d97-4318-b4b5-fdb3b2fd5bde
|
| 284 | 2026-09-16T17:55:57.263Z | INFO | phd-runner: [WAIT_FOR_SERIAL_OUTPUT - EVENT] Waiting for output on serial console
file = phd-tests/framework/src/test_vm/mod.rs
line = 920
path = phd_tests::migrate::from_base::migration_from_base_and_back
target = phd_framework::test_vm
timeout_duration = Explicit(300s)
vm = migration_from_base_and_back
vm_id = 8195c98e-2d97-4318-b4b5-fdb3b2fd5bde
|
| 285 | 2026-09-16T17:55:57.297Z | INFO | phd-runner: [WAIT_FOR_SERIAL_OUTPUT - END]
elapsed_milliseconds = 33
file = phd-tests/framework/src/test_vm/mod.rs
line = 913
path = phd_tests::migrate::from_base::migration_from_base_and_back
target = phd_framework::test_vm
vm = migration_from_base_and_back
vm_id = 8195c98e-2d97-4318-b4b5-fdb3b2fd5bde
|
| 286 | 2026-09-16T17:55:57.297Z | INFO | phd-runner: [WAIT_FOR_SERIAL_OUTPUT - START]
file = phd-tests/framework/src/test_vm/mod.rs
line = 913
path = phd_tests::migrate::from_base::migration_from_base_and_back
target = phd_framework::test_vm
vm = migration_from_base_and_back
vm_id = 8195c98e-2d97-4318-b4b5-fdb3b2fd5bde
|
| 287 | 2026-09-16T17:55:57.297Z | INFO | phd-runner: [WAIT_FOR_SERIAL_OUTPUT - EVENT] Waiting for output on serial console
file = phd-tests/framework/src/test_vm/mod.rs
line = 920
path = phd_tests::migrate::from_base::migration_from_base_and_back
target = phd_framework::test_vm
timeout_duration = Explicit(15s)
vm = migration_from_base_and_back
vm_id = 8195c98e-2d97-4318-b4b5-fdb3b2fd5bde
|
| 288 | 2026-09-16T17:55:57.308Z | INFO | phd-runner: [WAIT_FOR_SERIAL_OUTPUT - END]
elapsed_milliseconds = 11
file = phd-tests/framework/src/test_vm/mod.rs
line = 913
path = phd_tests::migrate::from_base::migration_from_base_and_back
target = phd_framework::test_vm
vm = migration_from_base_and_back
vm_id = 8195c98e-2d97-4318-b4b5-fdb3b2fd5bde
|
| 289 | 2026-09-16T17:55:57.309Z | INFO | phd-runner: [WAIT_FOR_SERIAL_OUTPUT - START]
file = phd-tests/framework/src/test_vm/mod.rs
line = 913
path = phd_tests::migrate::from_base::migration_from_base_and_back
target = phd_framework::test_vm
vm = migration_from_base_and_back
vm_id = 8195c98e-2d97-4318-b4b5-fdb3b2fd5bde
|
| 290 | 2026-09-16T17:55:57.309Z | INFO | phd-runner: [WAIT_FOR_SERIAL_OUTPUT - EVENT] Waiting for output on serial console
file = phd-tests/framework/src/test_vm/mod.rs
line = 920
path = phd_tests::migrate::from_base::migration_from_base_and_back
target = phd_framework::test_vm
timeout_duration = Explicit(300s)
vm = migration_from_base_and_back
vm_id = 8195c98e-2d97-4318-b4b5-fdb3b2fd5bde
|
| 291 | 2026-09-16T17:55:57.341Z | INFO | phd-runner: [WAIT_FOR_SERIAL_OUTPUT - END]
elapsed_milliseconds = 32
file = phd-tests/framework/src/test_vm/mod.rs
line = 913
path = phd_tests::migrate::from_base::migration_from_base_and_back
target = phd_framework::test_vm
vm = migration_from_base_and_back
vm_id = 8195c98e-2d97-4318-b4b5-fdb3b2fd5bde
|
| 292 | 2026-09-16T17:55:57.342Z | INFO | phd-runner: [WAIT_FOR_SERIAL_OUTPUT - START]
file = phd-tests/framework/src/test_vm/mod.rs
line = 913
path = phd_tests::migrate::from_base::migration_from_base_and_back
target = phd_framework::test_vm
vm = migration_from_base_and_back
vm_id = 8195c98e-2d97-4318-b4b5-fdb3b2fd5bde
|
| 293 | 2026-09-16T17:55:57.342Z | INFO | phd-runner: [WAIT_FOR_SERIAL_OUTPUT - EVENT] Waiting for output on serial console
file = phd-tests/framework/src/test_vm/mod.rs
line = 920
path = phd_tests::migrate::from_base::migration_from_base_and_back
target = phd_framework::test_vm
timeout_duration = Explicit(15s)
vm = migration_from_base_and_back
vm_id = 8195c98e-2d97-4318-b4b5-fdb3b2fd5bde
|
| 294 | 2026-09-16T17:55:57.353Z | INFO | phd-runner: [WAIT_FOR_SERIAL_OUTPUT - END]
elapsed_milliseconds = 11
file = phd-tests/framework/src/test_vm/mod.rs
line = 913
path = phd_tests::migrate::from_base::migration_from_base_and_back
target = phd_framework::test_vm
vm = migration_from_base_and_back
vm_id = 8195c98e-2d97-4318-b4b5-fdb3b2fd5bde
|
| 295 | 2026-09-16T17:55:57.353Z | INFO | phd-runner: [WAIT_FOR_SERIAL_OUTPUT - START]
file = phd-tests/framework/src/test_vm/mod.rs
line = 913
path = phd_tests::migrate::from_base::migration_from_base_and_back
target = phd_framework::test_vm
vm = migration_from_base_and_back
vm_id = 8195c98e-2d97-4318-b4b5-fdb3b2fd5bde
|
| 296 | 2026-09-16T17:55:57.353Z | INFO | phd-runner: [WAIT_FOR_SERIAL_OUTPUT - EVENT] Waiting for output on serial console
file = phd-tests/framework/src/test_vm/mod.rs
line = 920
path = phd_tests::migrate::from_base::migration_from_base_and_back
target = phd_framework::test_vm
timeout_duration = Explicit(300s)
vm = migration_from_base_and_back
vm_id = 8195c98e-2d97-4318-b4b5-fdb3b2fd5bde
|
| 297 | 2026-09-16T17:55:57.387Z | INFO | phd-runner: [WAIT_FOR_SERIAL_OUTPUT - END]
elapsed_milliseconds = 33
file = phd-tests/framework/src/test_vm/mod.rs
line = 913
path = phd_tests::migrate::from_base::migration_from_base_and_back
target = phd_framework::test_vm
vm = migration_from_base_and_back
vm_id = 8195c98e-2d97-4318-b4b5-fdb3b2fd5bde
|
| 298 | 2026-09-16T17:55:57.387Z | INFO | phd-runner: [WAIT_FOR_SERIAL_OUTPUT - START]
file = phd-tests/framework/src/test_vm/mod.rs
line = 913
path = phd_tests::migrate::from_base::migration_from_base_and_back
target = phd_framework::test_vm
vm = migration_from_base_and_back
vm_id = 8195c98e-2d97-4318-b4b5-fdb3b2fd5bde
|
| 299 | 2026-09-16T17:55:57.387Z | INFO | phd-runner: [WAIT_FOR_SERIAL_OUTPUT - EVENT] Waiting for output on serial console
file = phd-tests/framework/src/test_vm/mod.rs
line = 920
path = phd_tests::migrate::from_base::migration_from_base_and_back
target = phd_framework::test_vm
timeout_duration = Explicit(15s)
vm = migration_from_base_and_back
vm_id = 8195c98e-2d97-4318-b4b5-fdb3b2fd5bde
|
| 300 | 2026-09-16T17:55:57.398Z | INFO | phd-runner: [WAIT_FOR_SERIAL_OUTPUT - END]
elapsed_milliseconds = 10
file = phd-tests/framework/src/test_vm/mod.rs
line = 913
path = phd_tests::migrate::from_base::migration_from_base_and_back
target = phd_framework::test_vm
vm = migration_from_base_and_back
vm_id = 8195c98e-2d97-4318-b4b5-fdb3b2fd5bde
|
| 301 | 2026-09-16T17:55:57.398Z | INFO | phd-runner: [WAIT_FOR_SERIAL_OUTPUT - START]
file = phd-tests/framework/src/test_vm/mod.rs
line = 913
path = phd_tests::migrate::from_base::migration_from_base_and_back
target = phd_framework::test_vm
vm = migration_from_base_and_back
vm_id = 8195c98e-2d97-4318-b4b5-fdb3b2fd5bde
|
| 302 | 2026-09-16T17:55:57.399Z | INFO | phd-runner: [WAIT_FOR_SERIAL_OUTPUT - EVENT] Waiting for output on serial console
file = phd-tests/framework/src/test_vm/mod.rs
line = 920
path = phd_tests::migrate::from_base::migration_from_base_and_back
target = phd_framework::test_vm
timeout_duration = Explicit(300s)
vm = migration_from_base_and_back
vm_id = 8195c98e-2d97-4318-b4b5-fdb3b2fd5bde
|
| 303 | 2026-09-16T17:55:57.430Z | INFO | phd-runner: [WAIT_FOR_SERIAL_OUTPUT - END]
elapsed_milliseconds = 31
file = phd-tests/framework/src/test_vm/mod.rs
line = 913
path = phd_tests::migrate::from_base::migration_from_base_and_back
target = phd_framework::test_vm
vm = migration_from_base_and_back
vm_id = 8195c98e-2d97-4318-b4b5-fdb3b2fd5bde
|
| 304 | 2026-09-16T17:55:57.431Z | INFO | phd-runner: [WAIT_FOR_SERIAL_OUTPUT - START]
file = phd-tests/framework/src/test_vm/mod.rs
line = 913
path = phd_tests::migrate::from_base::migration_from_base_and_back
target = phd_framework::test_vm
vm = migration_from_base_and_back
vm_id = 8195c98e-2d97-4318-b4b5-fdb3b2fd5bde
|
| 305 | 2026-09-16T17:55:57.431Z | INFO | phd-runner: [WAIT_FOR_SERIAL_OUTPUT - EVENT] Waiting for output on serial console
file = phd-tests/framework/src/test_vm/mod.rs
line = 920
path = phd_tests::migrate::from_base::migration_from_base_and_back
target = phd_framework::test_vm
timeout_duration = Explicit(15s)
vm = migration_from_base_and_back
vm_id = 8195c98e-2d97-4318-b4b5-fdb3b2fd5bde
|
| 306 | 2026-09-16T17:55:57.442Z | INFO | phd-runner: [WAIT_FOR_SERIAL_OUTPUT - END]
elapsed_milliseconds = 11
file = phd-tests/framework/src/test_vm/mod.rs
line = 913
path = phd_tests::migrate::from_base::migration_from_base_and_back
target = phd_framework::test_vm
vm = migration_from_base_and_back
vm_id = 8195c98e-2d97-4318-b4b5-fdb3b2fd5bde
|
| 307 | 2026-09-16T17:55:57.443Z | INFO | phd-runner: [WAIT_FOR_SERIAL_OUTPUT - START]
file = phd-tests/framework/src/test_vm/mod.rs
line = 913
path = phd_tests::migrate::from_base::migration_from_base_and_back
target = phd_framework::test_vm
vm = migration_from_base_and_back
vm_id = 8195c98e-2d97-4318-b4b5-fdb3b2fd5bde
|
| 308 | 2026-09-16T17:55:57.443Z | INFO | phd-runner: [WAIT_FOR_SERIAL_OUTPUT - EVENT] Waiting for output on serial console
file = phd-tests/framework/src/test_vm/mod.rs
line = 920
path = phd_tests::migrate::from_base::migration_from_base_and_back
target = phd_framework::test_vm
timeout_duration = Explicit(300s)
vm = migration_from_base_and_back
vm_id = 8195c98e-2d97-4318-b4b5-fdb3b2fd5bde
|
| 309 | 2026-09-16T17:55:57.475Z | INFO | phd-runner: [WAIT_FOR_SERIAL_OUTPUT - END]
elapsed_milliseconds = 32
file = phd-tests/framework/src/test_vm/mod.rs
line = 913
path = phd_tests::migrate::from_base::migration_from_base_and_back
target = phd_framework::test_vm
vm = migration_from_base_and_back
vm_id = 8195c98e-2d97-4318-b4b5-fdb3b2fd5bde
|
| 310 | 2026-09-16T17:55:57.476Z | INFO | phd-runner: [WAIT_FOR_SERIAL_OUTPUT - START]
file = phd-tests/framework/src/test_vm/mod.rs
line = 913
path = phd_tests::migrate::from_base::migration_from_base_and_back
target = phd_framework::test_vm
vm = migration_from_base_and_back
vm_id = 8195c98e-2d97-4318-b4b5-fdb3b2fd5bde
|
| 311 | 2026-09-16T17:55:57.476Z | INFO | phd-runner: [WAIT_FOR_SERIAL_OUTPUT - EVENT] Waiting for output on serial console
file = phd-tests/framework/src/test_vm/mod.rs
line = 920
path = phd_tests::migrate::from_base::migration_from_base_and_back
target = phd_framework::test_vm
timeout_duration = Explicit(15s)
vm = migration_from_base_and_back
vm_id = 8195c98e-2d97-4318-b4b5-fdb3b2fd5bde
|
| 312 | 2026-09-16T17:55:57.487Z | INFO | phd-runner: [WAIT_FOR_SERIAL_OUTPUT - END]
elapsed_milliseconds = 11
file = phd-tests/framework/src/test_vm/mod.rs
line = 913
path = phd_tests::migrate::from_base::migration_from_base_and_back
target = phd_framework::test_vm
vm = migration_from_base_and_back
vm_id = 8195c98e-2d97-4318-b4b5-fdb3b2fd5bde
|
| 313 | 2026-09-16T17:55:57.488Z | INFO | phd-runner: [WAIT_FOR_SERIAL_OUTPUT - START]
file = phd-tests/framework/src/test_vm/mod.rs
line = 913
path = phd_tests::migrate::from_base::migration_from_base_and_back
target = phd_framework::test_vm
vm = migration_from_base_and_back
vm_id = 8195c98e-2d97-4318-b4b5-fdb3b2fd5bde
|
| 314 | 2026-09-16T17:55:57.488Z | INFO | phd-runner: [WAIT_FOR_SERIAL_OUTPUT - EVENT] Waiting for output on serial console
file = phd-tests/framework/src/test_vm/mod.rs
line = 920
path = phd_tests::migrate::from_base::migration_from_base_and_back
target = phd_framework::test_vm
timeout_duration = Explicit(300s)
vm = migration_from_base_and_back
vm_id = 8195c98e-2d97-4318-b4b5-fdb3b2fd5bde
|
| 315 | 2026-09-16T17:55:57.521Z | INFO | phd-runner: [WAIT_FOR_SERIAL_OUTPUT - END]
elapsed_milliseconds = 32
file = phd-tests/framework/src/test_vm/mod.rs
line = 913
path = phd_tests::migrate::from_base::migration_from_base_and_back
target = phd_framework::test_vm
vm = migration_from_base_and_back
vm_id = 8195c98e-2d97-4318-b4b5-fdb3b2fd5bde
|
| 316 | 2026-09-16T17:55:57.521Z | INFO | phd-runner: [TEST - EVENT] migrating to new Propolis artifact for lifecycle test
file = phd-tests/framework/src/lifecycle.rs
line = 73
path = phd_tests::migrate::from_base::migration_from_base_and_back
propolis_artifact = __DEFAULT_PROPOLIS
target = phd_framework::lifecycle
vm_name = migration_from_base_and_back
|
| 317 | 2026-09-16T17:55:57.521Z | INFO | phd-runner: [NEW - START]
file = phd-tests/framework/src/test_vm/mod.rs
line = 300
path = phd_tests::migrate::from_base::migration_from_base_and_back
target = phd_framework::test_vm
|
| 318 | 2026-09-16T17:55:57.521Z | INFO | phd-runner: [NEW - EVENT] phd_framework::test_vm
environment = EnvironmentSpec { location: Local, propolis_artifact: "__DEFAULT_PROPOLIS", metrics: None }
file = phd-tests/framework/src/test_vm/mod.rs
guest_os_kind = Alpine
line = 318
path = phd_tests::migrate::from_base::migration_from_base_and_back
target = phd_framework::test_vm
vm_name = migration_from_base_and_back_lifecycle_0
|
| 319 | 2026-09-16T17:55:57.521Z | DEBG | phd-runner: [NEW - EVENT] Verified artifact already exists
file = phd-tests/framework/src/artifacts/store.rs
line = 45
path = /work/phd-test/propolis-server
target = phd_framework::artifacts::store
|
| 320 | 2026-09-16T17:55:57.521Z | INFO | phd-runner: [NEW - EVENT] Launching Propolis server
bootrom_path = "/phd-artifacts/740187046a7267d0de72d3455070333547dbc0ea023531471fb2b2a61effa448/OVMF_CODE.fd"
file = phd-tests/framework/src/test_vm/server.rs
line = 66
path = phd_tests::migrate::from_base::migration_from_base_and_back
server_addr = 127.0.0.1:9002
server_path = "/work/phd-test/propolis-server"
target = phd_framework::test_vm::server
|
| 321 | 2026-09-16T17:55:57.521Z | INFO | phd-runner: [NEW - EVENT] Opening server log files
file = phd-tests/framework/src/log_config.rs
line = 84
path = phd_tests::migrate::from_base::migration_from_base_and_back
stderr_path = "/tmp/propolis-phd/phd_tests::migrate::from_base::migration_from_base_and_back/migration_from_base_and_back_lifecycle_0.stderr.log"
stdout_path = "/tmp/propolis-phd/phd_tests::migrate::from_base::migration_from_base_and_back/migration_from_base_and_back_lifecycle_0.stdout.log"
target = phd_framework::log_config
|
| 322 | 2026-09-16T17:55:57.558Z | INFO | phd-runner: [NEW - EVENT] Launched server with pid 938
file = phd-tests/framework/src/test_vm/server.rs
line = 127
path = phd_tests::migrate::from_base::migration_from_base_and_back
target = phd_framework::test_vm::server
|
| 323 | 2026-09-16T17:55:57.571Z | INFO | phd-runner: [NEW - END]
elapsed_milliseconds = 49
file = phd-tests/framework/src/test_vm/mod.rs
line = 300
path = phd_tests::migrate::from_base::migration_from_base_and_back
target = phd_framework::test_vm
|
| 324 | 2026-09-16T17:55:57.571Z | INFO | phd-runner: [MIGRATE_FROM - START]
file = phd-tests/framework/src/test_vm/mod.rs
line = 609
path = phd_tests::migrate::from_base::migration_from_base_and_back
source = migration_from_base_and_back
source_id = 8195c98e-2d97-4318-b4b5-fdb3b2fd5bde
target = phd_framework::test_vm
target_id = fed95498-728c-49e1-9564-10e3aa2bbc05
|
| 325 | 2026-09-16T17:55:57.571Z | INFO | phd-runner: [MIGRATE_FROM - EVENT] Migrating from source at address 127.0.0.1:9000
file = phd-tests/framework/src/test_vm/mod.rs
line = 642
migration_id = 14bc3fd7-f167-4f23-a949-c3fa6cf597a5
path = phd_tests::migrate::from_base::migration_from_base_and_back
source = migration_from_base_and_back
source_id = 8195c98e-2d97-4318-b4b5-fdb3b2fd5bde
target = phd_framework::test_vm
target_id = fed95498-728c-49e1-9564-10e3aa2bbc05
timeout_duration = 45s
|
| 326 | 2026-09-16T17:55:57.571Z | INFO | phd-runner: [INSTANCE_ENSURE_INTERNAL - START]
file = phd-tests/framework/src/test_vm/mod.rs
line = 412
path = phd_tests::migrate::from_base::migration_from_base_and_back
source = migration_from_base_and_back
source_id = 8195c98e-2d97-4318-b4b5-fdb3b2fd5bde
target = phd_framework::test_vm
target_id = fed95498-728c-49e1-9564-10e3aa2bbc05
vm = migration_from_base_and_back_lifecycle_0
vm_id = fed95498-728c-49e1-9564-10e3aa2bbc05
|
| 327 | 2026-09-16T17:55:57.572Z | INFO | phd-runner: [INSTANCE_ENSURE_INTERNAL - EVENT] retriable error from instance_spec_ensure
e = Communication Error: error sending request for url (http://127.0.0.1:9002/instance)
file = phd-tests/framework/src/test_vm/mod.rs
line = 455
path = phd_tests::migrate::from_base::migration_from_base_and_back
source = migration_from_base_and_back
source_id = 8195c98e-2d97-4318-b4b5-fdb3b2fd5bde
target = phd_framework::test_vm
target_id = fed95498-728c-49e1-9564-10e3aa2bbc05
vm = migration_from_base_and_back_lifecycle_0
vm_id = fed95498-728c-49e1-9564-10e3aa2bbc05
|
| 328 | 2026-09-16T17:55:58.171Z | INFO | phd-runner: [INSTANCE_ENSURE_INTERNAL - EVENT] Started instance
file = phd-tests/framework/src/test_vm/mod.rs
instance_description.instance = Instance { properties: InstanceProperties { id: fed95498-728c-49e1-9564-10e3aa2bbc05, name: "phd-vm-fed95498-728c-49e1-9564-10e3aa2bbc05", description: "Pheidippides-managed VM", metadata: InstanceMetadata { silo_id: f3d27708-4adf-44ab-9d9b-10b562bb76da, project_id: 463ad906-0156-4851-9b28-38118602c059, sled_id: 474eff7d-9bde-43ed-8330-9fd771c7e4a9, sled_serial: "474eff7d-9bde-43ed-8330-9fd771c7e4a9", sled_revision: 1, sled_model: "pheidippes" } }, state: Migrating }
line = 514
path = phd_tests::migrate::from_base::migration_from_base_and_back
source = migration_from_base_and_back
source_id = 8195c98e-2d97-4318-b4b5-fdb3b2fd5bde
target = phd_framework::test_vm
target_id = fed95498-728c-49e1-9564-10e3aa2bbc05
vm = migration_from_base_and_back_lifecycle_0
vm_id = fed95498-728c-49e1-9564-10e3aa2bbc05
|
| 329 | 2026-09-16T17:55:58.172Z | INFO | phd-runner: [MIGRATE - START]
file = phd-tests/framework/src/test_vm/mod.rs
line = 663
migration_id = 14bc3fd7-f167-4f23-a949-c3fa6cf597a5
path = phd_tests::migrate::from_base::migration_from_base_and_back
source = migration_from_base_and_back
source_id = 8195c98e-2d97-4318-b4b5-fdb3b2fd5bde
target = phd_framework::test_vm
target_id = fed95498-728c-49e1-9564-10e3aa2bbc05
|
| 330 | 2026-09-16T17:56:00.699Z | INFO | phd-runner: [SERIAL CONSOLE TASK - EVENT] serial socket control message
file = phd-tests/framework/src/serial/mod.rs
line = 275
s = {"Migrating":{"destination":"127.0.0.1:9002","from_start":7847}}
target = phd_framework::serial
|
| 331 | 2026-09-16T17:56:02.396Z | INFO | phd-runner: [MIGRATE_FROM - EVENT] Migration completed successfully
file = phd-tests/framework/src/test_vm/mod.rs
line = 676
path = phd_tests::migrate::from_base::migration_from_base_and_back
source = migration_from_base_and_back
source_id = 8195c98e-2d97-4318-b4b5-fdb3b2fd5bde
target = phd_framework::test_vm
target_id = fed95498-728c-49e1-9564-10e3aa2bbc05
|
| 332 | 2026-09-16T17:56:02.396Z | INFO | phd-runner: [MIGRATE - END]
elapsed_milliseconds = 4223
file = phd-tests/framework/src/test_vm/mod.rs
line = 663
migration_id = 14bc3fd7-f167-4f23-a949-c3fa6cf597a5
path = phd_tests::migrate::from_base::migration_from_base_and_back
source = migration_from_base_and_back
source_id = 8195c98e-2d97-4318-b4b5-fdb3b2fd5bde
target = phd_framework::test_vm
target_id = fed95498-728c-49e1-9564-10e3aa2bbc05
|
| 333 | 2026-09-16T17:56:02.399Z | INFO | phd-runner: [VM CLEANUP - START]
file = phd-tests/framework/src/test_vm/mod.rs
line = 1172
path = phd_tests::migrate::from_base::migration_from_base_and_back
target = phd_framework::test_vm
vm = migration_from_base_and_back
vm_id = 8195c98e-2d97-4318-b4b5-fdb3b2fd5bde
|
| 334 | 2026-09-16T17:56:02.399Z | INFO | phd-runner: [WAIT_FOR_SERIAL_OUTPUT - START]
file = phd-tests/framework/src/test_vm/mod.rs
line = 913
path = phd_tests::migrate::from_base::migration_from_base_and_back
target = phd_framework::test_vm
vm = migration_from_base_and_back_lifecycle_0
vm_id = fed95498-728c-49e1-9564-10e3aa2bbc05
|
| 335 | 2026-09-16T17:56:02.399Z | INFO | phd-runner: [WAIT_FOR_SERIAL_OUTPUT - EVENT] Waiting for output on serial console
file = phd-tests/framework/src/test_vm/mod.rs
line = 920
path = phd_tests::migrate::from_base::migration_from_base_and_back
target = phd_framework::test_vm
timeout_duration = Explicit(15s)
vm = migration_from_base_and_back_lifecycle_0
vm_id = fed95498-728c-49e1-9564-10e3aa2bbc05
|
| 336 | 2026-09-16T17:56:02.401Z | DEBG | phd-runner: [VM CLEANUP - EVENT] Killing Propolis server process
file = phd-tests/framework/src/test_vm/server.rs
line = 177
path = phd_tests::migrate::from_base::migration_from_base_and_back
self.address = 127.0.0.1:9000
target = phd_framework::test_vm::server
vm = migration_from_base_and_back
vm_id = 8195c98e-2d97-4318-b4b5-fdb3b2fd5bde
|
| 337 | 2026-09-16T17:56:02.478Z | INFO | phd-runner: [VM CLEANUP - END]
elapsed_milliseconds = 79
file = phd-tests/framework/src/test_vm/mod.rs
line = 1172
path = phd_tests::migrate::from_base::migration_from_base_and_back
target = phd_framework::test_vm
vm = migration_from_base_and_back
vm_id = 8195c98e-2d97-4318-b4b5-fdb3b2fd5bde
|
| 338 | 2026-09-16T17:56:02.478Z | INFO | phd-runner: [INSTANCE_ENSURE_INTERNAL - END]
elapsed_milliseconds = 10579
file = phd-tests/framework/src/test_vm/mod.rs
line = 412
path = phd_tests::migrate::from_base::migration_from_base_and_back
target = phd_framework::test_vm
vm = migration_from_base_and_back
vm_id = 8195c98e-2d97-4318-b4b5-fdb3b2fd5bde
|
| 339 | 2026-09-16T17:56:02.479Z | INFO | phd-runner: [WAIT_FOR_SERIAL_OUTPUT - END]
elapsed_milliseconds = 79
file = phd-tests/framework/src/test_vm/mod.rs
line = 913
path = phd_tests::migrate::from_base::migration_from_base_and_back
target = phd_framework::test_vm
vm = migration_from_base_and_back_lifecycle_0
vm_id = fed95498-728c-49e1-9564-10e3aa2bbc05
|
| 340 | 2026-09-16T17:56:02.479Z | INFO | phd-runner: [WAIT_FOR_SERIAL_OUTPUT - START]
file = phd-tests/framework/src/test_vm/mod.rs
line = 913
path = phd_tests::migrate::from_base::migration_from_base_and_back
target = phd_framework::test_vm
vm = migration_from_base_and_back_lifecycle_0
vm_id = fed95498-728c-49e1-9564-10e3aa2bbc05
|
| 341 | 2026-09-16T17:56:02.479Z | INFO | phd-runner: [WAIT_FOR_SERIAL_OUTPUT - EVENT] Waiting for output on serial console
file = phd-tests/framework/src/test_vm/mod.rs
line = 920
path = phd_tests::migrate::from_base::migration_from_base_and_back
target = phd_framework::test_vm
timeout_duration = Explicit(300s)
vm = migration_from_base_and_back_lifecycle_0
vm_id = fed95498-728c-49e1-9564-10e3aa2bbc05
|
| 342 | 2026-09-16T17:56:02.512Z | INFO | phd-runner: [WAIT_FOR_SERIAL_OUTPUT - END]
elapsed_milliseconds = 32
file = phd-tests/framework/src/test_vm/mod.rs
line = 913
path = phd_tests::migrate::from_base::migration_from_base_and_back
target = phd_framework::test_vm
vm = migration_from_base_and_back_lifecycle_0
vm_id = fed95498-728c-49e1-9564-10e3aa2bbc05
|
| 343 | 2026-09-16T17:56:02.512Z | INFO | phd-runner: [TEST - EVENT] migrating to new Propolis artifact for lifecycle test
file = phd-tests/framework/src/lifecycle.rs
line = 73
path = phd_tests::migrate::from_base::migration_from_base_and_back
propolis_artifact = __BASE_PROPOLIS
target = phd_framework::lifecycle
vm_name = migration_from_base_and_back
|
| 344 | 2026-09-16T17:56:02.512Z | INFO | phd-runner: [NEW - START]
file = phd-tests/framework/src/test_vm/mod.rs
line = 300
path = phd_tests::migrate::from_base::migration_from_base_and_back
target = phd_framework::test_vm
|
| 345 | 2026-09-16T17:56:02.512Z | INFO | phd-runner: [NEW - EVENT] phd_framework::test_vm
environment = EnvironmentSpec { location: Local, propolis_artifact: "__BASE_PROPOLIS", metrics: None }
file = phd-tests/framework/src/test_vm/mod.rs
guest_os_kind = Alpine
line = 318
path = phd_tests::migrate::from_base::migration_from_base_and_back
target = phd_framework::test_vm
vm_name = migration_from_base_and_back_lifecycle_1
|
| 346 | 2026-09-16T17:56:02.512Z | DEBG | phd-runner: [NEW - EVENT] Verified artifact already exists
file = phd-tests/framework/src/artifacts/store.rs
line = 45
path = /phd-artifacts/9ae9fafe7388ed9e46be3e2216caab7a75f3f243a766be6e0a4a4eef637cce0c/propolis-server
target = phd_framework::artifacts::store
|
| 347 | 2026-09-16T17:56:02.513Z | INFO | phd-runner: [NEW - EVENT] Launching Propolis server
bootrom_path = "/phd-artifacts/740187046a7267d0de72d3455070333547dbc0ea023531471fb2b2a61effa448/OVMF_CODE.fd"
file = phd-tests/framework/src/test_vm/server.rs
line = 66
path = phd_tests::migrate::from_base::migration_from_base_and_back
server_addr = 127.0.0.1:9004
server_path = "/phd-artifacts/9ae9fafe7388ed9e46be3e2216caab7a75f3f243a766be6e0a4a4eef637cce0c/propolis-server"
target = phd_framework::test_vm::server
|
| 348 | 2026-09-16T17:56:02.513Z | INFO | phd-runner: [NEW - EVENT] Opening server log files
file = phd-tests/framework/src/log_config.rs
line = 84
path = phd_tests::migrate::from_base::migration_from_base_and_back
stderr_path = "/tmp/propolis-phd/phd_tests::migrate::from_base::migration_from_base_and_back/migration_from_base_and_back_lifecycle_1.stderr.log"
stdout_path = "/tmp/propolis-phd/phd_tests::migrate::from_base::migration_from_base_and_back/migration_from_base_and_back_lifecycle_1.stdout.log"
target = phd_framework::log_config
|
| 349 | 2026-09-16T17:56:02.552Z | INFO | phd-runner: [NEW - EVENT] Launched server with pid 940
file = phd-tests/framework/src/test_vm/server.rs
line = 127
path = phd_tests::migrate::from_base::migration_from_base_and_back
target = phd_framework::test_vm::server
|
| 350 | 2026-09-16T17:56:02.566Z | INFO | phd-runner: [NEW - END]
elapsed_milliseconds = 53
file = phd-tests/framework/src/test_vm/mod.rs
line = 300
path = phd_tests::migrate::from_base::migration_from_base_and_back
target = phd_framework::test_vm
|
| 351 | 2026-09-16T17:56:02.566Z | INFO | phd-runner: [MIGRATE_FROM - START]
file = phd-tests/framework/src/test_vm/mod.rs
line = 609
path = phd_tests::migrate::from_base::migration_from_base_and_back
source = migration_from_base_and_back_lifecycle_0
source_id = fed95498-728c-49e1-9564-10e3aa2bbc05
target = phd_framework::test_vm
target_id = 96689561-39ca-4c70-adac-a9613b2c450d
|
| 352 | 2026-09-16T17:56:02.566Z | INFO | phd-runner: [MIGRATE_FROM - EVENT] Migrating from source at address 127.0.0.1:9002
file = phd-tests/framework/src/test_vm/mod.rs
line = 642
migration_id = 50ca10e7-2d38-483b-89e9-2710c98e755d
path = phd_tests::migrate::from_base::migration_from_base_and_back
source = migration_from_base_and_back_lifecycle_0
source_id = fed95498-728c-49e1-9564-10e3aa2bbc05
target = phd_framework::test_vm
target_id = 96689561-39ca-4c70-adac-a9613b2c450d
timeout_duration = 45s
|
| 353 | 2026-09-16T17:56:02.566Z | INFO | phd-runner: [INSTANCE_ENSURE_INTERNAL - START]
file = phd-tests/framework/src/test_vm/mod.rs
line = 412
path = phd_tests::migrate::from_base::migration_from_base_and_back
source = migration_from_base_and_back_lifecycle_0
source_id = fed95498-728c-49e1-9564-10e3aa2bbc05
target = phd_framework::test_vm
target_id = 96689561-39ca-4c70-adac-a9613b2c450d
vm = migration_from_base_and_back_lifecycle_1
vm_id = 96689561-39ca-4c70-adac-a9613b2c450d
|
| 354 | 2026-09-16T17:56:02.567Z | INFO | phd-runner: [INSTANCE_ENSURE_INTERNAL - EVENT] retriable error from instance_spec_ensure
e = Communication Error: error sending request for url (http://127.0.0.1:9004/instance)
file = phd-tests/framework/src/test_vm/mod.rs
line = 455
path = phd_tests::migrate::from_base::migration_from_base_and_back
source = migration_from_base_and_back_lifecycle_0
source_id = fed95498-728c-49e1-9564-10e3aa2bbc05
target = phd_framework::test_vm
target_id = 96689561-39ca-4c70-adac-a9613b2c450d
vm = migration_from_base_and_back_lifecycle_1
vm_id = 96689561-39ca-4c70-adac-a9613b2c450d
|
| 355 | 2026-09-16T17:56:03.205Z | INFO | phd-runner: [INSTANCE_ENSURE_INTERNAL - EVENT] Started instance
file = phd-tests/framework/src/test_vm/mod.rs
instance_description.instance = Instance { properties: InstanceProperties { id: 96689561-39ca-4c70-adac-a9613b2c450d, name: "phd-vm-96689561-39ca-4c70-adac-a9613b2c450d", description: "Pheidippides-managed VM", metadata: InstanceMetadata { silo_id: f3d27708-4adf-44ab-9d9b-10b562bb76da, project_id: 463ad906-0156-4851-9b28-38118602c059, sled_id: 1b9a5b7f-52cc-482a-9643-b25fe99d5354, sled_serial: "1b9a5b7f-52cc-482a-9643-b25fe99d5354", sled_revision: 1, sled_model: "pheidippes" } }, state: Migrating }
line = 514
path = phd_tests::migrate::from_base::migration_from_base_and_back
source = migration_from_base_and_back_lifecycle_0
source_id = fed95498-728c-49e1-9564-10e3aa2bbc05
target = phd_framework::test_vm
target_id = 96689561-39ca-4c70-adac-a9613b2c450d
vm = migration_from_base_and_back_lifecycle_1
vm_id = 96689561-39ca-4c70-adac-a9613b2c450d
|
| 356 | 2026-09-16T17:56:03.205Z | INFO | phd-runner: [MIGRATE - START]
file = phd-tests/framework/src/test_vm/mod.rs
line = 663
migration_id = 50ca10e7-2d38-483b-89e9-2710c98e755d
path = phd_tests::migrate::from_base::migration_from_base_and_back
source = migration_from_base_and_back_lifecycle_0
source_id = fed95498-728c-49e1-9564-10e3aa2bbc05
target = phd_framework::test_vm
target_id = 96689561-39ca-4c70-adac-a9613b2c450d
|
| 357 | 2026-09-16T17:56:05.734Z | INFO | phd-runner: [SERIAL CONSOLE TASK - EVENT] serial socket control message
file = phd-tests/framework/src/serial/mod.rs
line = 275
s = {"Migrating":{"destination":"127.0.0.1:9004","from_start":7894}}
target = phd_framework::serial
|
| 358 | 2026-09-16T17:56:06.900Z | INFO | phd-runner: [MIGRATE_FROM - EVENT] Migration completed successfully
file = phd-tests/framework/src/test_vm/mod.rs
line = 676
path = phd_tests::migrate::from_base::migration_from_base_and_back
source = migration_from_base_and_back_lifecycle_0
source_id = fed95498-728c-49e1-9564-10e3aa2bbc05
target = phd_framework::test_vm
target_id = 96689561-39ca-4c70-adac-a9613b2c450d
|
| 359 | 2026-09-16T17:56:06.900Z | INFO | phd-runner: [MIGRATE - END]
elapsed_milliseconds = 3694
file = phd-tests/framework/src/test_vm/mod.rs
line = 663
migration_id = 50ca10e7-2d38-483b-89e9-2710c98e755d
path = phd_tests::migrate::from_base::migration_from_base_and_back
source = migration_from_base_and_back_lifecycle_0
source_id = fed95498-728c-49e1-9564-10e3aa2bbc05
target = phd_framework::test_vm
target_id = 96689561-39ca-4c70-adac-a9613b2c450d
|
| 360 | 2026-09-16T17:56:06.903Z | INFO | phd-runner: [VM CLEANUP - START]
file = phd-tests/framework/src/test_vm/mod.rs
line = 1172
path = phd_tests::migrate::from_base::migration_from_base_and_back
target = phd_framework::test_vm
vm = migration_from_base_and_back_lifecycle_0
vm_id = fed95498-728c-49e1-9564-10e3aa2bbc05
|
| 361 | 2026-09-16T17:56:06.903Z | INFO | phd-runner: [WAIT_FOR_SERIAL_OUTPUT - START]
file = phd-tests/framework/src/test_vm/mod.rs
line = 913
path = phd_tests::migrate::from_base::migration_from_base_and_back
target = phd_framework::test_vm
vm = migration_from_base_and_back_lifecycle_1
vm_id = 96689561-39ca-4c70-adac-a9613b2c450d
|
| 362 | 2026-09-16T17:56:06.903Z | INFO | phd-runner: [WAIT_FOR_SERIAL_OUTPUT - EVENT] Waiting for output on serial console
file = phd-tests/framework/src/test_vm/mod.rs
line = 920
path = phd_tests::migrate::from_base::migration_from_base_and_back
target = phd_framework::test_vm
timeout_duration = Explicit(15s)
vm = migration_from_base_and_back_lifecycle_1
vm_id = 96689561-39ca-4c70-adac-a9613b2c450d
|
| 363 | 2026-09-16T17:56:06.905Z | DEBG | phd-runner: [VM CLEANUP - EVENT] Killing Propolis server process
file = phd-tests/framework/src/test_vm/server.rs
line = 177
path = phd_tests::migrate::from_base::migration_from_base_and_back
self.address = 127.0.0.1:9002
target = phd_framework::test_vm::server
vm = migration_from_base_and_back_lifecycle_0
vm_id = fed95498-728c-49e1-9564-10e3aa2bbc05
|
| 364 | 2026-09-16T17:56:06.988Z | INFO | phd-runner: [VM CLEANUP - END]
elapsed_milliseconds = 84
file = phd-tests/framework/src/test_vm/mod.rs
line = 1172
path = phd_tests::migrate::from_base::migration_from_base_and_back
target = phd_framework::test_vm
vm = migration_from_base_and_back_lifecycle_0
vm_id = fed95498-728c-49e1-9564-10e3aa2bbc05
|
| 365 | 2026-09-16T17:56:06.988Z | INFO | phd-runner: [INSTANCE_ENSURE_INTERNAL - END]
elapsed_milliseconds = 9416
file = phd-tests/framework/src/test_vm/mod.rs
line = 412
path = phd_tests::migrate::from_base::migration_from_base_and_back
source = migration_from_base_and_back
source_id = 8195c98e-2d97-4318-b4b5-fdb3b2fd5bde
target = phd_framework::test_vm
target_id = fed95498-728c-49e1-9564-10e3aa2bbc05
vm = migration_from_base_and_back_lifecycle_0
vm_id = fed95498-728c-49e1-9564-10e3aa2bbc05
|
| 366 | 2026-09-16T17:56:06.988Z | INFO | phd-runner: [MIGRATE_FROM - END]
elapsed_milliseconds = 9417
file = phd-tests/framework/src/test_vm/mod.rs
line = 609
path = phd_tests::migrate::from_base::migration_from_base_and_back
source = migration_from_base_and_back
source_id = 8195c98e-2d97-4318-b4b5-fdb3b2fd5bde
target = phd_framework::test_vm
target_id = fed95498-728c-49e1-9564-10e3aa2bbc05
|
| 367 | 2026-09-16T17:56:06.988Z | INFO | phd-runner: [WAIT_FOR_SERIAL_OUTPUT - END]
elapsed_milliseconds = 85
file = phd-tests/framework/src/test_vm/mod.rs
line = 913
path = phd_tests::migrate::from_base::migration_from_base_and_back
target = phd_framework::test_vm
vm = migration_from_base_and_back_lifecycle_1
vm_id = 96689561-39ca-4c70-adac-a9613b2c450d
|
| 368 | 2026-09-16T17:56:06.989Z | INFO | phd-runner: [WAIT_FOR_SERIAL_OUTPUT - START]
file = phd-tests/framework/src/test_vm/mod.rs
line = 913
path = phd_tests::migrate::from_base::migration_from_base_and_back
target = phd_framework::test_vm
vm = migration_from_base_and_back_lifecycle_1
vm_id = 96689561-39ca-4c70-adac-a9613b2c450d
|
| 369 | 2026-09-16T17:56:06.989Z | INFO | phd-runner: [WAIT_FOR_SERIAL_OUTPUT - EVENT] Waiting for output on serial console
file = phd-tests/framework/src/test_vm/mod.rs
line = 920
path = phd_tests::migrate::from_base::migration_from_base_and_back
target = phd_framework::test_vm
timeout_duration = Explicit(300s)
vm = migration_from_base_and_back_lifecycle_1
vm_id = 96689561-39ca-4c70-adac-a9613b2c450d
|
| 370 | 2026-09-16T17:56:07.015Z | INFO | phd-runner: [WAIT_FOR_SERIAL_OUTPUT - END]
elapsed_milliseconds = 25
file = phd-tests/framework/src/test_vm/mod.rs
line = 913
path = phd_tests::migrate::from_base::migration_from_base_and_back
target = phd_framework::test_vm
vm = migration_from_base_and_back_lifecycle_1
vm_id = 96689561-39ca-4c70-adac-a9613b2c450d
|
| 371 | 2026-09-16T17:56:07.015Z | INFO | phd-runner: [TEST - EVENT] migrating to new Propolis artifact for lifecycle test
file = phd-tests/framework/src/lifecycle.rs
line = 73
path = phd_tests::migrate::from_base::migration_from_base_and_back
propolis_artifact = __DEFAULT_PROPOLIS
target = phd_framework::lifecycle
vm_name = migration_from_base_and_back
|
| 372 | 2026-09-16T17:56:07.015Z | INFO | phd-runner: [NEW - START]
file = phd-tests/framework/src/test_vm/mod.rs
line = 300
path = phd_tests::migrate::from_base::migration_from_base_and_back
target = phd_framework::test_vm
|
| 373 | 2026-09-16T17:56:07.015Z | INFO | phd-runner: [NEW - EVENT] phd_framework::test_vm
environment = EnvironmentSpec { location: Local, propolis_artifact: "__DEFAULT_PROPOLIS", metrics: None }
file = phd-tests/framework/src/test_vm/mod.rs
guest_os_kind = Alpine
line = 318
path = phd_tests::migrate::from_base::migration_from_base_and_back
target = phd_framework::test_vm
vm_name = migration_from_base_and_back_lifecycle_2
|
| 374 | 2026-09-16T17:56:07.015Z | DEBG | phd-runner: [NEW - EVENT] Verified artifact already exists
file = phd-tests/framework/src/artifacts/store.rs
line = 45
path = /work/phd-test/propolis-server
target = phd_framework::artifacts::store
|
| 375 | 2026-09-16T17:56:07.015Z | INFO | phd-runner: [NEW - EVENT] Launching Propolis server
bootrom_path = "/phd-artifacts/740187046a7267d0de72d3455070333547dbc0ea023531471fb2b2a61effa448/OVMF_CODE.fd"
file = phd-tests/framework/src/test_vm/server.rs
line = 66
path = phd_tests::migrate::from_base::migration_from_base_and_back
server_addr = 127.0.0.1:9006
server_path = "/work/phd-test/propolis-server"
target = phd_framework::test_vm::server
|
| 376 | 2026-09-16T17:56:07.015Z | INFO | phd-runner: [NEW - EVENT] Opening server log files
file = phd-tests/framework/src/log_config.rs
line = 84
path = phd_tests::migrate::from_base::migration_from_base_and_back
stderr_path = "/tmp/propolis-phd/phd_tests::migrate::from_base::migration_from_base_and_back/migration_from_base_and_back_lifecycle_2.stderr.log"
stdout_path = "/tmp/propolis-phd/phd_tests::migrate::from_base::migration_from_base_and_back/migration_from_base_and_back_lifecycle_2.stdout.log"
target = phd_framework::log_config
|
| 377 | 2026-09-16T17:56:07.054Z | INFO | phd-runner: [NEW - EVENT] Launched server with pid 942
file = phd-tests/framework/src/test_vm/server.rs
line = 127
path = phd_tests::migrate::from_base::migration_from_base_and_back
target = phd_framework::test_vm::server
|
| 378 | 2026-09-16T17:56:07.068Z | INFO | phd-runner: [NEW - END]
elapsed_milliseconds = 52
file = phd-tests/framework/src/test_vm/mod.rs
line = 300
path = phd_tests::migrate::from_base::migration_from_base_and_back
target = phd_framework::test_vm
|
| 379 | 2026-09-16T17:56:07.068Z | INFO | phd-runner: [MIGRATE_FROM - START]
file = phd-tests/framework/src/test_vm/mod.rs
line = 609
path = phd_tests::migrate::from_base::migration_from_base_and_back
source = migration_from_base_and_back_lifecycle_1
source_id = 96689561-39ca-4c70-adac-a9613b2c450d
target = phd_framework::test_vm
target_id = 4bb07e4c-2e39-48a3-8e38-826aa5a322f0
|
| 380 | 2026-09-16T17:56:07.068Z | INFO | phd-runner: [MIGRATE_FROM - EVENT] Migrating from source at address 127.0.0.1:9004
file = phd-tests/framework/src/test_vm/mod.rs
line = 642
migration_id = e71ea31a-560b-49f9-9636-ed50e7c6db37
path = phd_tests::migrate::from_base::migration_from_base_and_back
source = migration_from_base_and_back_lifecycle_1
source_id = 96689561-39ca-4c70-adac-a9613b2c450d
target = phd_framework::test_vm
target_id = 4bb07e4c-2e39-48a3-8e38-826aa5a322f0
timeout_duration = 45s
|
| 381 | 2026-09-16T17:56:07.068Z | INFO | phd-runner: [INSTANCE_ENSURE_INTERNAL - START]
file = phd-tests/framework/src/test_vm/mod.rs
line = 412
path = phd_tests::migrate::from_base::migration_from_base_and_back
source = migration_from_base_and_back_lifecycle_1
source_id = 96689561-39ca-4c70-adac-a9613b2c450d
target = phd_framework::test_vm
target_id = 4bb07e4c-2e39-48a3-8e38-826aa5a322f0
vm = migration_from_base_and_back_lifecycle_2
vm_id = 4bb07e4c-2e39-48a3-8e38-826aa5a322f0
|
| 382 | 2026-09-16T17:56:07.069Z | INFO | phd-runner: [INSTANCE_ENSURE_INTERNAL - EVENT] retriable error from instance_spec_ensure
e = Communication Error: error sending request for url (http://127.0.0.1:9006/instance)
file = phd-tests/framework/src/test_vm/mod.rs
line = 455
path = phd_tests::migrate::from_base::migration_from_base_and_back
source = migration_from_base_and_back_lifecycle_1
source_id = 96689561-39ca-4c70-adac-a9613b2c450d
target = phd_framework::test_vm
target_id = 4bb07e4c-2e39-48a3-8e38-826aa5a322f0
vm = migration_from_base_and_back_lifecycle_2
vm_id = 4bb07e4c-2e39-48a3-8e38-826aa5a322f0
|
| 383 | 2026-09-16T17:56:07.684Z | INFO | phd-runner: [INSTANCE_ENSURE_INTERNAL - EVENT] Started instance
file = phd-tests/framework/src/test_vm/mod.rs
instance_description.instance = Instance { properties: InstanceProperties { id: 4bb07e4c-2e39-48a3-8e38-826aa5a322f0, name: "phd-vm-4bb07e4c-2e39-48a3-8e38-826aa5a322f0", description: "Pheidippides-managed VM", metadata: InstanceMetadata { silo_id: f3d27708-4adf-44ab-9d9b-10b562bb76da, project_id: 463ad906-0156-4851-9b28-38118602c059, sled_id: 68a201c0-3355-4d33-9ea4-0ad2583d7d09, sled_serial: "68a201c0-3355-4d33-9ea4-0ad2583d7d09", sled_revision: 1, sled_model: "pheidippes" } }, state: Migrating }
line = 514
path = phd_tests::migrate::from_base::migration_from_base_and_back
source = migration_from_base_and_back_lifecycle_1
source_id = 96689561-39ca-4c70-adac-a9613b2c450d
target = phd_framework::test_vm
target_id = 4bb07e4c-2e39-48a3-8e38-826aa5a322f0
vm = migration_from_base_and_back_lifecycle_2
vm_id = 4bb07e4c-2e39-48a3-8e38-826aa5a322f0
|
| 384 | 2026-09-16T17:56:07.684Z | INFO | phd-runner: [MIGRATE - START]
file = phd-tests/framework/src/test_vm/mod.rs
line = 663
migration_id = e71ea31a-560b-49f9-9636-ed50e7c6db37
path = phd_tests::migrate::from_base::migration_from_base_and_back
source = migration_from_base_and_back_lifecycle_1
source_id = 96689561-39ca-4c70-adac-a9613b2c450d
target = phd_framework::test_vm
target_id = 4bb07e4c-2e39-48a3-8e38-826aa5a322f0
|
| 385 | 2026-09-16T17:56:10.223Z | INFO | phd-runner: [SERIAL CONSOLE TASK - EVENT] serial socket control message
file = phd-tests/framework/src/serial/mod.rs
line = 275
s = {"Migrating":{"destination":"127.0.0.1:9006","from_start":7941}}
target = phd_framework::serial
|
| 386 | 2026-09-16T17:56:10.453Z | INFO | phd-runner: [MIGRATE_FROM - EVENT] Migration completed successfully
file = phd-tests/framework/src/test_vm/mod.rs
line = 676
path = phd_tests::migrate::from_base::migration_from_base_and_back
source = migration_from_base_and_back_lifecycle_1
source_id = 96689561-39ca-4c70-adac-a9613b2c450d
target = phd_framework::test_vm
target_id = 4bb07e4c-2e39-48a3-8e38-826aa5a322f0
|
| 387 | 2026-09-16T17:56:10.453Z | INFO | phd-runner: [MIGRATE - END]
elapsed_milliseconds = 2768
file = phd-tests/framework/src/test_vm/mod.rs
line = 663
migration_id = e71ea31a-560b-49f9-9636-ed50e7c6db37
path = phd_tests::migrate::from_base::migration_from_base_and_back
source = migration_from_base_and_back_lifecycle_1
source_id = 96689561-39ca-4c70-adac-a9613b2c450d
target = phd_framework::test_vm
target_id = 4bb07e4c-2e39-48a3-8e38-826aa5a322f0
|
| 388 | 2026-09-16T17:56:10.456Z | INFO | phd-runner: [VM CLEANUP - START]
file = phd-tests/framework/src/test_vm/mod.rs
line = 1172
path = phd_tests::migrate::from_base::migration_from_base_and_back
target = phd_framework::test_vm
vm = migration_from_base_and_back_lifecycle_1
vm_id = 96689561-39ca-4c70-adac-a9613b2c450d
|
| 389 | 2026-09-16T17:56:10.456Z | INFO | phd-runner: [WAIT_FOR_SERIAL_OUTPUT - START]
file = phd-tests/framework/src/test_vm/mod.rs
line = 913
path = phd_tests::migrate::from_base::migration_from_base_and_back
target = phd_framework::test_vm
vm = migration_from_base_and_back_lifecycle_2
vm_id = 4bb07e4c-2e39-48a3-8e38-826aa5a322f0
|
| 390 | 2026-09-16T17:56:10.456Z | INFO | phd-runner: [WAIT_FOR_SERIAL_OUTPUT - EVENT] Waiting for output on serial console
file = phd-tests/framework/src/test_vm/mod.rs
line = 920
path = phd_tests::migrate::from_base::migration_from_base_and_back
target = phd_framework::test_vm
timeout_duration = Explicit(15s)
vm = migration_from_base_and_back_lifecycle_2
vm_id = 4bb07e4c-2e39-48a3-8e38-826aa5a322f0
|
| 391 | 2026-09-16T17:56:10.458Z | DEBG | phd-runner: [VM CLEANUP - EVENT] Killing Propolis server process
file = phd-tests/framework/src/test_vm/server.rs
line = 177
path = phd_tests::migrate::from_base::migration_from_base_and_back
self.address = 127.0.0.1:9004
target = phd_framework::test_vm::server
vm = migration_from_base_and_back_lifecycle_1
vm_id = 96689561-39ca-4c70-adac-a9613b2c450d
|
| 392 | 2026-09-16T17:56:10.535Z | INFO | phd-runner: [VM CLEANUP - END]
elapsed_milliseconds = 79
file = phd-tests/framework/src/test_vm/mod.rs
line = 1172
path = phd_tests::migrate::from_base::migration_from_base_and_back
target = phd_framework::test_vm
vm = migration_from_base_and_back_lifecycle_1
vm_id = 96689561-39ca-4c70-adac-a9613b2c450d
|
| 393 | 2026-09-16T17:56:10.536Z | INFO | phd-runner: [INSTANCE_ENSURE_INTERNAL - END]
elapsed_milliseconds = 7969
file = phd-tests/framework/src/test_vm/mod.rs
line = 412
path = phd_tests::migrate::from_base::migration_from_base_and_back
source = migration_from_base_and_back_lifecycle_0
source_id = fed95498-728c-49e1-9564-10e3aa2bbc05
target = phd_framework::test_vm
target_id = 96689561-39ca-4c70-adac-a9613b2c450d
vm = migration_from_base_and_back_lifecycle_1
vm_id = 96689561-39ca-4c70-adac-a9613b2c450d
|
| 394 | 2026-09-16T17:56:10.536Z | INFO | phd-runner: [WAIT_FOR_SERIAL_OUTPUT - END]
elapsed_milliseconds = 79
file = phd-tests/framework/src/test_vm/mod.rs
line = 913
path = phd_tests::migrate::from_base::migration_from_base_and_back
target = phd_framework::test_vm
vm = migration_from_base_and_back_lifecycle_2
vm_id = 4bb07e4c-2e39-48a3-8e38-826aa5a322f0
|
| 395 | 2026-09-16T17:56:10.536Z | INFO | phd-runner: [MIGRATE_FROM - END]
elapsed_milliseconds = 7969
file = phd-tests/framework/src/test_vm/mod.rs
line = 609
path = phd_tests::migrate::from_base::migration_from_base_and_back
source = migration_from_base_and_back_lifecycle_0
source_id = fed95498-728c-49e1-9564-10e3aa2bbc05
target = phd_framework::test_vm
target_id = 96689561-39ca-4c70-adac-a9613b2c450d
|
| 396 | 2026-09-16T17:56:10.536Z | INFO | phd-runner: [WAIT_FOR_SERIAL_OUTPUT - START]
file = phd-tests/framework/src/test_vm/mod.rs
line = 913
path = phd_tests::migrate::from_base::migration_from_base_and_back
target = phd_framework::test_vm
vm = migration_from_base_and_back_lifecycle_2
vm_id = 4bb07e4c-2e39-48a3-8e38-826aa5a322f0
|
| 397 | 2026-09-16T17:56:10.536Z | INFO | phd-runner: [WAIT_FOR_SERIAL_OUTPUT - EVENT] Waiting for output on serial console
file = phd-tests/framework/src/test_vm/mod.rs
line = 920
path = phd_tests::migrate::from_base::migration_from_base_and_back
target = phd_framework::test_vm
timeout_duration = Explicit(300s)
vm = migration_from_base_and_back_lifecycle_2
vm_id = 4bb07e4c-2e39-48a3-8e38-826aa5a322f0
|
| 398 | 2026-09-16T17:56:10.567Z | INFO | phd-runner: [WAIT_FOR_SERIAL_OUTPUT - END]
elapsed_milliseconds = 31
file = phd-tests/framework/src/test_vm/mod.rs
line = 913
path = phd_tests::migrate::from_base::migration_from_base_and_back
target = phd_framework::test_vm
vm = migration_from_base_and_back_lifecycle_2
vm_id = 4bb07e4c-2e39-48a3-8e38-826aa5a322f0
|
| 399 | 2026-09-16T17:56:10.567Z | INFO | phd-runner: [VM CLEANUP - START]
file = phd-tests/framework/src/test_vm/mod.rs
line = 1172
path = phd_tests::migrate::from_base::migration_from_base_and_back
target = phd_framework::test_vm
vm = migration_from_base_and_back_lifecycle_2
vm_id = 4bb07e4c-2e39-48a3-8e38-826aa5a322f0
|
| 400 | 2026-09-16T17:56:10.568Z | DEBG | phd-runner: [SERIAL CONSOLE TASK - EVENT] serial console command channel was closed
file = phd-tests/framework/src/serial/mod.rs
line = 213
target = phd_framework::serial
|
| 401 | 2026-09-16T17:56:10.568Z | INFO | phd-runner: [SERIAL CONSOLE TASK - END]
elapsed_milliseconds = 17983
file = phd-tests/framework/src/serial/mod.rs
line = 200
target = phd_framework::serial
|
| 402 | 2026-09-16T17:56:10.568Z | INFO | phd-runner: test phd_tests::migrate::from_base::migration_from_base_and_back ... ok
file = phd-tests/runner/src/execute.rs
line = 141
target = phd_runner::execute
|
| 403 | 2026-09-16T17:56:10.568Z | INFO | phd-runner: [TEST_CLEANUP - START]
file = phd-tests/runner/src/fixtures.rs
line = 51
target = phd_runner::fixtures
|
| 404 | 2026-09-16T17:56:10.569Z | DEBG | phd-runner: [VM CLEANUP - EVENT] trying to ensure Propolis server VM is destroyed
file = phd-tests/framework/src/test_vm/mod.rs
line = 1195
path = phd_tests::migrate::from_base::migration_from_base_and_back
target = phd_framework::test_vm
vm = migration_from_base_and_back_lifecycle_2
vm_id = 4bb07e4c-2e39-48a3-8e38-826aa5a322f0
|
| 405 | 2026-09-16T17:56:10.974Z | DEBG | phd-runner: [VM CLEANUP - EVENT] Killing Propolis server process
file = phd-tests/framework/src/test_vm/server.rs
line = 177
path = phd_tests::migrate::from_base::migration_from_base_and_back
self.address = 127.0.0.1:9006
target = phd_framework::test_vm::server
vm = migration_from_base_and_back_lifecycle_2
vm_id = 4bb07e4c-2e39-48a3-8e38-826aa5a322f0
|
| 406 | 2026-09-16T17:56:11.061Z | DEBG | phd-runner: [VM CLEANUP - EVENT] zfs clone dropped
file = phd-tests/framework/src/zfs.rs
line = 83
path = phd_tests::migrate::from_base::migration_from_base_and_back
target = phd_framework::zfs
vm = migration_from_base_and_back_lifecycle_2
vm_id = 4bb07e4c-2e39-48a3-8e38-826aa5a322f0
|
| 407 | 2026-09-16T17:56:11.061Z | DEBG | phd-runner: [VM CLEANUP - EVENT] executing ZFS command
args = ["phd-artifacts/phd-clone-c89de1c9-a5cf-4d49-96fd-b090866781f9"]
file = phd-tests/framework/src/zfs.rs
line = 304
path = phd_tests::migrate::from_base::migration_from_base_and_back
target = phd_framework::zfs
verb = destroy
vm = migration_from_base_and_back_lifecycle_2
vm_id = 4bb07e4c-2e39-48a3-8e38-826aa5a322f0
|
| 408 | 2026-09-16T17:56:11.088Z | DEBG | phd-runner: [VM CLEANUP - EVENT] zfs snapshot dropped
file = phd-tests/framework/src/zfs.rs
line = 57
path = phd_tests::migrate::from_base::migration_from_base_and_back
target = phd_framework::zfs
vm = migration_from_base_and_back_lifecycle_2
vm_id = 4bb07e4c-2e39-48a3-8e38-826aa5a322f0
|
| 409 | 2026-09-16T17:56:11.088Z | DEBG | phd-runner: [VM CLEANUP - EVENT] executing ZFS command
args = ["phd-artifacts@phd-64ad0dde-39af-4363-8f15-22caf07675cf"]
file = phd-tests/framework/src/zfs.rs
line = 304
path = phd_tests::migrate::from_base::migration_from_base_and_back
target = phd_framework::zfs
verb = destroy
vm = migration_from_base_and_back_lifecycle_2
vm_id = 4bb07e4c-2e39-48a3-8e38-826aa5a322f0
|
| 410 | 2026-09-16T17:56:11.108Z | INFO | phd-runner: [VM CLEANUP - END]
elapsed_milliseconds = 540
file = phd-tests/framework/src/test_vm/mod.rs
line = 1172
path = phd_tests::migrate::from_base::migration_from_base_and_back
target = phd_framework::test_vm
vm = migration_from_base_and_back_lifecycle_2
vm_id = 4bb07e4c-2e39-48a3-8e38-826aa5a322f0
|
| 411 | 2026-09-16T17:56:11.108Z | INFO | phd-runner: [INSTANCE_ENSURE_INTERNAL - END]
elapsed_milliseconds = 4040
file = phd-tests/framework/src/test_vm/mod.rs
line = 412
path = phd_tests::migrate::from_base::migration_from_base_and_back
source = migration_from_base_and_back_lifecycle_1
source_id = 96689561-39ca-4c70-adac-a9613b2c450d
target = phd_framework::test_vm
target_id = 4bb07e4c-2e39-48a3-8e38-826aa5a322f0
vm = migration_from_base_and_back_lifecycle_2
vm_id = 4bb07e4c-2e39-48a3-8e38-826aa5a322f0
|
| 412 | 2026-09-16T17:56:11.108Z | INFO | phd-runner: [MIGRATE_FROM - END]
elapsed_milliseconds = 4040
file = phd-tests/framework/src/test_vm/mod.rs
line = 609
path = phd_tests::migrate::from_base::migration_from_base_and_back
source = migration_from_base_and_back_lifecycle_1
source_id = 96689561-39ca-4c70-adac-a9613b2c450d
target = phd_framework::test_vm
target_id = 4bb07e4c-2e39-48a3-8e38-826aa5a322f0
|
| 413 | 2026-09-16T17:56:11.109Z | INFO | phd-runner: [TEST - END]
elapsed_milliseconds = 19325
file = phd-tests/tests/src/migrate.rs
line = 52
path = phd_tests::migrate::from_base::migration_from_base_and_back
target = phd_tests::migrate::from_base
|
| 414 | 2026-09-16T17:56:11.109Z | INFO | phd-runner: [TEST_CLEANUP - END]
elapsed_milliseconds = 540
file = phd-tests/runner/src/fixtures.rs
line = 51
target = phd_runner::fixtures
|
| 415 | 2026-09-16T17:56:11.109Z | INFO | phd-runner: [EXECUTION_CLEANUP - START]
file = phd-tests/runner/src/fixtures.rs
line = 35
target = phd_runner::fixtures
|
| 416 | 2026-09-16T17:56:11.109Z | INFO | phd-runner: [EXECUTION_CLEANUP - END]
elapsed_milliseconds = 0
file = phd-tests/runner/src/fixtures.rs
line = 35
target = phd_runner::fixtures
|
| 417 | | test result: ok. 3 passed; 0 failed; 0 skipped; 0 not run; finished in 101.05s |
| 418 | | |
| 419 | 2026-09-16T17:56:11.111Z | DEBG | phd-runner: phd_runner
exit_code = 0
file = phd-tests/runner/src/main.rs
line = 41
target = phd_runner
|