| 1 | 2026-09-30T02:44:32.667Z | INFO | phd-runner: phd_runner
file = phd-tests/runner/src/main.rs
line = 36
runner_args = ProcessArgs { command: Run(RunOptions { propolis_server_cmd: "/work/phd-test/propolis-server", base_propolis_branch: Some("master"), base_propolis_commit: None, base_propolis_cmd: None, crucible_downstairs_cmd: None, crucible_downstairs_commit: Some(Auto), tmp_directory: "/tmp/propolis-phd", artifact_directory: Some("/phd-artifacts"), output_mode: TmpFile, default_guest_cpus: 2, default_guest_memory_mib: 512, artifact_toml_path: "/work/phd-test/artifacts.toml", default_guest_artifact: "alpine", default_bootrom_artifact: "ovmf", include_filter: ["phd_tests::migrate::from_base"], exclude_filter: [], max_buildomat_wait_secs: 1200, manual_stop_on_failure: false }), disable_ansi: false, emit_bunyan: true }
target = phd_runner
|
| 2 | 2026-09-30T02:44:32.695Z | DEBG | phd-runner: Created new artifact store from manifest
file = phd-tests/framework/src/artifacts/store.rs
line = 219
store = Store { local_dir: "/phd-artifacts", artifacts: {"alpine": Mutex { data: StoredArtifact { description: Artifact { filename: "alpine.iso", kind: GuestOs(Alpine), source: RemoteServer { sha256: "ba8007f74f9b54fbae3b2520da577831b4834778a498d732f091260c61aa7ca1" }, untar: None }, cached_path: None } }, "ovmf": Mutex { data: StoredArtifact { description: Artifact { filename: "OVMF_CODE.fd", kind: Bootrom, source: Buildomat(BuildomatArtifact { repo: Repo("oxidecomputer/edk2"), series: Series("image_debug"), commit: Commit("bf64f45b1a58e69d126a3c6ca1e4512c88668132"), sha256: "740187046a7267d0de72d3455070333547dbc0ea023531471fb2b2a61effa448" }), untar: None }, cached_path: None } }}, downloader: DownloadConfig { timeout: 600s, buildomat_backoff: ExponentialBackoff { current_interval: 1s, initial_interval: 1s, randomization_factor: 0.5, multiplier: 1.5, max_interval: 60s, start_time: Instant { tv_sec: 256, tv_nsec: 513928746 }, max_elapsed_time: Some(1200s), clock: SystemClock }, remote_server_uris: ["https://oxide-omicron-build.s3.amazonaws.com"] } }
target = phd_framework::artifacts::store
|
| 3 | 2026-09-30T02:44:32.696Z | INFO | phd-runner: Adding Propolis server from local command
file = phd-tests/framework/src/artifacts/store.rs
line = 227
propolis_server_cmd = /work/phd-test/propolis-server
target = phd_framework::artifacts::store
|
| 4 | 2026-09-30T02:44:32.697Z | INFO | phd-runner: Adding crucible-downstairs from Buildomat Git revision
commit = ad8a31742adc45e925e63443a5b43c8e30604022
file = phd-tests/framework/src/artifacts/store.rs
line = 311
target = phd_framework::artifacts::store
|
| 5 | 2026-09-30T02:44:32.703Z | DEBG | phd-runner: Downloading file from Buildomat...
file = phd-tests/framework/src/artifacts/buildomat.rs
line = 215
target = phd_framework::artifacts::buildomat
timeout = 600s
uri = https://buildomat.eng.oxide.computer/public/file/oxidecomputer/crucible/nightly-image/ad8a31742adc45e925e63443a5b43c8e30604022/crucible-nightly.sha256.txt
|
| 6 | 2026-09-30T02:44:35.505Z | INFO | phd-runner: Adding 'current' Propolis server from Buildomat Git branch 'master'
file = phd-tests/framework/src/artifacts/store.rs
line = 248
target = phd_framework::artifacts::store
|
| 7 | 2026-09-30T02:44:36.177Z | DEBG | phd-runner: Downloading file from Buildomat...
file = phd-tests/framework/src/artifacts/buildomat.rs
line = 215
target = phd_framework::artifacts::buildomat
timeout = 600s
uri = https://buildomat.eng.oxide.computer/public/file/oxidecomputer/propolis/phd_build/5e201ec4185ccb9182cc6ffcb09fadd9deee24ca/propolis-server.sha256.txt
|
| 8 | 2026-09-30T02:44:36.371Z | INFO | phd-runner: [EXECUTION_SETUP - START]
file = phd-tests/runner/src/fixtures.rs
line = 25
target = phd_runner::fixtures
|
| 9 | 2026-09-30T02:44:36.372Z | INFO | phd-runner: [EXECUTION_SETUP - END]
elapsed_milliseconds = 0
file = phd-tests/runner/src/fixtures.rs
line = 25
target = phd_runner::fixtures
|
| 10 | 2026-09-30T02:44:36.374Z | INFO | phd-runner: Running 3 test(s)
file = phd-tests/runner/src/execute.rs
line = 83
target = phd_runner::execute
|
| 11 | 2026-09-30T02:44:36.375Z | INFO | phd-runner: Starting test phd_tests::migrate::from_base::serial_history
file = phd-tests/runner/src/execute.rs
line = 91
target = phd_runner::execute
|
| 12 | 2026-09-30T02:44:36.375Z | INFO | phd-runner: [TEST_SETUP - START]
file = phd-tests/runner/src/fixtures.rs
line = 41
target = phd_runner::fixtures
|
| 13 | 2026-09-30T02:44:36.375Z | INFO | phd-runner: [TEST_SETUP - END]
elapsed_milliseconds = 0
file = phd-tests/runner/src/fixtures.rs
line = 41
target = phd_runner::fixtures
|
| 14 | 2026-09-30T02:44:36.376Z | INFO | phd-runner: [TEST - START]
file = phd-tests/tests/src/migrate.rs
line = 40
path = phd_tests::migrate::from_base::serial_history
target = phd_tests::migrate::from_base
|
| 15 | 2026-09-30T02:44:36.377Z | DEBG | phd-runner: [TEST - EVENT] checking for existing copy of artifact
file = phd-tests/framework/src/artifacts/store.rs
line = 89
maybe_path = /phd-artifacts/740187046a7267d0de72d3455070333547dbc0ea023531471fb2b2a61effa448/OVMF_CODE.fd
path = phd_tests::migrate::from_base::serial_history
target = phd_framework::artifacts::store
|
| 16 | 2026-09-30T02:44:36.379Z | DEBG | phd-runner: [TEST - EVENT] Downloading file from Buildomat...
file = phd-tests/framework/src/artifacts/buildomat.rs
line = 215
path = phd_tests::migrate::from_base::serial_history
target = phd_framework::artifacts::buildomat
timeout = 600s
uri = https://buildomat.eng.oxide.computer/public/file/oxidecomputer/edk2/image_debug/bf64f45b1a58e69d126a3c6ca1e4512c88668132/OVMF_CODE.fd
|
| 17 | 2026-09-30T02:44:36.835Z | DEBG | phd-runner: [TEST - EVENT] checking for existing copy of artifact
file = phd-tests/framework/src/artifacts/store.rs
line = 89
maybe_path = /phd-artifacts/ba8007f74f9b54fbae3b2520da577831b4834778a498d732f091260c61aa7ca1/alpine.iso
path = phd_tests::migrate::from_base::serial_history
target = phd_framework::artifacts::store
|
| 18 | 2026-09-30T02:44:36.848Z | DEBG | phd-runner: [TEST - EVENT] Downloading alpine.iso from https://oxide-omicron-build.s3.amazonaws.com/alpine.iso
file = phd-tests/framework/src/artifacts/store.rs
line = 614
path = phd_tests::migrate::from_base::serial_history
target = phd_framework::artifacts::store
timeout = 600s
|
| 19 | 2026-09-30T02:44:43.467Z | DEBG | phd-runner: [TEST - EVENT] Verified artifact already exists
file = phd-tests/framework/src/artifacts/store.rs
line = 45
path = /phd-artifacts/ba8007f74f9b54fbae3b2520da577831b4834778a498d732f091260c61aa7ca1/alpine.iso
target = phd_framework::artifacts::store
|
| 20 | 2026-09-30T02:44:43.467Z | DEBG | phd-runner: [TEST - EVENT] executing ZFS command
args = ["/phd-artifacts/ba8007f74f9b54fbae3b2520da577831b4834778a498d732f091260c61aa7ca1/alpine.iso"]
file = phd-tests/framework/src/zfs.rs
line = 304
path = phd_tests::migrate::from_base::serial_history
target = phd_framework::zfs
verb = list
|
| 21 | 2026-09-30T02:44:43.483Z | DEBG | phd-runner: [TEST - EVENT] parsing zfs list output
file = phd-tests/framework/src/zfs.rs
line = 238
path = phd_tests::migrate::from_base::serial_history
stdout = NAME USED AVAIL REFER MOUNTPOINT\nphd-artifacts 3.83M 25.3T 2M /phd-artifacts\n
target = phd_framework::zfs
|
| 22 | 2026-09-30T02:44:43.485Z | DEBG | phd-runner: [TEST - EVENT] executing ZFS command
args = ["phd-artifacts@phd-aa7571c0-727e-4e83-89c0-f25bf71c9d27"]
file = phd-tests/framework/src/zfs.rs
line = 304
path = phd_tests::migrate::from_base::serial_history
target = phd_framework::zfs
verb = snapshot
|
| 23 | 2026-09-30T02:44:43.505Z | DEBG | phd-runner: [TEST - EVENT] executing ZFS command
args = ["phd-artifacts@phd-aa7571c0-727e-4e83-89c0-f25bf71c9d27", "phd-artifacts/phd-clone-2f178a74-8285-4a53-837d-233ee5113c57"]
file = phd-tests/framework/src/zfs.rs
line = 304
path = phd_tests::migrate::from_base::serial_history
target = phd_framework::zfs
verb = clone
|
| 24 | 2026-09-30T02:44:43.522Z | DEBG | phd-runner: [TEST - EVENT] executing ZFS command
args = ["phd-artifacts/phd-clone-2f178a74-8285-4a53-837d-233ee5113c57"]
file = phd-tests/framework/src/zfs.rs
line = 304
path = phd_tests::migrate::from_base::serial_history
target = phd_framework::zfs
verb = list
|
| 25 | 2026-09-30T02:44:43.533Z | DEBG | phd-runner: [TEST - EVENT] parsing zfs list output
file = phd-tests/framework/src/zfs.rs
line = 238
path = phd_tests::migrate::from_base::serial_history
stdout = NAME USED AVAIL REFER MOUNTPOINT\nphd-artifacts/phd-clone-2f178a74-8285-4a53-837d-233ee5113c57 0B 25.3T 49.0M /phd-artifacts/phd-clone-2f178a74-8285-4a53-837d-233ee5113c57\n
target = phd_framework::zfs
|
| 26 | 2026-09-30T02:44:43.537Z | INFO | phd-runner: [NEW - START]
file = phd-tests/framework/src/test_vm/mod.rs
line = 300
path = phd_tests::migrate::from_base::serial_history
target = phd_framework::test_vm
|
| 27 | 2026-09-30T02:44:43.538Z | INFO | phd-runner: [NEW - EVENT] phd_framework::test_vm
environment = EnvironmentSpec { location: Local, propolis_artifact: "__BASE_PROPOLIS", metrics: None }
file = phd-tests/framework/src/test_vm/mod.rs
guest_os_kind = Alpine
line = 318
path = phd_tests::migrate::from_base::serial_history
target = phd_framework::test_vm
vm_name = migration_serial_history_base
|
| 28 | 2026-09-30T02:44:43.538Z | DEBG | phd-runner: [NEW - EVENT] checking for existing copy of artifact
file = phd-tests/framework/src/artifacts/store.rs
line = 89
maybe_path = /phd-artifacts/1e7667ffdc98b10de9e84d649107cd4d14e4a206aca4e30bf33d9d472c03b8ae/propolis-server.tar.gz
path = phd_tests::migrate::from_base::serial_history
target = phd_framework::artifacts::store
|
| 29 | 2026-09-30T02:44:43.538Z | DEBG | phd-runner: [NEW - EVENT] Downloading file from Buildomat...
file = phd-tests/framework/src/artifacts/buildomat.rs
line = 215
path = phd_tests::migrate::from_base::serial_history
target = phd_framework::artifacts::buildomat
timeout = 600s
uri = https://buildomat.eng.oxide.computer/public/file/oxidecomputer/propolis/phd_build/5e201ec4185ccb9182cc6ffcb09fadd9deee24ca/propolis-server.tar.gz
|
| 30 | 2026-09-30T02:45:01.080Z | DEBG | phd-runner: [NEW - EVENT] Extracting artifact from tarball
extracted_path = /phd-artifacts/1e7667ffdc98b10de9e84d649107cd4d14e4a206aca4e30bf33d9d472c03b8ae/propolis-server
file = phd-tests/framework/src/artifacts/store.rs
line = 160
path = phd_tests::migrate::from_base::serial_history
target = phd_framework::artifacts::store
untar_path = propolis-server
|
| 31 | 2026-09-30T02:45:01.080Z | DEBG | phd-runner: [NEW - EVENT] Extracting gzipped tarball...
file = phd-tests/framework/src/artifacts/store.rs
line = 514
path = phd_tests::migrate::from_base::serial_history
target = phd_framework::artifacts::store
|
| 32 | 2026-09-30T02:45:26.307Z | INFO | phd-runner: [NEW - EVENT] Launching Propolis server
bootrom_path = "/phd-artifacts/740187046a7267d0de72d3455070333547dbc0ea023531471fb2b2a61effa448/OVMF_CODE.fd"
file = phd-tests/framework/src/test_vm/server.rs
line = 66
path = phd_tests::migrate::from_base::serial_history
server_addr = 127.0.0.1:9000
server_path = "/phd-artifacts/1e7667ffdc98b10de9e84d649107cd4d14e4a206aca4e30bf33d9d472c03b8ae/propolis-server"
target = phd_framework::test_vm::server
|
| 33 | 2026-09-30T02:45:26.307Z | INFO | phd-runner: [NEW - EVENT] Opening server log files
file = phd-tests/framework/src/log_config.rs
line = 84
path = phd_tests::migrate::from_base::serial_history
stderr_path = "/tmp/propolis-phd/phd_tests::migrate::from_base::serial_history/migration_serial_history_base.stderr.log"
stdout_path = "/tmp/propolis-phd/phd_tests::migrate::from_base::serial_history/migration_serial_history_base.stdout.log"
target = phd_framework::log_config
|
| 34 | 2026-09-30T02:45:26.449Z | INFO | phd-runner: [NEW - EVENT] Launched server with pid 917
file = phd-tests/framework/src/test_vm/server.rs
line = 127
path = phd_tests::migrate::from_base::serial_history
target = phd_framework::test_vm::server
|
| 35 | 2026-09-30T02:45:26.465Z | INFO | phd-runner: [INSTANCE_ENSURE_INTERNAL - START]
file = phd-tests/framework/src/test_vm/mod.rs
line = 412
path = phd_tests::migrate::from_base::serial_history
target = phd_framework::test_vm
vm = migration_serial_history_base
vm_id = 34d7e74c-edd4-4137-97d3-54c6661e3aa0
|
| 36 | 2026-09-30T02:45:26.476Z | INFO | phd-runner: [INSTANCE_ENSURE_INTERNAL - EVENT] retriable error from instance_spec_ensure
e = Communication Error: error sending request for url (http://127.0.0.1:9000/instance)
file = phd-tests/framework/src/test_vm/mod.rs
line = 455
path = phd_tests::migrate::from_base::serial_history
target = phd_framework::test_vm
vm = migration_serial_history_base
vm_id = 34d7e74c-edd4-4137-97d3-54c6661e3aa0
|
| 37 | 2026-09-30T02:45:26.480Z | INFO | phd-runner: [NEW - END]
elapsed_milliseconds = 42943
file = phd-tests/framework/src/test_vm/mod.rs
line = 300
path = phd_tests::migrate::from_base::serial_history
target = phd_framework::test_vm
|
| 38 | 2026-09-30T02:45:27.165Z | INFO | phd-runner: [SERIAL CONSOLE TASK - START]
file = phd-tests/framework/src/serial/mod.rs
line = 200
target = phd_framework::serial
|
| 39 | 2026-09-30T02:45:27.172Z | INFO | phd-runner: [INSTANCE_ENSURE_INTERNAL - EVENT] Started instance
file = phd-tests/framework/src/test_vm/mod.rs
instance_description.instance = Instance { properties: InstanceProperties { id: 34d7e74c-edd4-4137-97d3-54c6661e3aa0, name: "phd-vm-34d7e74c-edd4-4137-97d3-54c6661e3aa0", description: "Pheidippides-managed VM", metadata: InstanceMetadata { silo_id: 8a3fc971-ce24-4c9c-9bde-440dd5827558, project_id: b4bb70c3-743e-4da3-882d-94e08cd925b3, sled_id: c92569f3-4a6c-4e8b-ae91-ce45102a49a4, sled_serial: "c92569f3-4a6c-4e8b-ae91-ce45102a49a4", sled_revision: 1, sled_model: "pheidippes" } }, state: Creating }
line = 514
path = phd_tests::migrate::from_base::serial_history
target = phd_framework::test_vm
vm = migration_serial_history_base
vm_id = 34d7e74c-edd4-4137-97d3-54c6661e3aa0
|
| 40 | 2026-09-30T02:45:27.172Z | INFO | phd-runner: [PUT_INSTANCE_STATE - START]
file = phd-tests/framework/src/test_vm/mod.rs
line = 575
path = phd_tests::migrate::from_base::serial_history
target = phd_framework::test_vm
vm = migration_serial_history_base
vm_id = 34d7e74c-edd4-4137-97d3-54c6661e3aa0
|
| 41 | 2026-09-30T02:45:27.172Z | INFO | phd-runner: [PUT_INSTANCE_STATE - EVENT] Requesting instance state change
file = phd-tests/framework/src/test_vm/mod.rs
line = 580
path = phd_tests::migrate::from_base::serial_history
state = Run
target = phd_framework::test_vm
vm = migration_serial_history_base
vm_id = 34d7e74c-edd4-4137-97d3-54c6661e3aa0
|
| 42 | 2026-09-30T02:45:27.175Z | INFO | phd-runner: [PUT_INSTANCE_STATE - END]
elapsed_milliseconds = 2
file = phd-tests/framework/src/test_vm/mod.rs
line = 575
path = phd_tests::migrate::from_base::serial_history
target = phd_framework::test_vm
vm = migration_serial_history_base
vm_id = 34d7e74c-edd4-4137-97d3-54c6661e3aa0
|
| 43 | 2026-09-30T02:45:27.175Z | INFO | phd-runner: [WAIT_TO_BOOT - START]
file = phd-tests/framework/src/test_vm/mod.rs
line = 890
path = phd_tests::migrate::from_base::serial_history
target = phd_framework::test_vm
|
| 44 | 2026-09-30T02:45:27.175Z | INFO | phd-runner: [WAIT_TO_BOOT - EVENT] waiting for guest to boot
file = phd-tests/framework/src/test_vm/mod.rs
line = 839
path = phd_tests::migrate::from_base::serial_history
target = phd_framework::test_vm
timeout_duration = 300s
vm = migration_serial_history_base
vm_id = 34d7e74c-edd4-4137-97d3-54c6661e3aa0
|
| 45 | 2026-09-30T02:45:27.175Z | DEBG | phd-runner: [WAIT_TO_BOOT - EVENT] executing command in boot sequence
file = phd-tests/framework/src/test_vm/mod.rs
line = 847
path = phd_tests::migrate::from_base::serial_history
step = WaitFor("localhost login: ")
target = phd_framework::test_vm
|
| 46 | 2026-09-30T02:45:27.175Z | INFO | phd-runner: [WAIT_FOR_SERIAL_OUTPUT - START]
file = phd-tests/framework/src/test_vm/mod.rs
line = 913
path = phd_tests::migrate::from_base::serial_history
target = phd_framework::test_vm
vm = migration_serial_history_base
vm_id = 34d7e74c-edd4-4137-97d3-54c6661e3aa0
|
| 47 | 2026-09-30T02:45:27.175Z | INFO | phd-runner: [WAIT_FOR_SERIAL_OUTPUT - EVENT] Waiting for output on serial console
file = phd-tests/framework/src/test_vm/mod.rs
line = 920
path = phd_tests::migrate::from_base::serial_history
target = phd_framework::test_vm
timeout_duration = CallerTimeout
vm = migration_serial_history_base
vm_id = 34d7e74c-edd4-4137-97d3-54c6661e3aa0
|
| 48 | 2026-09-30T02:45:31.780Z | INFO | phd-runner: [WAIT_FOR_SERIAL_OUTPUT - END]
elapsed_milliseconds = 4604
file = phd-tests/framework/src/test_vm/mod.rs
line = 913
path = phd_tests::migrate::from_base::serial_history
target = phd_framework::test_vm
vm = migration_serial_history_base
vm_id = 34d7e74c-edd4-4137-97d3-54c6661e3aa0
|
| 49 | 2026-09-30T02:45:31.780Z | DEBG | phd-runner: [WAIT_TO_BOOT - EVENT] executing command in boot sequence
file = phd-tests/framework/src/test_vm/mod.rs
line = 847
path = phd_tests::migrate::from_base::serial_history
step = WriteStr("root")
target = phd_framework::test_vm
|
| 50 | 2026-09-30T02:45:31.782Z | DEBG | phd-runner: [WAIT_TO_BOOT - EVENT] executing command in boot sequence
file = phd-tests/framework/src/test_vm/mod.rs
line = 847
path = phd_tests::migrate::from_base::serial_history
step = WaitFor("localhost:~#")
target = phd_framework::test_vm
|
| 51 | 2026-09-30T02:45:31.782Z | INFO | phd-runner: [WAIT_FOR_SERIAL_OUTPUT - START]
file = phd-tests/framework/src/test_vm/mod.rs
line = 913
path = phd_tests::migrate::from_base::serial_history
target = phd_framework::test_vm
vm = migration_serial_history_base
vm_id = 34d7e74c-edd4-4137-97d3-54c6661e3aa0
|
| 52 | 2026-09-30T02:45:31.782Z | INFO | phd-runner: [WAIT_FOR_SERIAL_OUTPUT - EVENT] Waiting for output on serial console
file = phd-tests/framework/src/test_vm/mod.rs
line = 920
path = phd_tests::migrate::from_base::serial_history
target = phd_framework::test_vm
timeout_duration = CallerTimeout
vm = migration_serial_history_base
vm_id = 34d7e74c-edd4-4137-97d3-54c6661e3aa0
|
| 53 | 2026-09-30T02:45:31.809Z | INFO | phd-runner: [WAIT_FOR_SERIAL_OUTPUT - END]
elapsed_milliseconds = 26
file = phd-tests/framework/src/test_vm/mod.rs
line = 913
path = phd_tests::migrate::from_base::serial_history
target = phd_framework::test_vm
vm = migration_serial_history_base
vm_id = 34d7e74c-edd4-4137-97d3-54c6661e3aa0
|
| 54 | 2026-09-30T02:45:31.809Z | DEBG | phd-runner: [WAIT_TO_BOOT - EVENT] executing command in boot sequence
file = phd-tests/framework/src/test_vm/mod.rs
line = 847
path = phd_tests::migrate::from_base::serial_history
step = WriteStr("stty -F `tty` cols 9999")
target = phd_framework::test_vm
|
| 55 | 2026-09-30T02:45:31.810Z | DEBG | phd-runner: [WAIT_TO_BOOT - EVENT] executing command in boot sequence
file = phd-tests/framework/src/test_vm/mod.rs
line = 847
path = phd_tests::migrate::from_base::serial_history
step = WaitFor("localhost:~#")
target = phd_framework::test_vm
|
| 56 | 2026-09-30T02:45:31.810Z | INFO | phd-runner: [WAIT_FOR_SERIAL_OUTPUT - START]
file = phd-tests/framework/src/test_vm/mod.rs
line = 913
path = phd_tests::migrate::from_base::serial_history
target = phd_framework::test_vm
vm = migration_serial_history_base
vm_id = 34d7e74c-edd4-4137-97d3-54c6661e3aa0
|
| 57 | 2026-09-30T02:45:31.810Z | INFO | phd-runner: [WAIT_FOR_SERIAL_OUTPUT - EVENT] Waiting for output on serial console
file = phd-tests/framework/src/test_vm/mod.rs
line = 920
path = phd_tests::migrate::from_base::serial_history
target = phd_framework::test_vm
timeout_duration = CallerTimeout
vm = migration_serial_history_base
vm_id = 34d7e74c-edd4-4137-97d3-54c6661e3aa0
|
| 58 | 2026-09-30T02:45:31.843Z | INFO | phd-runner: [WAIT_FOR_SERIAL_OUTPUT - END]
elapsed_milliseconds = 32
file = phd-tests/framework/src/test_vm/mod.rs
line = 913
path = phd_tests::migrate::from_base::serial_history
target = phd_framework::test_vm
vm = migration_serial_history_base
vm_id = 34d7e74c-edd4-4137-97d3-54c6661e3aa0
|
| 59 | 2026-09-30T02:45:31.843Z | INFO | phd-runner: [WAIT_TO_BOOT - EVENT] Guest has booted
file = phd-tests/framework/src/test_vm/mod.rs
line = 887
path = phd_tests::migrate::from_base::serial_history
target = phd_framework::test_vm
|
| 60 | 2026-09-30T02:45:31.843Z | INFO | phd-runner: [WAIT_TO_BOOT - END]
elapsed_milliseconds = 4667
file = phd-tests/framework/src/test_vm/mod.rs
line = 890
path = phd_tests::migrate::from_base::serial_history
target = phd_framework::test_vm
|
| 61 | 2026-09-30T02:45:31.844Z | INFO | phd-runner: [WAIT_FOR_SERIAL_OUTPUT - START]
file = phd-tests/framework/src/test_vm/mod.rs
line = 913
path = phd_tests::migrate::from_base::serial_history
target = phd_framework::test_vm
vm = migration_serial_history_base
vm_id = 34d7e74c-edd4-4137-97d3-54c6661e3aa0
|
| 62 | 2026-09-30T02:45:31.845Z | INFO | phd-runner: [WAIT_FOR_SERIAL_OUTPUT - EVENT] Waiting for output on serial console
file = phd-tests/framework/src/test_vm/mod.rs
line = 920
path = phd_tests::migrate::from_base::serial_history
target = phd_framework::test_vm
timeout_duration = Explicit(15s)
vm = migration_serial_history_base
vm_id = 34d7e74c-edd4-4137-97d3-54c6661e3aa0
|
| 63 | 2026-09-30T02:45:31.855Z | INFO | phd-runner: [WAIT_FOR_SERIAL_OUTPUT - END]
elapsed_milliseconds = 9
file = phd-tests/framework/src/test_vm/mod.rs
line = 913
path = phd_tests::migrate::from_base::serial_history
target = phd_framework::test_vm
vm = migration_serial_history_base
vm_id = 34d7e74c-edd4-4137-97d3-54c6661e3aa0
|
| 64 | 2026-09-30T02:45:31.855Z | INFO | phd-runner: [WAIT_FOR_SERIAL_OUTPUT - START]
file = phd-tests/framework/src/test_vm/mod.rs
line = 913
path = phd_tests::migrate::from_base::serial_history
target = phd_framework::test_vm
vm = migration_serial_history_base
vm_id = 34d7e74c-edd4-4137-97d3-54c6661e3aa0
|
| 65 | 2026-09-30T02:45:31.855Z | INFO | phd-runner: [WAIT_FOR_SERIAL_OUTPUT - EVENT] Waiting for output on serial console
file = phd-tests/framework/src/test_vm/mod.rs
line = 920
path = phd_tests::migrate::from_base::serial_history
target = phd_framework::test_vm
timeout_duration = Explicit(300s)
vm = migration_serial_history_base
vm_id = 34d7e74c-edd4-4137-97d3-54c6661e3aa0
|
| 66 | 2026-09-30T02:45:31.888Z | INFO | phd-runner: [WAIT_FOR_SERIAL_OUTPUT - END]
elapsed_milliseconds = 33
file = phd-tests/framework/src/test_vm/mod.rs
line = 913
path = phd_tests::migrate::from_base::serial_history
target = phd_framework::test_vm
vm = migration_serial_history_base
vm_id = 34d7e74c-edd4-4137-97d3-54c6661e3aa0
|
| 67 | 2026-09-30T02:45:31.888Z | INFO | phd-runner: [WAIT_FOR_SERIAL_OUTPUT - START]
file = phd-tests/framework/src/test_vm/mod.rs
line = 913
path = phd_tests::migrate::from_base::serial_history
target = phd_framework::test_vm
vm = migration_serial_history_base
vm_id = 34d7e74c-edd4-4137-97d3-54c6661e3aa0
|
| 68 | 2026-09-30T02:45:31.889Z | INFO | phd-runner: [WAIT_FOR_SERIAL_OUTPUT - EVENT] Waiting for output on serial console
file = phd-tests/framework/src/test_vm/mod.rs
line = 920
path = phd_tests::migrate::from_base::serial_history
target = phd_framework::test_vm
timeout_duration = Explicit(15s)
vm = migration_serial_history_base
vm_id = 34d7e74c-edd4-4137-97d3-54c6661e3aa0
|
| 69 | 2026-09-30T02:45:31.900Z | INFO | phd-runner: [WAIT_FOR_SERIAL_OUTPUT - END]
elapsed_milliseconds = 10
file = phd-tests/framework/src/test_vm/mod.rs
line = 913
path = phd_tests::migrate::from_base::serial_history
target = phd_framework::test_vm
vm = migration_serial_history_base
vm_id = 34d7e74c-edd4-4137-97d3-54c6661e3aa0
|
| 70 | 2026-09-30T02:45:31.900Z | INFO | phd-runner: [WAIT_FOR_SERIAL_OUTPUT - START]
file = phd-tests/framework/src/test_vm/mod.rs
line = 913
path = phd_tests::migrate::from_base::serial_history
target = phd_framework::test_vm
vm = migration_serial_history_base
vm_id = 34d7e74c-edd4-4137-97d3-54c6661e3aa0
|
| 71 | 2026-09-30T02:45:31.900Z | INFO | phd-runner: [WAIT_FOR_SERIAL_OUTPUT - EVENT] Waiting for output on serial console
file = phd-tests/framework/src/test_vm/mod.rs
line = 920
path = phd_tests::migrate::from_base::serial_history
target = phd_framework::test_vm
timeout_duration = Explicit(300s)
vm = migration_serial_history_base
vm_id = 34d7e74c-edd4-4137-97d3-54c6661e3aa0
|
| 72 | 2026-09-30T02:45:31.933Z | INFO | phd-runner: [WAIT_FOR_SERIAL_OUTPUT - END]
elapsed_milliseconds = 33
file = phd-tests/framework/src/test_vm/mod.rs
line = 913
path = phd_tests::migrate::from_base::serial_history
target = phd_framework::test_vm
vm = migration_serial_history_base
vm_id = 34d7e74c-edd4-4137-97d3-54c6661e3aa0
|
| 73 | 2026-09-30T02:45:31.944Z | INFO | phd-runner: [TEST - EVENT] migrating to new Propolis artifact for lifecycle test
file = phd-tests/framework/src/lifecycle.rs
line = 73
path = phd_tests::migrate::from_base::serial_history
propolis_artifact = __DEFAULT_PROPOLIS
target = phd_framework::lifecycle
vm_name = migration_serial_history_base
|
| 74 | 2026-09-30T02:45:31.944Z | INFO | phd-runner: [NEW - START]
file = phd-tests/framework/src/test_vm/mod.rs
line = 300
path = phd_tests::migrate::from_base::serial_history
target = phd_framework::test_vm
|
| 75 | 2026-09-30T02:45:31.944Z | INFO | phd-runner: [NEW - EVENT] phd_framework::test_vm
environment = EnvironmentSpec { location: Local, propolis_artifact: "__DEFAULT_PROPOLIS", metrics: None }
file = phd-tests/framework/src/test_vm/mod.rs
guest_os_kind = Alpine
line = 318
path = phd_tests::migrate::from_base::serial_history
target = phd_framework::test_vm
vm_name = migration_serial_history_base_lifecycle_0
|
| 76 | 2026-09-30T02:45:31.945Z | DEBG | phd-runner: [NEW - EVENT] Examining locally-sourced artifact
file = phd-tests/framework/src/artifacts/store.rs
line = 56
path = /work/phd-test/propolis-server
sha256 = None
target = phd_framework::artifacts::store
|
| 77 | 2026-09-30T02:45:31.945Z | DEBG | phd-runner: [NEW - EVENT] Locally-sourced artifact is valid, caching its path
file = phd-tests/framework/src/artifacts/store.rs
line = 69
path = /work/phd-test/propolis-server
target = phd_framework::artifacts::store
|
| 78 | 2026-09-30T02:45:31.945Z | INFO | phd-runner: [NEW - EVENT] Launching Propolis server
bootrom_path = "/phd-artifacts/740187046a7267d0de72d3455070333547dbc0ea023531471fb2b2a61effa448/OVMF_CODE.fd"
file = phd-tests/framework/src/test_vm/server.rs
line = 66
path = phd_tests::migrate::from_base::serial_history
server_addr = 127.0.0.1:9002
server_path = "/work/phd-test/propolis-server"
target = phd_framework::test_vm::server
|
| 79 | 2026-09-30T02:45:31.945Z | INFO | phd-runner: [NEW - EVENT] Opening server log files
file = phd-tests/framework/src/log_config.rs
line = 84
path = phd_tests::migrate::from_base::serial_history
stderr_path = "/tmp/propolis-phd/phd_tests::migrate::from_base::serial_history/migration_serial_history_base_lifecycle_0.stderr.log"
stdout_path = "/tmp/propolis-phd/phd_tests::migrate::from_base::serial_history/migration_serial_history_base_lifecycle_0.stdout.log"
target = phd_framework::log_config
|
| 80 | 2026-09-30T02:45:31.984Z | INFO | phd-runner: [NEW - EVENT] Launched server with pid 918
file = phd-tests/framework/src/test_vm/server.rs
line = 127
path = phd_tests::migrate::from_base::serial_history
target = phd_framework::test_vm::server
|
| 81 | 2026-09-30T02:45:31.996Z | INFO | phd-runner: [NEW - END]
elapsed_milliseconds = 52
file = phd-tests/framework/src/test_vm/mod.rs
line = 300
path = phd_tests::migrate::from_base::serial_history
target = phd_framework::test_vm
|
| 82 | 2026-09-30T02:45:31.996Z | INFO | phd-runner: [MIGRATE_FROM - START]
file = phd-tests/framework/src/test_vm/mod.rs
line = 609
path = phd_tests::migrate::from_base::serial_history
source = migration_serial_history_base
source_id = 34d7e74c-edd4-4137-97d3-54c6661e3aa0
target = phd_framework::test_vm
target_id = c45749ca-0100-4c3f-9581-f23188564ebf
|
| 83 | 2026-09-30T02:45:31.997Z | INFO | phd-runner: [MIGRATE_FROM - EVENT] Migrating from source at address 127.0.0.1:9000
file = phd-tests/framework/src/test_vm/mod.rs
line = 642
migration_id = a4cf902f-109e-421b-9683-95aeb3f9f714
path = phd_tests::migrate::from_base::serial_history
source = migration_serial_history_base
source_id = 34d7e74c-edd4-4137-97d3-54c6661e3aa0
target = phd_framework::test_vm
target_id = c45749ca-0100-4c3f-9581-f23188564ebf
timeout_duration = 45s
|
| 84 | 2026-09-30T02:45:31.997Z | INFO | phd-runner: [INSTANCE_ENSURE_INTERNAL - START]
file = phd-tests/framework/src/test_vm/mod.rs
line = 412
path = phd_tests::migrate::from_base::serial_history
source = migration_serial_history_base
source_id = 34d7e74c-edd4-4137-97d3-54c6661e3aa0
target = phd_framework::test_vm
target_id = c45749ca-0100-4c3f-9581-f23188564ebf
vm = migration_serial_history_base_lifecycle_0
vm_id = c45749ca-0100-4c3f-9581-f23188564ebf
|
| 85 | 2026-09-30T02:45:31.998Z | INFO | phd-runner: [INSTANCE_ENSURE_INTERNAL - EVENT] retriable error from instance_spec_ensure
e = Communication Error: error sending request for url (http://127.0.0.1:9002/instance)
file = phd-tests/framework/src/test_vm/mod.rs
line = 455
path = phd_tests::migrate::from_base::serial_history
source = migration_serial_history_base
source_id = 34d7e74c-edd4-4137-97d3-54c6661e3aa0
target = phd_framework::test_vm
target_id = c45749ca-0100-4c3f-9581-f23188564ebf
vm = migration_serial_history_base_lifecycle_0
vm_id = c45749ca-0100-4c3f-9581-f23188564ebf
|
| 86 | 2026-09-30T02:45:32.641Z | INFO | phd-runner: [INSTANCE_ENSURE_INTERNAL - EVENT] Started instance
file = phd-tests/framework/src/test_vm/mod.rs
instance_description.instance = Instance { properties: InstanceProperties { id: c45749ca-0100-4c3f-9581-f23188564ebf, name: "phd-vm-c45749ca-0100-4c3f-9581-f23188564ebf", description: "Pheidippides-managed VM", metadata: InstanceMetadata { silo_id: 8a3fc971-ce24-4c9c-9bde-440dd5827558, project_id: b4bb70c3-743e-4da3-882d-94e08cd925b3, sled_id: e20f8ac5-4a42-420b-b4a5-abc970e15979, sled_serial: "e20f8ac5-4a42-420b-b4a5-abc970e15979", sled_revision: 1, sled_model: "pheidippes" } }, state: Migrating }
line = 514
path = phd_tests::migrate::from_base::serial_history
source = migration_serial_history_base
source_id = 34d7e74c-edd4-4137-97d3-54c6661e3aa0
target = phd_framework::test_vm
target_id = c45749ca-0100-4c3f-9581-f23188564ebf
vm = migration_serial_history_base_lifecycle_0
vm_id = c45749ca-0100-4c3f-9581-f23188564ebf
|
| 87 | 2026-09-30T02:45:32.642Z | INFO | phd-runner: [MIGRATE - START]
file = phd-tests/framework/src/test_vm/mod.rs
line = 663
migration_id = a4cf902f-109e-421b-9683-95aeb3f9f714
path = phd_tests::migrate::from_base::serial_history
source = migration_serial_history_base
source_id = 34d7e74c-edd4-4137-97d3-54c6661e3aa0
target = phd_framework::test_vm
target_id = c45749ca-0100-4c3f-9581-f23188564ebf
|
| 88 | 2026-09-30T02:45:35.166Z | INFO | phd-runner: [SERIAL CONSOLE TASK - EVENT] serial socket control message
file = phd-tests/framework/src/serial/mod.rs
line = 275
s = {"Migrating":{"destination":"127.0.0.1:9002","from_start":7756}}
target = phd_framework::serial
|
| 89 | 2026-09-30T02:45:35.534Z | INFO | phd-runner: [MIGRATE_FROM - EVENT] Migration completed successfully
file = phd-tests/framework/src/test_vm/mod.rs
line = 676
path = phd_tests::migrate::from_base::serial_history
source = migration_serial_history_base
source_id = 34d7e74c-edd4-4137-97d3-54c6661e3aa0
target = phd_framework::test_vm
target_id = c45749ca-0100-4c3f-9581-f23188564ebf
|
| 90 | 2026-09-30T02:45:35.534Z | INFO | phd-runner: [MIGRATE - END]
elapsed_milliseconds = 2892
file = phd-tests/framework/src/test_vm/mod.rs
line = 663
migration_id = a4cf902f-109e-421b-9683-95aeb3f9f714
path = phd_tests::migrate::from_base::serial_history
source = migration_serial_history_base
source_id = 34d7e74c-edd4-4137-97d3-54c6661e3aa0
target = phd_framework::test_vm
target_id = c45749ca-0100-4c3f-9581-f23188564ebf
|
| 91 | 2026-09-30T02:45:35.537Z | INFO | phd-runner: [VM CLEANUP - START]
file = phd-tests/framework/src/test_vm/mod.rs
line = 1172
path = phd_tests::migrate::from_base::serial_history
target = phd_framework::test_vm
vm = migration_serial_history_base
vm_id = 34d7e74c-edd4-4137-97d3-54c6661e3aa0
|
| 92 | 2026-09-30T02:45:35.541Z | DEBG | phd-runner: [VM CLEANUP - EVENT] Killing Propolis server process
file = phd-tests/framework/src/test_vm/server.rs
line = 177
path = phd_tests::migrate::from_base::serial_history
self.address = 127.0.0.1:9000
target = phd_framework::test_vm::server
vm = migration_serial_history_base
vm_id = 34d7e74c-edd4-4137-97d3-54c6661e3aa0
|
| 93 | 2026-09-30T02:45:35.617Z | INFO | phd-runner: [VM CLEANUP - END]
elapsed_milliseconds = 76
file = phd-tests/framework/src/test_vm/mod.rs
line = 1172
path = phd_tests::migrate::from_base::serial_history
target = phd_framework::test_vm
vm = migration_serial_history_base
vm_id = 34d7e74c-edd4-4137-97d3-54c6661e3aa0
|
| 94 | 2026-09-30T02:45:35.617Z | INFO | phd-runner: [INSTANCE_ENSURE_INTERNAL - END]
elapsed_milliseconds = 9151
file = phd-tests/framework/src/test_vm/mod.rs
line = 412
path = phd_tests::migrate::from_base::serial_history
target = phd_framework::test_vm
vm = migration_serial_history_base
vm_id = 34d7e74c-edd4-4137-97d3-54c6661e3aa0
|
| 95 | 2026-09-30T02:45:35.620Z | INFO | phd-runner: [VM CLEANUP - START]
file = phd-tests/framework/src/test_vm/mod.rs
line = 1172
path = phd_tests::migrate::from_base::serial_history
target = phd_framework::test_vm
vm = migration_serial_history_base_lifecycle_0
vm_id = c45749ca-0100-4c3f-9581-f23188564ebf
|
| 96 | 2026-09-30T02:45:35.620Z | DEBG | phd-runner: [SERIAL CONSOLE TASK - EVENT] serial console command channel was closed
file = phd-tests/framework/src/serial/mod.rs
line = 213
target = phd_framework::serial
|
| 97 | 2026-09-30T02:45:35.622Z | DEBG | phd-runner: [VM CLEANUP - EVENT] trying to ensure Propolis server VM is destroyed
file = phd-tests/framework/src/test_vm/mod.rs
line = 1195
path = phd_tests::migrate::from_base::serial_history
target = phd_framework::test_vm
vm = migration_serial_history_base_lifecycle_0
vm_id = c45749ca-0100-4c3f-9581-f23188564ebf
|
| 98 | 2026-09-30T02:45:35.622Z | INFO | phd-runner: [SERIAL CONSOLE TASK - END]
elapsed_milliseconds = 8457
file = phd-tests/framework/src/serial/mod.rs
line = 200
target = phd_framework::serial
|
| 99 | 2026-09-30T02:45:35.623Z | INFO | phd-runner: test phd_tests::migrate::from_base::serial_history ... ok
file = phd-tests/runner/src/execute.rs
line = 141
target = phd_runner::execute
|
| 100 | 2026-09-30T02:45:35.623Z | INFO | phd-runner: [TEST_CLEANUP - START]
file = phd-tests/runner/src/fixtures.rs
line = 51
target = phd_runner::fixtures
|
| 101 | 2026-09-30T02:45:36.349Z | DEBG | phd-runner: [VM CLEANUP - EVENT] Killing Propolis server process
file = phd-tests/framework/src/test_vm/server.rs
line = 177
path = phd_tests::migrate::from_base::serial_history
self.address = 127.0.0.1:9002
target = phd_framework::test_vm::server
vm = migration_serial_history_base_lifecycle_0
vm_id = c45749ca-0100-4c3f-9581-f23188564ebf
|
| 102 | 2026-09-30T02:45:36.443Z | DEBG | phd-runner: [VM CLEANUP - EVENT] zfs clone dropped
file = phd-tests/framework/src/zfs.rs
line = 83
path = phd_tests::migrate::from_base::serial_history
target = phd_framework::zfs
vm = migration_serial_history_base_lifecycle_0
vm_id = c45749ca-0100-4c3f-9581-f23188564ebf
|
| 103 | 2026-09-30T02:45:36.443Z | DEBG | phd-runner: [VM CLEANUP - EVENT] executing ZFS command
args = ["phd-artifacts/phd-clone-2f178a74-8285-4a53-837d-233ee5113c57"]
file = phd-tests/framework/src/zfs.rs
line = 304
path = phd_tests::migrate::from_base::serial_history
target = phd_framework::zfs
verb = destroy
vm = migration_serial_history_base_lifecycle_0
vm_id = c45749ca-0100-4c3f-9581-f23188564ebf
|
| 104 | 2026-09-30T02:45:36.471Z | DEBG | phd-runner: [VM CLEANUP - EVENT] zfs snapshot dropped
file = phd-tests/framework/src/zfs.rs
line = 57
path = phd_tests::migrate::from_base::serial_history
target = phd_framework::zfs
vm = migration_serial_history_base_lifecycle_0
vm_id = c45749ca-0100-4c3f-9581-f23188564ebf
|
| 105 | 2026-09-30T02:45:36.471Z | DEBG | phd-runner: [VM CLEANUP - EVENT] executing ZFS command
args = ["phd-artifacts@phd-aa7571c0-727e-4e83-89c0-f25bf71c9d27"]
file = phd-tests/framework/src/zfs.rs
line = 304
path = phd_tests::migrate::from_base::serial_history
target = phd_framework::zfs
verb = destroy
vm = migration_serial_history_base_lifecycle_0
vm_id = c45749ca-0100-4c3f-9581-f23188564ebf
|
| 106 | 2026-09-30T02:45:36.489Z | INFO | phd-runner: [VM CLEANUP - END]
elapsed_milliseconds = 869
file = phd-tests/framework/src/test_vm/mod.rs
line = 1172
path = phd_tests::migrate::from_base::serial_history
target = phd_framework::test_vm
vm = migration_serial_history_base_lifecycle_0
vm_id = c45749ca-0100-4c3f-9581-f23188564ebf
|
| 107 | 2026-09-30T02:45:36.489Z | INFO | phd-runner: [INSTANCE_ENSURE_INTERNAL - END]
elapsed_milliseconds = 4491
file = phd-tests/framework/src/test_vm/mod.rs
line = 412
path = phd_tests::migrate::from_base::serial_history
source = migration_serial_history_base
source_id = 34d7e74c-edd4-4137-97d3-54c6661e3aa0
target = phd_framework::test_vm
target_id = c45749ca-0100-4c3f-9581-f23188564ebf
vm = migration_serial_history_base_lifecycle_0
vm_id = c45749ca-0100-4c3f-9581-f23188564ebf
|
| 108 | 2026-09-30T02:45:36.489Z | INFO | phd-runner: [MIGRATE_FROM - END]
elapsed_milliseconds = 4492
file = phd-tests/framework/src/test_vm/mod.rs
line = 609
path = phd_tests::migrate::from_base::serial_history
source = migration_serial_history_base
source_id = 34d7e74c-edd4-4137-97d3-54c6661e3aa0
target = phd_framework::test_vm
target_id = c45749ca-0100-4c3f-9581-f23188564ebf
|
| 109 | 2026-09-30T02:45:36.489Z | INFO | phd-runner: [TEST - END]
elapsed_milliseconds = 60113
file = phd-tests/tests/src/migrate.rs
line = 40
path = phd_tests::migrate::from_base::serial_history
target = phd_tests::migrate::from_base
|
| 110 | 2026-09-30T02:45:36.490Z | INFO | phd-runner: [TEST_CLEANUP - END]
elapsed_milliseconds = 866
file = phd-tests/runner/src/fixtures.rs
line = 51
target = phd_runner::fixtures
|
| 111 | 2026-09-30T02:45:36.490Z | INFO | phd-runner: Starting test phd_tests::migrate::from_base::can_migrate_from_base
file = phd-tests/runner/src/execute.rs
line = 91
target = phd_runner::execute
|
| 112 | 2026-09-30T02:45:36.490Z | INFO | phd-runner: [TEST_SETUP - START]
file = phd-tests/runner/src/fixtures.rs
line = 41
target = phd_runner::fixtures
|
| 113 | 2026-09-30T02:45:36.490Z | INFO | phd-runner: [TEST_SETUP - END]
elapsed_milliseconds = 0
file = phd-tests/runner/src/fixtures.rs
line = 41
target = phd_runner::fixtures
|
| 114 | 2026-09-30T02:45:36.490Z | INFO | phd-runner: [TEST - START]
file = phd-tests/tests/src/migrate.rs
line = 34
path = phd_tests::migrate::from_base::can_migrate_from_base
target = phd_tests::migrate::from_base
|
| 115 | 2026-09-30T02:45:36.490Z | DEBG | phd-runner: [TEST - EVENT] Verified artifact already exists
file = phd-tests/framework/src/artifacts/store.rs
line = 45
path = /phd-artifacts/740187046a7267d0de72d3455070333547dbc0ea023531471fb2b2a61effa448/OVMF_CODE.fd
target = phd_framework::artifacts::store
|
| 116 | 2026-09-30T02:45:36.490Z | DEBG | phd-runner: [TEST - EVENT] Verified artifact already exists
file = phd-tests/framework/src/artifacts/store.rs
line = 45
path = /phd-artifacts/ba8007f74f9b54fbae3b2520da577831b4834778a498d732f091260c61aa7ca1/alpine.iso
target = phd_framework::artifacts::store
|
| 117 | 2026-09-30T02:45:36.490Z | DEBG | phd-runner: [TEST - EVENT] Verified artifact already exists
file = phd-tests/framework/src/artifacts/store.rs
line = 45
path = /phd-artifacts/ba8007f74f9b54fbae3b2520da577831b4834778a498d732f091260c61aa7ca1/alpine.iso
target = phd_framework::artifacts::store
|
| 118 | 2026-09-30T02:45:36.490Z | DEBG | phd-runner: [TEST - EVENT] executing ZFS command
args = ["/phd-artifacts/ba8007f74f9b54fbae3b2520da577831b4834778a498d732f091260c61aa7ca1/alpine.iso"]
file = phd-tests/framework/src/zfs.rs
line = 304
path = phd_tests::migrate::from_base::can_migrate_from_base
target = phd_framework::zfs
verb = list
|
| 119 | 2026-09-30T02:45:36.502Z | DEBG | phd-runner: [TEST - EVENT] parsing zfs list output
file = phd-tests/framework/src/zfs.rs
line = 238
path = phd_tests::migrate::from_base::can_migrate_from_base
stdout = NAME USED AVAIL REFER MOUNTPOINT\nphd-artifacts 1.30G 25.3T 1.30G /phd-artifacts\n
target = phd_framework::zfs
|
| 120 | 2026-09-30T02:45:36.502Z | DEBG | phd-runner: [TEST - EVENT] executing ZFS command
args = ["phd-artifacts@phd-eb4769dd-f575-448e-a889-e4ebaf69d9a3"]
file = phd-tests/framework/src/zfs.rs
line = 304
path = phd_tests::migrate::from_base::can_migrate_from_base
target = phd_framework::zfs
verb = snapshot
|
| 121 | 2026-09-30T02:45:36.519Z | DEBG | phd-runner: [TEST - EVENT] executing ZFS command
args = ["phd-artifacts@phd-eb4769dd-f575-448e-a889-e4ebaf69d9a3", "phd-artifacts/phd-clone-3259316d-a80b-4f16-ac33-295286d39f81"]
file = phd-tests/framework/src/zfs.rs
line = 304
path = phd_tests::migrate::from_base::can_migrate_from_base
target = phd_framework::zfs
verb = clone
|
| 122 | 2026-09-30T02:45:36.536Z | DEBG | phd-runner: [TEST - EVENT] executing ZFS command
args = ["phd-artifacts/phd-clone-3259316d-a80b-4f16-ac33-295286d39f81"]
file = phd-tests/framework/src/zfs.rs
line = 304
path = phd_tests::migrate::from_base::can_migrate_from_base
target = phd_framework::zfs
verb = list
|
| 123 | 2026-09-30T02:45:36.548Z | DEBG | phd-runner: [TEST - EVENT] parsing zfs list output
file = phd-tests/framework/src/zfs.rs
line = 238
path = phd_tests::migrate::from_base::can_migrate_from_base
stdout = NAME USED AVAIL REFER MOUNTPOINT\nphd-artifacts/phd-clone-3259316d-a80b-4f16-ac33-295286d39f81 0B 25.3T 1.30G /phd-artifacts/phd-clone-3259316d-a80b-4f16-ac33-295286d39f81\n
target = phd_framework::zfs
|
| 124 | 2026-09-30T02:45:36.549Z | INFO | phd-runner: [NEW - START]
file = phd-tests/framework/src/test_vm/mod.rs
line = 300
path = phd_tests::migrate::from_base::can_migrate_from_base
target = phd_framework::test_vm
|
| 125 | 2026-09-30T02:45:36.549Z | INFO | phd-runner: [NEW - EVENT] phd_framework::test_vm
environment = EnvironmentSpec { location: Local, propolis_artifact: "__BASE_PROPOLIS", metrics: None }
file = phd-tests/framework/src/test_vm/mod.rs
guest_os_kind = Alpine
line = 318
path = phd_tests::migrate::from_base::can_migrate_from_base
target = phd_framework::test_vm
vm_name = migration_from_base
|
| 126 | 2026-09-30T02:45:36.549Z | DEBG | phd-runner: [NEW - EVENT] Verified artifact already exists
file = phd-tests/framework/src/artifacts/store.rs
line = 45
path = /phd-artifacts/1e7667ffdc98b10de9e84d649107cd4d14e4a206aca4e30bf33d9d472c03b8ae/propolis-server
target = phd_framework::artifacts::store
|
| 127 | 2026-09-30T02:45:36.549Z | INFO | phd-runner: [NEW - EVENT] Launching Propolis server
bootrom_path = "/phd-artifacts/740187046a7267d0de72d3455070333547dbc0ea023531471fb2b2a61effa448/OVMF_CODE.fd"
file = phd-tests/framework/src/test_vm/server.rs
line = 66
path = phd_tests::migrate::from_base::can_migrate_from_base
server_addr = 127.0.0.1:9000
server_path = "/phd-artifacts/1e7667ffdc98b10de9e84d649107cd4d14e4a206aca4e30bf33d9d472c03b8ae/propolis-server"
target = phd_framework::test_vm::server
|
| 128 | 2026-09-30T02:45:36.549Z | INFO | phd-runner: [NEW - EVENT] Opening server log files
file = phd-tests/framework/src/log_config.rs
line = 84
path = phd_tests::migrate::from_base::can_migrate_from_base
stderr_path = "/tmp/propolis-phd/phd_tests::migrate::from_base::can_migrate_from_base/migration_from_base.stderr.log"
stdout_path = "/tmp/propolis-phd/phd_tests::migrate::from_base::can_migrate_from_base/migration_from_base.stdout.log"
target = phd_framework::log_config
|
| 129 | 2026-09-30T02:45:36.591Z | INFO | phd-runner: [NEW - EVENT] Launched server with pid 927
file = phd-tests/framework/src/test_vm/server.rs
line = 127
path = phd_tests::migrate::from_base::can_migrate_from_base
target = phd_framework::test_vm::server
|
| 130 | 2026-09-30T02:45:36.605Z | INFO | phd-runner: [NEW - END]
elapsed_milliseconds = 55
file = phd-tests/framework/src/test_vm/mod.rs
line = 300
path = phd_tests::migrate::from_base::can_migrate_from_base
target = phd_framework::test_vm
|
| 131 | 2026-09-30T02:45:36.605Z | INFO | phd-runner: [INSTANCE_ENSURE_INTERNAL - START]
file = phd-tests/framework/src/test_vm/mod.rs
line = 412
path = phd_tests::migrate::from_base::can_migrate_from_base
target = phd_framework::test_vm
vm = migration_from_base
vm_id = 75756e99-ba60-4b46-9621-764636aa1c5c
|
| 132 | 2026-09-30T02:45:36.606Z | INFO | phd-runner: [INSTANCE_ENSURE_INTERNAL - EVENT] retriable error from instance_spec_ensure
e = Communication Error: error sending request for url (http://127.0.0.1:9000/instance)
file = phd-tests/framework/src/test_vm/mod.rs
line = 455
path = phd_tests::migrate::from_base::can_migrate_from_base
target = phd_framework::test_vm
vm = migration_from_base
vm_id = 75756e99-ba60-4b46-9621-764636aa1c5c
|
| 133 | 2026-09-30T02:45:37.121Z | INFO | phd-runner: [SERIAL CONSOLE TASK - START]
file = phd-tests/framework/src/serial/mod.rs
line = 200
target = phd_framework::serial
|
| 134 | 2026-09-30T02:45:37.122Z | INFO | phd-runner: [INSTANCE_ENSURE_INTERNAL - EVENT] Started instance
file = phd-tests/framework/src/test_vm/mod.rs
instance_description.instance = Instance { properties: InstanceProperties { id: 75756e99-ba60-4b46-9621-764636aa1c5c, name: "phd-vm-75756e99-ba60-4b46-9621-764636aa1c5c", description: "Pheidippides-managed VM", metadata: InstanceMetadata { silo_id: decf3a4a-caaa-4f9d-8c3a-91e86d2dc802, project_id: 3b49094d-ddf9-48f6-9ac0-5fd6ce079d23, sled_id: d8133295-5f7a-458c-92fc-582a7b3fe7e9, sled_serial: "d8133295-5f7a-458c-92fc-582a7b3fe7e9", sled_revision: 1, sled_model: "pheidippes" } }, state: Creating }
line = 514
path = phd_tests::migrate::from_base::can_migrate_from_base
target = phd_framework::test_vm
vm = migration_from_base
vm_id = 75756e99-ba60-4b46-9621-764636aa1c5c
|
| 135 | 2026-09-30T02:45:37.123Z | INFO | phd-runner: [PUT_INSTANCE_STATE - START]
file = phd-tests/framework/src/test_vm/mod.rs
line = 575
path = phd_tests::migrate::from_base::can_migrate_from_base
target = phd_framework::test_vm
vm = migration_from_base
vm_id = 75756e99-ba60-4b46-9621-764636aa1c5c
|
| 136 | 2026-09-30T02:45:37.123Z | INFO | phd-runner: [PUT_INSTANCE_STATE - EVENT] Requesting instance state change
file = phd-tests/framework/src/test_vm/mod.rs
line = 580
path = phd_tests::migrate::from_base::can_migrate_from_base
state = Run
target = phd_framework::test_vm
vm = migration_from_base
vm_id = 75756e99-ba60-4b46-9621-764636aa1c5c
|
| 137 | 2026-09-30T02:45:37.124Z | INFO | phd-runner: [PUT_INSTANCE_STATE - END]
elapsed_milliseconds = 1
file = phd-tests/framework/src/test_vm/mod.rs
line = 575
path = phd_tests::migrate::from_base::can_migrate_from_base
target = phd_framework::test_vm
vm = migration_from_base
vm_id = 75756e99-ba60-4b46-9621-764636aa1c5c
|
| 138 | 2026-09-30T02:45:37.124Z | INFO | phd-runner: [WAIT_TO_BOOT - START]
file = phd-tests/framework/src/test_vm/mod.rs
line = 890
path = phd_tests::migrate::from_base::can_migrate_from_base
target = phd_framework::test_vm
|
| 139 | 2026-09-30T02:45:37.124Z | INFO | phd-runner: [WAIT_TO_BOOT - EVENT] waiting for guest to boot
file = phd-tests/framework/src/test_vm/mod.rs
line = 839
path = phd_tests::migrate::from_base::can_migrate_from_base
target = phd_framework::test_vm
timeout_duration = 300s
vm = migration_from_base
vm_id = 75756e99-ba60-4b46-9621-764636aa1c5c
|
| 140 | 2026-09-30T02:45:37.124Z | DEBG | phd-runner: [WAIT_TO_BOOT - EVENT] executing command in boot sequence
file = phd-tests/framework/src/test_vm/mod.rs
line = 847
path = phd_tests::migrate::from_base::can_migrate_from_base
step = WaitFor("localhost login: ")
target = phd_framework::test_vm
|
| 141 | 2026-09-30T02:45:37.124Z | INFO | phd-runner: [WAIT_FOR_SERIAL_OUTPUT - START]
file = phd-tests/framework/src/test_vm/mod.rs
line = 913
path = phd_tests::migrate::from_base::can_migrate_from_base
target = phd_framework::test_vm
vm = migration_from_base
vm_id = 75756e99-ba60-4b46-9621-764636aa1c5c
|
| 142 | 2026-09-30T02:45:37.125Z | INFO | phd-runner: [WAIT_FOR_SERIAL_OUTPUT - EVENT] Waiting for output on serial console
file = phd-tests/framework/src/test_vm/mod.rs
line = 920
path = phd_tests::migrate::from_base::can_migrate_from_base
target = phd_framework::test_vm
timeout_duration = CallerTimeout
vm = migration_from_base
vm_id = 75756e99-ba60-4b46-9621-764636aa1c5c
|
| 143 | 2026-09-30T02:45:41.715Z | INFO | phd-runner: [WAIT_FOR_SERIAL_OUTPUT - END]
elapsed_milliseconds = 4591
file = phd-tests/framework/src/test_vm/mod.rs
line = 913
path = phd_tests::migrate::from_base::can_migrate_from_base
target = phd_framework::test_vm
vm = migration_from_base
vm_id = 75756e99-ba60-4b46-9621-764636aa1c5c
|
| 144 | 2026-09-30T02:45:41.716Z | DEBG | phd-runner: [WAIT_TO_BOOT - EVENT] executing command in boot sequence
file = phd-tests/framework/src/test_vm/mod.rs
line = 847
path = phd_tests::migrate::from_base::can_migrate_from_base
step = WriteStr("root")
target = phd_framework::test_vm
|
| 145 | 2026-09-30T02:45:41.716Z | DEBG | phd-runner: [WAIT_TO_BOOT - EVENT] executing command in boot sequence
file = phd-tests/framework/src/test_vm/mod.rs
line = 847
path = phd_tests::migrate::from_base::can_migrate_from_base
step = WaitFor("localhost:~#")
target = phd_framework::test_vm
|
| 146 | 2026-09-30T02:45:41.716Z | INFO | phd-runner: [WAIT_FOR_SERIAL_OUTPUT - START]
file = phd-tests/framework/src/test_vm/mod.rs
line = 913
path = phd_tests::migrate::from_base::can_migrate_from_base
target = phd_framework::test_vm
vm = migration_from_base
vm_id = 75756e99-ba60-4b46-9621-764636aa1c5c
|
| 147 | 2026-09-30T02:45:41.716Z | INFO | phd-runner: [WAIT_FOR_SERIAL_OUTPUT - EVENT] Waiting for output on serial console
file = phd-tests/framework/src/test_vm/mod.rs
line = 920
path = phd_tests::migrate::from_base::can_migrate_from_base
target = phd_framework::test_vm
timeout_duration = CallerTimeout
vm = migration_from_base
vm_id = 75756e99-ba60-4b46-9621-764636aa1c5c
|
| 148 | 2026-09-30T02:45:41.735Z | INFO | phd-runner: [WAIT_FOR_SERIAL_OUTPUT - END]
elapsed_milliseconds = 18
file = phd-tests/framework/src/test_vm/mod.rs
line = 913
path = phd_tests::migrate::from_base::can_migrate_from_base
target = phd_framework::test_vm
vm = migration_from_base
vm_id = 75756e99-ba60-4b46-9621-764636aa1c5c
|
| 149 | 2026-09-30T02:45:41.735Z | DEBG | phd-runner: [WAIT_TO_BOOT - EVENT] executing command in boot sequence
file = phd-tests/framework/src/test_vm/mod.rs
line = 847
path = phd_tests::migrate::from_base::can_migrate_from_base
step = WriteStr("stty -F `tty` cols 9999")
target = phd_framework::test_vm
|
| 150 | 2026-09-30T02:45:41.735Z | DEBG | phd-runner: [WAIT_TO_BOOT - EVENT] executing command in boot sequence
file = phd-tests/framework/src/test_vm/mod.rs
line = 847
path = phd_tests::migrate::from_base::can_migrate_from_base
step = WaitFor("localhost:~#")
target = phd_framework::test_vm
|
| 151 | 2026-09-30T02:45:41.735Z | INFO | phd-runner: [WAIT_FOR_SERIAL_OUTPUT - START]
file = phd-tests/framework/src/test_vm/mod.rs
line = 913
path = phd_tests::migrate::from_base::can_migrate_from_base
target = phd_framework::test_vm
vm = migration_from_base
vm_id = 75756e99-ba60-4b46-9621-764636aa1c5c
|
| 152 | 2026-09-30T02:45:41.735Z | INFO | phd-runner: [WAIT_FOR_SERIAL_OUTPUT - EVENT] Waiting for output on serial console
file = phd-tests/framework/src/test_vm/mod.rs
line = 920
path = phd_tests::migrate::from_base::can_migrate_from_base
target = phd_framework::test_vm
timeout_duration = CallerTimeout
vm = migration_from_base
vm_id = 75756e99-ba60-4b46-9621-764636aa1c5c
|
| 153 | 2026-09-30T02:45:41.767Z | INFO | phd-runner: [WAIT_FOR_SERIAL_OUTPUT - END]
elapsed_milliseconds = 31
file = phd-tests/framework/src/test_vm/mod.rs
line = 913
path = phd_tests::migrate::from_base::can_migrate_from_base
target = phd_framework::test_vm
vm = migration_from_base
vm_id = 75756e99-ba60-4b46-9621-764636aa1c5c
|
| 154 | 2026-09-30T02:45:41.767Z | INFO | phd-runner: [WAIT_TO_BOOT - EVENT] Guest has booted
file = phd-tests/framework/src/test_vm/mod.rs
line = 887
path = phd_tests::migrate::from_base::can_migrate_from_base
target = phd_framework::test_vm
|
| 155 | 2026-09-30T02:45:41.767Z | INFO | phd-runner: [WAIT_TO_BOOT - END]
elapsed_milliseconds = 4642
file = phd-tests/framework/src/test_vm/mod.rs
line = 890
path = phd_tests::migrate::from_base::can_migrate_from_base
target = phd_framework::test_vm
|
| 156 | 2026-09-30T02:45:41.767Z | INFO | phd-runner: [WAIT_FOR_SERIAL_OUTPUT - START]
file = phd-tests/framework/src/test_vm/mod.rs
line = 913
path = phd_tests::migrate::from_base::can_migrate_from_base
target = phd_framework::test_vm
vm = migration_from_base
vm_id = 75756e99-ba60-4b46-9621-764636aa1c5c
|
| 157 | 2026-09-30T02:45:41.768Z | INFO | phd-runner: [WAIT_FOR_SERIAL_OUTPUT - EVENT] Waiting for output on serial console
file = phd-tests/framework/src/test_vm/mod.rs
line = 920
path = phd_tests::migrate::from_base::can_migrate_from_base
target = phd_framework::test_vm
timeout_duration = Explicit(15s)
vm = migration_from_base
vm_id = 75756e99-ba60-4b46-9621-764636aa1c5c
|
| 158 | 2026-09-30T02:45:41.778Z | INFO | phd-runner: [WAIT_FOR_SERIAL_OUTPUT - END]
elapsed_milliseconds = 10
file = phd-tests/framework/src/test_vm/mod.rs
line = 913
path = phd_tests::migrate::from_base::can_migrate_from_base
target = phd_framework::test_vm
vm = migration_from_base
vm_id = 75756e99-ba60-4b46-9621-764636aa1c5c
|
| 159 | 2026-09-30T02:45:41.778Z | INFO | phd-runner: [WAIT_FOR_SERIAL_OUTPUT - START]
file = phd-tests/framework/src/test_vm/mod.rs
line = 913
path = phd_tests::migrate::from_base::can_migrate_from_base
target = phd_framework::test_vm
vm = migration_from_base
vm_id = 75756e99-ba60-4b46-9621-764636aa1c5c
|
| 160 | 2026-09-30T02:45:41.778Z | INFO | phd-runner: [WAIT_FOR_SERIAL_OUTPUT - EVENT] Waiting for output on serial console
file = phd-tests/framework/src/test_vm/mod.rs
line = 920
path = phd_tests::migrate::from_base::can_migrate_from_base
target = phd_framework::test_vm
timeout_duration = Explicit(300s)
vm = migration_from_base
vm_id = 75756e99-ba60-4b46-9621-764636aa1c5c
|
| 161 | 2026-09-30T02:45:41.811Z | INFO | phd-runner: [WAIT_FOR_SERIAL_OUTPUT - END]
elapsed_milliseconds = 32
file = phd-tests/framework/src/test_vm/mod.rs
line = 913
path = phd_tests::migrate::from_base::can_migrate_from_base
target = phd_framework::test_vm
vm = migration_from_base
vm_id = 75756e99-ba60-4b46-9621-764636aa1c5c
|
| 162 | 2026-09-30T02:45:41.812Z | INFO | phd-runner: [WAIT_FOR_SERIAL_OUTPUT - START]
file = phd-tests/framework/src/test_vm/mod.rs
line = 913
path = phd_tests::migrate::from_base::can_migrate_from_base
target = phd_framework::test_vm
vm = migration_from_base
vm_id = 75756e99-ba60-4b46-9621-764636aa1c5c
|
| 163 | 2026-09-30T02:45:41.812Z | INFO | phd-runner: [WAIT_FOR_SERIAL_OUTPUT - EVENT] Waiting for output on serial console
file = phd-tests/framework/src/test_vm/mod.rs
line = 920
path = phd_tests::migrate::from_base::can_migrate_from_base
target = phd_framework::test_vm
timeout_duration = Explicit(15s)
vm = migration_from_base
vm_id = 75756e99-ba60-4b46-9621-764636aa1c5c
|
| 164 | 2026-09-30T02:45:41.821Z | INFO | phd-runner: [WAIT_FOR_SERIAL_OUTPUT - END]
elapsed_milliseconds = 9
file = phd-tests/framework/src/test_vm/mod.rs
line = 913
path = phd_tests::migrate::from_base::can_migrate_from_base
target = phd_framework::test_vm
vm = migration_from_base
vm_id = 75756e99-ba60-4b46-9621-764636aa1c5c
|
| 165 | 2026-09-30T02:45:41.822Z | INFO | phd-runner: [WAIT_FOR_SERIAL_OUTPUT - START]
file = phd-tests/framework/src/test_vm/mod.rs
line = 913
path = phd_tests::migrate::from_base::can_migrate_from_base
target = phd_framework::test_vm
vm = migration_from_base
vm_id = 75756e99-ba60-4b46-9621-764636aa1c5c
|
| 166 | 2026-09-30T02:45:41.822Z | INFO | phd-runner: [WAIT_FOR_SERIAL_OUTPUT - EVENT] Waiting for output on serial console
file = phd-tests/framework/src/test_vm/mod.rs
line = 920
path = phd_tests::migrate::from_base::can_migrate_from_base
target = phd_framework::test_vm
timeout_duration = Explicit(300s)
vm = migration_from_base
vm_id = 75756e99-ba60-4b46-9621-764636aa1c5c
|
| 167 | 2026-09-30T02:45:41.855Z | INFO | phd-runner: [WAIT_FOR_SERIAL_OUTPUT - END]
elapsed_milliseconds = 33
file = phd-tests/framework/src/test_vm/mod.rs
line = 913
path = phd_tests::migrate::from_base::can_migrate_from_base
target = phd_framework::test_vm
vm = migration_from_base
vm_id = 75756e99-ba60-4b46-9621-764636aa1c5c
|
| 168 | 2026-09-30T02:45:41.855Z | INFO | phd-runner: [WAIT_FOR_SERIAL_OUTPUT - START]
file = phd-tests/framework/src/test_vm/mod.rs
line = 913
path = phd_tests::migrate::from_base::can_migrate_from_base
target = phd_framework::test_vm
vm = migration_from_base
vm_id = 75756e99-ba60-4b46-9621-764636aa1c5c
|
| 169 | 2026-09-30T02:45:41.855Z | INFO | phd-runner: [WAIT_FOR_SERIAL_OUTPUT - EVENT] Waiting for output on serial console
file = phd-tests/framework/src/test_vm/mod.rs
line = 920
path = phd_tests::migrate::from_base::can_migrate_from_base
target = phd_framework::test_vm
timeout_duration = Explicit(15s)
vm = migration_from_base
vm_id = 75756e99-ba60-4b46-9621-764636aa1c5c
|
| 170 | 2026-09-30T02:45:41.866Z | INFO | phd-runner: [WAIT_FOR_SERIAL_OUTPUT - END]
elapsed_milliseconds = 10
file = phd-tests/framework/src/test_vm/mod.rs
line = 913
path = phd_tests::migrate::from_base::can_migrate_from_base
target = phd_framework::test_vm
vm = migration_from_base
vm_id = 75756e99-ba60-4b46-9621-764636aa1c5c
|
| 171 | 2026-09-30T02:45:41.866Z | INFO | phd-runner: [WAIT_FOR_SERIAL_OUTPUT - START]
file = phd-tests/framework/src/test_vm/mod.rs
line = 913
path = phd_tests::migrate::from_base::can_migrate_from_base
target = phd_framework::test_vm
vm = migration_from_base
vm_id = 75756e99-ba60-4b46-9621-764636aa1c5c
|
| 172 | 2026-09-30T02:45:41.866Z | INFO | phd-runner: [WAIT_FOR_SERIAL_OUTPUT - EVENT] Waiting for output on serial console
file = phd-tests/framework/src/test_vm/mod.rs
line = 920
path = phd_tests::migrate::from_base::can_migrate_from_base
target = phd_framework::test_vm
timeout_duration = Explicit(300s)
vm = migration_from_base
vm_id = 75756e99-ba60-4b46-9621-764636aa1c5c
|
| 173 | 2026-09-30T02:45:41.899Z | INFO | phd-runner: [WAIT_FOR_SERIAL_OUTPUT - END]
elapsed_milliseconds = 33
file = phd-tests/framework/src/test_vm/mod.rs
line = 913
path = phd_tests::migrate::from_base::can_migrate_from_base
target = phd_framework::test_vm
vm = migration_from_base
vm_id = 75756e99-ba60-4b46-9621-764636aa1c5c
|
| 174 | 2026-09-30T02:45:41.899Z | INFO | phd-runner: [WAIT_FOR_SERIAL_OUTPUT - START]
file = phd-tests/framework/src/test_vm/mod.rs
line = 913
path = phd_tests::migrate::from_base::can_migrate_from_base
target = phd_framework::test_vm
vm = migration_from_base
vm_id = 75756e99-ba60-4b46-9621-764636aa1c5c
|
| 175 | 2026-09-30T02:45:41.900Z | INFO | phd-runner: [WAIT_FOR_SERIAL_OUTPUT - EVENT] Waiting for output on serial console
file = phd-tests/framework/src/test_vm/mod.rs
line = 920
path = phd_tests::migrate::from_base::can_migrate_from_base
target = phd_framework::test_vm
timeout_duration = Explicit(15s)
vm = migration_from_base
vm_id = 75756e99-ba60-4b46-9621-764636aa1c5c
|
| 176 | 2026-09-30T02:45:41.910Z | INFO | phd-runner: [WAIT_FOR_SERIAL_OUTPUT - END]
elapsed_milliseconds = 10
file = phd-tests/framework/src/test_vm/mod.rs
line = 913
path = phd_tests::migrate::from_base::can_migrate_from_base
target = phd_framework::test_vm
vm = migration_from_base
vm_id = 75756e99-ba60-4b46-9621-764636aa1c5c
|
| 177 | 2026-09-30T02:45:41.911Z | INFO | phd-runner: [WAIT_FOR_SERIAL_OUTPUT - START]
file = phd-tests/framework/src/test_vm/mod.rs
line = 913
path = phd_tests::migrate::from_base::can_migrate_from_base
target = phd_framework::test_vm
vm = migration_from_base
vm_id = 75756e99-ba60-4b46-9621-764636aa1c5c
|
| 178 | 2026-09-30T02:45:41.911Z | INFO | phd-runner: [WAIT_FOR_SERIAL_OUTPUT - EVENT] Waiting for output on serial console
file = phd-tests/framework/src/test_vm/mod.rs
line = 920
path = phd_tests::migrate::from_base::can_migrate_from_base
target = phd_framework::test_vm
timeout_duration = Explicit(300s)
vm = migration_from_base
vm_id = 75756e99-ba60-4b46-9621-764636aa1c5c
|
| 179 | 2026-09-30T02:45:41.943Z | INFO | phd-runner: [WAIT_FOR_SERIAL_OUTPUT - END]
elapsed_milliseconds = 32
file = phd-tests/framework/src/test_vm/mod.rs
line = 913
path = phd_tests::migrate::from_base::can_migrate_from_base
target = phd_framework::test_vm
vm = migration_from_base
vm_id = 75756e99-ba60-4b46-9621-764636aa1c5c
|
| 180 | 2026-09-30T02:45:41.943Z | INFO | phd-runner: [WAIT_FOR_SERIAL_OUTPUT - START]
file = phd-tests/framework/src/test_vm/mod.rs
line = 913
path = phd_tests::migrate::from_base::can_migrate_from_base
target = phd_framework::test_vm
vm = migration_from_base
vm_id = 75756e99-ba60-4b46-9621-764636aa1c5c
|
| 181 | 2026-09-30T02:45:41.943Z | INFO | phd-runner: [WAIT_FOR_SERIAL_OUTPUT - EVENT] Waiting for output on serial console
file = phd-tests/framework/src/test_vm/mod.rs
line = 920
path = phd_tests::migrate::from_base::can_migrate_from_base
target = phd_framework::test_vm
timeout_duration = Explicit(15s)
vm = migration_from_base
vm_id = 75756e99-ba60-4b46-9621-764636aa1c5c
|
| 182 | 2026-09-30T02:45:41.954Z | INFO | phd-runner: [WAIT_FOR_SERIAL_OUTPUT - END]
elapsed_milliseconds = 10
file = phd-tests/framework/src/test_vm/mod.rs
line = 913
path = phd_tests::migrate::from_base::can_migrate_from_base
target = phd_framework::test_vm
vm = migration_from_base
vm_id = 75756e99-ba60-4b46-9621-764636aa1c5c
|
| 183 | 2026-09-30T02:45:41.954Z | INFO | phd-runner: [WAIT_FOR_SERIAL_OUTPUT - START]
file = phd-tests/framework/src/test_vm/mod.rs
line = 913
path = phd_tests::migrate::from_base::can_migrate_from_base
target = phd_framework::test_vm
vm = migration_from_base
vm_id = 75756e99-ba60-4b46-9621-764636aa1c5c
|
| 184 | 2026-09-30T02:45:41.954Z | INFO | phd-runner: [WAIT_FOR_SERIAL_OUTPUT - EVENT] Waiting for output on serial console
file = phd-tests/framework/src/test_vm/mod.rs
line = 920
path = phd_tests::migrate::from_base::can_migrate_from_base
target = phd_framework::test_vm
timeout_duration = Explicit(300s)
vm = migration_from_base
vm_id = 75756e99-ba60-4b46-9621-764636aa1c5c
|
| 185 | 2026-09-30T02:45:41.987Z | INFO | phd-runner: [WAIT_FOR_SERIAL_OUTPUT - END]
elapsed_milliseconds = 33
file = phd-tests/framework/src/test_vm/mod.rs
line = 913
path = phd_tests::migrate::from_base::can_migrate_from_base
target = phd_framework::test_vm
vm = migration_from_base
vm_id = 75756e99-ba60-4b46-9621-764636aa1c5c
|
| 186 | 2026-09-30T02:45:41.989Z | INFO | phd-runner: [WAIT_FOR_SERIAL_OUTPUT - START]
file = phd-tests/framework/src/test_vm/mod.rs
line = 913
path = phd_tests::migrate::from_base::can_migrate_from_base
target = phd_framework::test_vm
vm = migration_from_base
vm_id = 75756e99-ba60-4b46-9621-764636aa1c5c
|
| 187 | 2026-09-30T02:45:41.989Z | INFO | phd-runner: [WAIT_FOR_SERIAL_OUTPUT - EVENT] Waiting for output on serial console
file = phd-tests/framework/src/test_vm/mod.rs
line = 920
path = phd_tests::migrate::from_base::can_migrate_from_base
target = phd_framework::test_vm
timeout_duration = Explicit(15s)
vm = migration_from_base
vm_id = 75756e99-ba60-4b46-9621-764636aa1c5c
|
| 188 | 2026-09-30T02:45:41.998Z | INFO | phd-runner: [WAIT_FOR_SERIAL_OUTPUT - END]
elapsed_milliseconds = 9
file = phd-tests/framework/src/test_vm/mod.rs
line = 913
path = phd_tests::migrate::from_base::can_migrate_from_base
target = phd_framework::test_vm
vm = migration_from_base
vm_id = 75756e99-ba60-4b46-9621-764636aa1c5c
|
| 189 | 2026-09-30T02:45:41.999Z | INFO | phd-runner: [WAIT_FOR_SERIAL_OUTPUT - START]
file = phd-tests/framework/src/test_vm/mod.rs
line = 913
path = phd_tests::migrate::from_base::can_migrate_from_base
target = phd_framework::test_vm
vm = migration_from_base
vm_id = 75756e99-ba60-4b46-9621-764636aa1c5c
|
| 190 | 2026-09-30T02:45:41.999Z | INFO | phd-runner: [WAIT_FOR_SERIAL_OUTPUT - EVENT] Waiting for output on serial console
file = phd-tests/framework/src/test_vm/mod.rs
line = 920
path = phd_tests::migrate::from_base::can_migrate_from_base
target = phd_framework::test_vm
timeout_duration = Explicit(300s)
vm = migration_from_base
vm_id = 75756e99-ba60-4b46-9621-764636aa1c5c
|
| 191 | 2026-09-30T02:45:42.031Z | INFO | phd-runner: [WAIT_FOR_SERIAL_OUTPUT - END]
elapsed_milliseconds = 32
file = phd-tests/framework/src/test_vm/mod.rs
line = 913
path = phd_tests::migrate::from_base::can_migrate_from_base
target = phd_framework::test_vm
vm = migration_from_base
vm_id = 75756e99-ba60-4b46-9621-764636aa1c5c
|
| 192 | 2026-09-30T02:45:42.031Z | INFO | phd-runner: [TEST - EVENT] migrating to new Propolis artifact for lifecycle test
file = phd-tests/framework/src/lifecycle.rs
line = 73
path = phd_tests::migrate::from_base::can_migrate_from_base
propolis_artifact = __DEFAULT_PROPOLIS
target = phd_framework::lifecycle
vm_name = migration_from_base
|
| 193 | 2026-09-30T02:45:42.031Z | INFO | phd-runner: [NEW - START]
file = phd-tests/framework/src/test_vm/mod.rs
line = 300
path = phd_tests::migrate::from_base::can_migrate_from_base
target = phd_framework::test_vm
|
| 194 | 2026-09-30T02:45:42.031Z | INFO | phd-runner: [NEW - EVENT] phd_framework::test_vm
environment = EnvironmentSpec { location: Local, propolis_artifact: "__DEFAULT_PROPOLIS", metrics: None }
file = phd-tests/framework/src/test_vm/mod.rs
guest_os_kind = Alpine
line = 318
path = phd_tests::migrate::from_base::can_migrate_from_base
target = phd_framework::test_vm
vm_name = migration_from_base_lifecycle_0
|
| 195 | 2026-09-30T02:45:42.031Z | DEBG | phd-runner: [NEW - EVENT] Verified artifact already exists
file = phd-tests/framework/src/artifacts/store.rs
line = 45
path = /work/phd-test/propolis-server
target = phd_framework::artifacts::store
|
| 196 | 2026-09-30T02:45:42.031Z | INFO | phd-runner: [NEW - EVENT] Launching Propolis server
bootrom_path = "/phd-artifacts/740187046a7267d0de72d3455070333547dbc0ea023531471fb2b2a61effa448/OVMF_CODE.fd"
file = phd-tests/framework/src/test_vm/server.rs
line = 66
path = phd_tests::migrate::from_base::can_migrate_from_base
server_addr = 127.0.0.1:9002
server_path = "/work/phd-test/propolis-server"
target = phd_framework::test_vm::server
|
| 197 | 2026-09-30T02:45:42.032Z | INFO | phd-runner: [NEW - EVENT] Opening server log files
file = phd-tests/framework/src/log_config.rs
line = 84
path = phd_tests::migrate::from_base::can_migrate_from_base
stderr_path = "/tmp/propolis-phd/phd_tests::migrate::from_base::can_migrate_from_base/migration_from_base_lifecycle_0.stderr.log"
stdout_path = "/tmp/propolis-phd/phd_tests::migrate::from_base::can_migrate_from_base/migration_from_base_lifecycle_0.stdout.log"
target = phd_framework::log_config
|
| 198 | 2026-09-30T02:45:42.072Z | INFO | phd-runner: [NEW - EVENT] Launched server with pid 928
file = phd-tests/framework/src/test_vm/server.rs
line = 127
path = phd_tests::migrate::from_base::can_migrate_from_base
target = phd_framework::test_vm::server
|
| 199 | 2026-09-30T02:45:42.085Z | INFO | phd-runner: [NEW - END]
elapsed_milliseconds = 53
file = phd-tests/framework/src/test_vm/mod.rs
line = 300
path = phd_tests::migrate::from_base::can_migrate_from_base
target = phd_framework::test_vm
|
| 200 | 2026-09-30T02:45:42.085Z | INFO | phd-runner: [MIGRATE_FROM - START]
file = phd-tests/framework/src/test_vm/mod.rs
line = 609
path = phd_tests::migrate::from_base::can_migrate_from_base
source = migration_from_base
source_id = 75756e99-ba60-4b46-9621-764636aa1c5c
target = phd_framework::test_vm
target_id = aed48cca-c8b9-4735-ae1d-2ebc7f252d35
|
| 201 | 2026-09-30T02:45:42.085Z | INFO | phd-runner: [MIGRATE_FROM - EVENT] Migrating from source at address 127.0.0.1:9000
file = phd-tests/framework/src/test_vm/mod.rs
line = 642
migration_id = efac526b-a29b-4ec1-b980-051b630dc139
path = phd_tests::migrate::from_base::can_migrate_from_base
source = migration_from_base
source_id = 75756e99-ba60-4b46-9621-764636aa1c5c
target = phd_framework::test_vm
target_id = aed48cca-c8b9-4735-ae1d-2ebc7f252d35
timeout_duration = 45s
|
| 202 | 2026-09-30T02:45:42.085Z | INFO | phd-runner: [INSTANCE_ENSURE_INTERNAL - START]
file = phd-tests/framework/src/test_vm/mod.rs
line = 412
path = phd_tests::migrate::from_base::can_migrate_from_base
source = migration_from_base
source_id = 75756e99-ba60-4b46-9621-764636aa1c5c
target = phd_framework::test_vm
target_id = aed48cca-c8b9-4735-ae1d-2ebc7f252d35
vm = migration_from_base_lifecycle_0
vm_id = aed48cca-c8b9-4735-ae1d-2ebc7f252d35
|
| 203 | 2026-09-30T02:45:42.086Z | INFO | phd-runner: [INSTANCE_ENSURE_INTERNAL - EVENT] retriable error from instance_spec_ensure
e = Communication Error: error sending request for url (http://127.0.0.1:9002/instance)
file = phd-tests/framework/src/test_vm/mod.rs
line = 455
path = phd_tests::migrate::from_base::can_migrate_from_base
source = migration_from_base
source_id = 75756e99-ba60-4b46-9621-764636aa1c5c
target = phd_framework::test_vm
target_id = aed48cca-c8b9-4735-ae1d-2ebc7f252d35
vm = migration_from_base_lifecycle_0
vm_id = aed48cca-c8b9-4735-ae1d-2ebc7f252d35
|
| 204 | 2026-09-30T02:45:42.557Z | INFO | phd-runner: [INSTANCE_ENSURE_INTERNAL - EVENT] Started instance
file = phd-tests/framework/src/test_vm/mod.rs
instance_description.instance = Instance { properties: InstanceProperties { id: aed48cca-c8b9-4735-ae1d-2ebc7f252d35, name: "phd-vm-aed48cca-c8b9-4735-ae1d-2ebc7f252d35", description: "Pheidippides-managed VM", metadata: InstanceMetadata { silo_id: decf3a4a-caaa-4f9d-8c3a-91e86d2dc802, project_id: 3b49094d-ddf9-48f6-9ac0-5fd6ce079d23, sled_id: 548d765b-7d9f-4a06-b708-66fbe6d01cae, sled_serial: "548d765b-7d9f-4a06-b708-66fbe6d01cae", sled_revision: 1, sled_model: "pheidippes" } }, state: Migrating }
line = 514
path = phd_tests::migrate::from_base::can_migrate_from_base
source = migration_from_base
source_id = 75756e99-ba60-4b46-9621-764636aa1c5c
target = phd_framework::test_vm
target_id = aed48cca-c8b9-4735-ae1d-2ebc7f252d35
vm = migration_from_base_lifecycle_0
vm_id = aed48cca-c8b9-4735-ae1d-2ebc7f252d35
|
| 205 | 2026-09-30T02:45:42.557Z | INFO | phd-runner: [MIGRATE - START]
file = phd-tests/framework/src/test_vm/mod.rs
line = 663
migration_id = efac526b-a29b-4ec1-b980-051b630dc139
path = phd_tests::migrate::from_base::can_migrate_from_base
source = migration_from_base
source_id = 75756e99-ba60-4b46-9621-764636aa1c5c
target = phd_framework::test_vm
target_id = aed48cca-c8b9-4735-ae1d-2ebc7f252d35
|
| 206 | 2026-09-30T02:45:45.087Z | INFO | phd-runner: [SERIAL CONSOLE TASK - EVENT] serial socket control message
file = phd-tests/framework/src/serial/mod.rs
line = 275
s = {"Migrating":{"destination":"127.0.0.1:9002","from_start":7847}}
target = phd_framework::serial
|
| 207 | 2026-09-30T02:45:46.365Z | INFO | phd-runner: [MIGRATE_FROM - EVENT] Migration completed successfully
file = phd-tests/framework/src/test_vm/mod.rs
line = 676
path = phd_tests::migrate::from_base::can_migrate_from_base
source = migration_from_base
source_id = 75756e99-ba60-4b46-9621-764636aa1c5c
target = phd_framework::test_vm
target_id = aed48cca-c8b9-4735-ae1d-2ebc7f252d35
|
| 208 | 2026-09-30T02:45:46.365Z | INFO | phd-runner: [MIGRATE - END]
elapsed_milliseconds = 3806
file = phd-tests/framework/src/test_vm/mod.rs
line = 663
migration_id = efac526b-a29b-4ec1-b980-051b630dc139
path = phd_tests::migrate::from_base::can_migrate_from_base
source = migration_from_base
source_id = 75756e99-ba60-4b46-9621-764636aa1c5c
target = phd_framework::test_vm
target_id = aed48cca-c8b9-4735-ae1d-2ebc7f252d35
|
| 209 | 2026-09-30T02:45:46.367Z | INFO | phd-runner: [VM CLEANUP - START]
file = phd-tests/framework/src/test_vm/mod.rs
line = 1172
path = phd_tests::migrate::from_base::can_migrate_from_base
target = phd_framework::test_vm
vm = migration_from_base
vm_id = 75756e99-ba60-4b46-9621-764636aa1c5c
|
| 210 | 2026-09-30T02:45:46.367Z | INFO | phd-runner: [WAIT_FOR_SERIAL_OUTPUT - START]
file = phd-tests/framework/src/test_vm/mod.rs
line = 913
path = phd_tests::migrate::from_base::can_migrate_from_base
target = phd_framework::test_vm
vm = migration_from_base_lifecycle_0
vm_id = aed48cca-c8b9-4735-ae1d-2ebc7f252d35
|
| 211 | 2026-09-30T02:45:46.367Z | INFO | phd-runner: [WAIT_FOR_SERIAL_OUTPUT - EVENT] Waiting for output on serial console
file = phd-tests/framework/src/test_vm/mod.rs
line = 920
path = phd_tests::migrate::from_base::can_migrate_from_base
target = phd_framework::test_vm
timeout_duration = Explicit(15s)
vm = migration_from_base_lifecycle_0
vm_id = aed48cca-c8b9-4735-ae1d-2ebc7f252d35
|
| 212 | 2026-09-30T02:45:46.369Z | DEBG | phd-runner: [VM CLEANUP - EVENT] Killing Propolis server process
file = phd-tests/framework/src/test_vm/server.rs
line = 177
path = phd_tests::migrate::from_base::can_migrate_from_base
self.address = 127.0.0.1:9000
target = phd_framework::test_vm::server
vm = migration_from_base
vm_id = 75756e99-ba60-4b46-9621-764636aa1c5c
|
| 213 | 2026-09-30T02:45:46.451Z | INFO | phd-runner: [VM CLEANUP - END]
elapsed_milliseconds = 83
file = phd-tests/framework/src/test_vm/mod.rs
line = 1172
path = phd_tests::migrate::from_base::can_migrate_from_base
target = phd_framework::test_vm
vm = migration_from_base
vm_id = 75756e99-ba60-4b46-9621-764636aa1c5c
|
| 214 | 2026-09-30T02:45:46.451Z | INFO | phd-runner: [INSTANCE_ENSURE_INTERNAL - END]
elapsed_milliseconds = 9845
file = phd-tests/framework/src/test_vm/mod.rs
line = 412
path = phd_tests::migrate::from_base::can_migrate_from_base
target = phd_framework::test_vm
vm = migration_from_base
vm_id = 75756e99-ba60-4b46-9621-764636aa1c5c
|
| 215 | 2026-09-30T02:45:48.027Z | INFO | phd-runner: [WAIT_FOR_SERIAL_OUTPUT - END]
elapsed_milliseconds = 1659
file = phd-tests/framework/src/test_vm/mod.rs
line = 913
path = phd_tests::migrate::from_base::can_migrate_from_base
target = phd_framework::test_vm
vm = migration_from_base_lifecycle_0
vm_id = aed48cca-c8b9-4735-ae1d-2ebc7f252d35
|
| 216 | 2026-09-30T02:45:48.028Z | INFO | phd-runner: [WAIT_FOR_SERIAL_OUTPUT - START]
file = phd-tests/framework/src/test_vm/mod.rs
line = 913
path = phd_tests::migrate::from_base::can_migrate_from_base
target = phd_framework::test_vm
vm = migration_from_base_lifecycle_0
vm_id = aed48cca-c8b9-4735-ae1d-2ebc7f252d35
|
| 217 | 2026-09-30T02:45:48.028Z | INFO | phd-runner: [WAIT_FOR_SERIAL_OUTPUT - EVENT] Waiting for output on serial console
file = phd-tests/framework/src/test_vm/mod.rs
line = 920
path = phd_tests::migrate::from_base::can_migrate_from_base
target = phd_framework::test_vm
timeout_duration = Explicit(300s)
vm = migration_from_base_lifecycle_0
vm_id = aed48cca-c8b9-4735-ae1d-2ebc7f252d35
|
| 218 | 2026-09-30T02:45:48.061Z | INFO | phd-runner: [WAIT_FOR_SERIAL_OUTPUT - END]
elapsed_milliseconds = 33
file = phd-tests/framework/src/test_vm/mod.rs
line = 913
path = phd_tests::migrate::from_base::can_migrate_from_base
target = phd_framework::test_vm
vm = migration_from_base_lifecycle_0
vm_id = aed48cca-c8b9-4735-ae1d-2ebc7f252d35
|
| 219 | 2026-09-30T02:45:48.061Z | INFO | phd-runner: [VM CLEANUP - START]
file = phd-tests/framework/src/test_vm/mod.rs
line = 1172
path = phd_tests::migrate::from_base::can_migrate_from_base
target = phd_framework::test_vm
vm = migration_from_base_lifecycle_0
vm_id = aed48cca-c8b9-4735-ae1d-2ebc7f252d35
|
| 220 | 2026-09-30T02:45:48.061Z | DEBG | phd-runner: [SERIAL CONSOLE TASK - EVENT] serial console command channel was closed
file = phd-tests/framework/src/serial/mod.rs
line = 213
target = phd_framework::serial
|
| 221 | 2026-09-30T02:45:48.061Z | INFO | phd-runner: [SERIAL CONSOLE TASK - END]
elapsed_milliseconds = 10939
file = phd-tests/framework/src/serial/mod.rs
line = 200
target = phd_framework::serial
|
| 222 | 2026-09-30T02:45:48.061Z | INFO | phd-runner: test phd_tests::migrate::from_base::can_migrate_from_base ... ok
file = phd-tests/runner/src/execute.rs
line = 141
target = phd_runner::execute
|
| 223 | 2026-09-30T02:45:48.061Z | INFO | phd-runner: [TEST_CLEANUP - START]
file = phd-tests/runner/src/fixtures.rs
line = 51
target = phd_runner::fixtures
|
| 224 | 2026-09-30T02:45:48.063Z | DEBG | phd-runner: [VM CLEANUP - EVENT] trying to ensure Propolis server VM is destroyed
file = phd-tests/framework/src/test_vm/mod.rs
line = 1195
path = phd_tests::migrate::from_base::can_migrate_from_base
target = phd_framework::test_vm
vm = migration_from_base_lifecycle_0
vm_id = aed48cca-c8b9-4735-ae1d-2ebc7f252d35
|
| 225 | 2026-09-30T02:45:48.340Z | DEBG | phd-runner: [VM CLEANUP - EVENT] Killing Propolis server process
file = phd-tests/framework/src/test_vm/server.rs
line = 177
path = phd_tests::migrate::from_base::can_migrate_from_base
self.address = 127.0.0.1:9002
target = phd_framework::test_vm::server
vm = migration_from_base_lifecycle_0
vm_id = aed48cca-c8b9-4735-ae1d-2ebc7f252d35
|
| 226 | 2026-09-30T02:45:48.433Z | DEBG | phd-runner: [VM CLEANUP - EVENT] zfs clone dropped
file = phd-tests/framework/src/zfs.rs
line = 83
path = phd_tests::migrate::from_base::can_migrate_from_base
target = phd_framework::zfs
vm = migration_from_base_lifecycle_0
vm_id = aed48cca-c8b9-4735-ae1d-2ebc7f252d35
|
| 227 | 2026-09-30T02:45:48.433Z | DEBG | phd-runner: [VM CLEANUP - EVENT] executing ZFS command
args = ["phd-artifacts/phd-clone-3259316d-a80b-4f16-ac33-295286d39f81"]
file = phd-tests/framework/src/zfs.rs
line = 304
path = phd_tests::migrate::from_base::can_migrate_from_base
target = phd_framework::zfs
verb = destroy
vm = migration_from_base_lifecycle_0
vm_id = aed48cca-c8b9-4735-ae1d-2ebc7f252d35
|
| 228 | 2026-09-30T02:45:48.458Z | DEBG | phd-runner: [VM CLEANUP - EVENT] zfs snapshot dropped
file = phd-tests/framework/src/zfs.rs
line = 57
path = phd_tests::migrate::from_base::can_migrate_from_base
target = phd_framework::zfs
vm = migration_from_base_lifecycle_0
vm_id = aed48cca-c8b9-4735-ae1d-2ebc7f252d35
|
| 229 | 2026-09-30T02:45:48.458Z | DEBG | phd-runner: [VM CLEANUP - EVENT] executing ZFS command
args = ["phd-artifacts@phd-eb4769dd-f575-448e-a889-e4ebaf69d9a3"]
file = phd-tests/framework/src/zfs.rs
line = 304
path = phd_tests::migrate::from_base::can_migrate_from_base
target = phd_framework::zfs
verb = destroy
vm = migration_from_base_lifecycle_0
vm_id = aed48cca-c8b9-4735-ae1d-2ebc7f252d35
|
| 230 | 2026-09-30T02:45:48.476Z | INFO | phd-runner: [VM CLEANUP - END]
elapsed_milliseconds = 414
file = phd-tests/framework/src/test_vm/mod.rs
line = 1172
path = phd_tests::migrate::from_base::can_migrate_from_base
target = phd_framework::test_vm
vm = migration_from_base_lifecycle_0
vm_id = aed48cca-c8b9-4735-ae1d-2ebc7f252d35
|
| 231 | 2026-09-30T02:45:48.476Z | INFO | phd-runner: [INSTANCE_ENSURE_INTERNAL - END]
elapsed_milliseconds = 6389
file = phd-tests/framework/src/test_vm/mod.rs
line = 412
path = phd_tests::migrate::from_base::can_migrate_from_base
source = migration_from_base
source_id = 75756e99-ba60-4b46-9621-764636aa1c5c
target = phd_framework::test_vm
target_id = aed48cca-c8b9-4735-ae1d-2ebc7f252d35
vm = migration_from_base_lifecycle_0
vm_id = aed48cca-c8b9-4735-ae1d-2ebc7f252d35
|
| 232 | 2026-09-30T02:45:48.476Z | INFO | phd-runner: [TEST_CLEANUP - END]
elapsed_milliseconds = 414
file = phd-tests/runner/src/fixtures.rs
line = 51
target = phd_runner::fixtures
|
| 233 | 2026-09-30T02:45:48.476Z | INFO | phd-runner: [MIGRATE_FROM - END]
elapsed_milliseconds = 6390
file = phd-tests/framework/src/test_vm/mod.rs
line = 609
path = phd_tests::migrate::from_base::can_migrate_from_base
source = migration_from_base
source_id = 75756e99-ba60-4b46-9621-764636aa1c5c
target = phd_framework::test_vm
target_id = aed48cca-c8b9-4735-ae1d-2ebc7f252d35
|
| 234 | 2026-09-30T02:45:48.476Z | INFO | phd-runner: Starting test phd_tests::migrate::from_base::migration_from_base_and_back
file = phd-tests/runner/src/execute.rs
line = 91
target = phd_runner::execute
|
| 235 | 2026-09-30T02:45:48.476Z | INFO | phd-runner: [TEST - END]
elapsed_milliseconds = 11985
file = phd-tests/tests/src/migrate.rs
line = 34
path = phd_tests::migrate::from_base::can_migrate_from_base
target = phd_tests::migrate::from_base
|
| 236 | 2026-09-30T02:45:48.476Z | INFO | phd-runner: [TEST_SETUP - START]
file = phd-tests/runner/src/fixtures.rs
line = 41
target = phd_runner::fixtures
|
| 237 | 2026-09-30T02:45:48.476Z | INFO | phd-runner: [TEST_SETUP - END]
elapsed_milliseconds = 0
file = phd-tests/runner/src/fixtures.rs
line = 41
target = phd_runner::fixtures
|
| 238 | 2026-09-30T02:45:48.476Z | INFO | phd-runner: [TEST - START]
file = phd-tests/tests/src/migrate.rs
line = 52
path = phd_tests::migrate::from_base::migration_from_base_and_back
target = phd_tests::migrate::from_base
|
| 239 | 2026-09-30T02:45:48.477Z | DEBG | phd-runner: [TEST - EVENT] Verified artifact already exists
file = phd-tests/framework/src/artifacts/store.rs
line = 45
path = /phd-artifacts/740187046a7267d0de72d3455070333547dbc0ea023531471fb2b2a61effa448/OVMF_CODE.fd
target = phd_framework::artifacts::store
|
| 240 | 2026-09-30T02:45:48.477Z | DEBG | phd-runner: [TEST - EVENT] Verified artifact already exists
file = phd-tests/framework/src/artifacts/store.rs
line = 45
path = /phd-artifacts/ba8007f74f9b54fbae3b2520da577831b4834778a498d732f091260c61aa7ca1/alpine.iso
target = phd_framework::artifacts::store
|
| 241 | 2026-09-30T02:45:48.477Z | DEBG | phd-runner: [TEST - EVENT] Verified artifact already exists
file = phd-tests/framework/src/artifacts/store.rs
line = 45
path = /phd-artifacts/ba8007f74f9b54fbae3b2520da577831b4834778a498d732f091260c61aa7ca1/alpine.iso
target = phd_framework::artifacts::store
|
| 242 | 2026-09-30T02:45:48.477Z | DEBG | phd-runner: [TEST - EVENT] executing ZFS command
args = ["/phd-artifacts/ba8007f74f9b54fbae3b2520da577831b4834778a498d732f091260c61aa7ca1/alpine.iso"]
file = phd-tests/framework/src/zfs.rs
line = 304
path = phd_tests::migrate::from_base::migration_from_base_and_back
target = phd_framework::zfs
verb = list
|
| 243 | 2026-09-30T02:45:48.488Z | DEBG | phd-runner: [TEST - EVENT] parsing zfs list output
file = phd-tests/framework/src/zfs.rs
line = 238
path = phd_tests::migrate::from_base::migration_from_base_and_back
stdout = NAME USED AVAIL REFER MOUNTPOINT\nphd-artifacts 1.30G 25.3T 1.30G /phd-artifacts\n
target = phd_framework::zfs
|
| 244 | 2026-09-30T02:45:48.489Z | DEBG | phd-runner: [TEST - EVENT] executing ZFS command
args = ["phd-artifacts@phd-559112da-8b82-4ff9-b749-3819b3dfada8"]
file = phd-tests/framework/src/zfs.rs
line = 304
path = phd_tests::migrate::from_base::migration_from_base_and_back
target = phd_framework::zfs
verb = snapshot
|
| 245 | 2026-09-30T02:45:48.505Z | DEBG | phd-runner: [TEST - EVENT] executing ZFS command
args = ["phd-artifacts@phd-559112da-8b82-4ff9-b749-3819b3dfada8", "phd-artifacts/phd-clone-da6a707d-31f0-4485-bf45-58d2c9c90a22"]
file = phd-tests/framework/src/zfs.rs
line = 304
path = phd_tests::migrate::from_base::migration_from_base_and_back
target = phd_framework::zfs
verb = clone
|
| 246 | 2026-09-30T02:45:48.525Z | DEBG | phd-runner: [TEST - EVENT] executing ZFS command
args = ["phd-artifacts/phd-clone-da6a707d-31f0-4485-bf45-58d2c9c90a22"]
file = phd-tests/framework/src/zfs.rs
line = 304
path = phd_tests::migrate::from_base::migration_from_base_and_back
target = phd_framework::zfs
verb = list
|
| 247 | 2026-09-30T02:45:48.535Z | DEBG | phd-runner: [TEST - EVENT] parsing zfs list output
file = phd-tests/framework/src/zfs.rs
line = 238
path = phd_tests::migrate::from_base::migration_from_base_and_back
stdout = NAME USED AVAIL REFER MOUNTPOINT\nphd-artifacts/phd-clone-da6a707d-31f0-4485-bf45-58d2c9c90a22 0B 25.3T 1.30G /phd-artifacts/phd-clone-da6a707d-31f0-4485-bf45-58d2c9c90a22\n
target = phd_framework::zfs
|
| 248 | 2026-09-30T02:45:48.536Z | INFO | phd-runner: [NEW - START]
file = phd-tests/framework/src/test_vm/mod.rs
line = 300
path = phd_tests::migrate::from_base::migration_from_base_and_back
target = phd_framework::test_vm
|
| 249 | 2026-09-30T02:45:48.536Z | INFO | phd-runner: [NEW - EVENT] phd_framework::test_vm
environment = EnvironmentSpec { location: Local, propolis_artifact: "__BASE_PROPOLIS", metrics: None }
file = phd-tests/framework/src/test_vm/mod.rs
guest_os_kind = Alpine
line = 318
path = phd_tests::migrate::from_base::migration_from_base_and_back
target = phd_framework::test_vm
vm_name = migration_from_base_and_back
|
| 250 | 2026-09-30T02:45:48.536Z | DEBG | phd-runner: [NEW - EVENT] Verified artifact already exists
file = phd-tests/framework/src/artifacts/store.rs
line = 45
path = /phd-artifacts/1e7667ffdc98b10de9e84d649107cd4d14e4a206aca4e30bf33d9d472c03b8ae/propolis-server
target = phd_framework::artifacts::store
|
| 251 | 2026-09-30T02:45:48.536Z | INFO | phd-runner: [NEW - EVENT] Launching Propolis server
bootrom_path = "/phd-artifacts/740187046a7267d0de72d3455070333547dbc0ea023531471fb2b2a61effa448/OVMF_CODE.fd"
file = phd-tests/framework/src/test_vm/server.rs
line = 66
path = phd_tests::migrate::from_base::migration_from_base_and_back
server_addr = 127.0.0.1:9000
server_path = "/phd-artifacts/1e7667ffdc98b10de9e84d649107cd4d14e4a206aca4e30bf33d9d472c03b8ae/propolis-server"
target = phd_framework::test_vm::server
|
| 252 | 2026-09-30T02:45:48.536Z | INFO | phd-runner: [NEW - EVENT] Opening server log files
file = phd-tests/framework/src/log_config.rs
line = 84
path = phd_tests::migrate::from_base::migration_from_base_and_back
stderr_path = "/tmp/propolis-phd/phd_tests::migrate::from_base::migration_from_base_and_back/migration_from_base_and_back.stderr.log"
stdout_path = "/tmp/propolis-phd/phd_tests::migrate::from_base::migration_from_base_and_back/migration_from_base_and_back.stdout.log"
target = phd_framework::log_config
|
| 253 | 2026-09-30T02:45:48.578Z | INFO | phd-runner: [NEW - EVENT] Launched server with pid 937
file = phd-tests/framework/src/test_vm/server.rs
line = 127
path = phd_tests::migrate::from_base::migration_from_base_and_back
target = phd_framework::test_vm::server
|
| 254 | 2026-09-30T02:45:48.593Z | INFO | phd-runner: [NEW - END]
elapsed_milliseconds = 56
file = phd-tests/framework/src/test_vm/mod.rs
line = 300
path = phd_tests::migrate::from_base::migration_from_base_and_back
target = phd_framework::test_vm
|
| 255 | 2026-09-30T02:45:48.593Z | INFO | phd-runner: [INSTANCE_ENSURE_INTERNAL - START]
file = phd-tests/framework/src/test_vm/mod.rs
line = 412
path = phd_tests::migrate::from_base::migration_from_base_and_back
target = phd_framework::test_vm
vm = migration_from_base_and_back
vm_id = 9582478d-d984-4a1d-96bb-5c7fef877bc4
|
| 256 | 2026-09-30T02:45:48.593Z | INFO | phd-runner: [INSTANCE_ENSURE_INTERNAL - EVENT] retriable error from instance_spec_ensure
e = Communication Error: error sending request for url (http://127.0.0.1:9000/instance)
file = phd-tests/framework/src/test_vm/mod.rs
line = 455
path = phd_tests::migrate::from_base::migration_from_base_and_back
target = phd_framework::test_vm
vm = migration_from_base_and_back
vm_id = 9582478d-d984-4a1d-96bb-5c7fef877bc4
|
| 257 | 2026-09-30T02:45:49.402Z | INFO | phd-runner: [SERIAL CONSOLE TASK - START]
file = phd-tests/framework/src/serial/mod.rs
line = 200
target = phd_framework::serial
|
| 258 | 2026-09-30T02:45:49.403Z | INFO | phd-runner: [INSTANCE_ENSURE_INTERNAL - EVENT] Started instance
file = phd-tests/framework/src/test_vm/mod.rs
instance_description.instance = Instance { properties: InstanceProperties { id: 9582478d-d984-4a1d-96bb-5c7fef877bc4, name: "phd-vm-9582478d-d984-4a1d-96bb-5c7fef877bc4", description: "Pheidippides-managed VM", metadata: InstanceMetadata { silo_id: 87329f99-9f2f-4a1c-a24e-0b98d494e4cc, project_id: 2d110cdc-4bd7-43e4-919c-db6fb72c445b, sled_id: 2e272a48-7321-4d25-bad1-d55260d27d67, sled_serial: "2e272a48-7321-4d25-bad1-d55260d27d67", sled_revision: 1, sled_model: "pheidippes" } }, state: Creating }
line = 514
path = phd_tests::migrate::from_base::migration_from_base_and_back
target = phd_framework::test_vm
vm = migration_from_base_and_back
vm_id = 9582478d-d984-4a1d-96bb-5c7fef877bc4
|
| 259 | 2026-09-30T02:45:49.403Z | INFO | phd-runner: [PUT_INSTANCE_STATE - START]
file = phd-tests/framework/src/test_vm/mod.rs
line = 575
path = phd_tests::migrate::from_base::migration_from_base_and_back
target = phd_framework::test_vm
vm = migration_from_base_and_back
vm_id = 9582478d-d984-4a1d-96bb-5c7fef877bc4
|
| 260 | 2026-09-30T02:45:49.403Z | INFO | phd-runner: [PUT_INSTANCE_STATE - EVENT] Requesting instance state change
file = phd-tests/framework/src/test_vm/mod.rs
line = 580
path = phd_tests::migrate::from_base::migration_from_base_and_back
state = Run
target = phd_framework::test_vm
vm = migration_from_base_and_back
vm_id = 9582478d-d984-4a1d-96bb-5c7fef877bc4
|
| 261 | 2026-09-30T02:45:49.404Z | INFO | phd-runner: [PUT_INSTANCE_STATE - END]
elapsed_milliseconds = 0
file = phd-tests/framework/src/test_vm/mod.rs
line = 575
path = phd_tests::migrate::from_base::migration_from_base_and_back
target = phd_framework::test_vm
vm = migration_from_base_and_back
vm_id = 9582478d-d984-4a1d-96bb-5c7fef877bc4
|
| 262 | 2026-09-30T02:45:49.404Z | INFO | phd-runner: [WAIT_TO_BOOT - START]
file = phd-tests/framework/src/test_vm/mod.rs
line = 890
path = phd_tests::migrate::from_base::migration_from_base_and_back
target = phd_framework::test_vm
|
| 263 | 2026-09-30T02:45:49.404Z | INFO | phd-runner: [WAIT_TO_BOOT - EVENT] waiting for guest to boot
file = phd-tests/framework/src/test_vm/mod.rs
line = 839
path = phd_tests::migrate::from_base::migration_from_base_and_back
target = phd_framework::test_vm
timeout_duration = 300s
vm = migration_from_base_and_back
vm_id = 9582478d-d984-4a1d-96bb-5c7fef877bc4
|
| 264 | 2026-09-30T02:45:49.404Z | DEBG | phd-runner: [WAIT_TO_BOOT - EVENT] executing command in boot sequence
file = phd-tests/framework/src/test_vm/mod.rs
line = 847
path = phd_tests::migrate::from_base::migration_from_base_and_back
step = WaitFor("localhost login: ")
target = phd_framework::test_vm
|
| 265 | 2026-09-30T02:45:49.404Z | INFO | phd-runner: [WAIT_FOR_SERIAL_OUTPUT - START]
file = phd-tests/framework/src/test_vm/mod.rs
line = 913
path = phd_tests::migrate::from_base::migration_from_base_and_back
target = phd_framework::test_vm
vm = migration_from_base_and_back
vm_id = 9582478d-d984-4a1d-96bb-5c7fef877bc4
|
| 266 | 2026-09-30T02:45:49.404Z | INFO | phd-runner: [WAIT_FOR_SERIAL_OUTPUT - EVENT] Waiting for output on serial console
file = phd-tests/framework/src/test_vm/mod.rs
line = 920
path = phd_tests::migrate::from_base::migration_from_base_and_back
target = phd_framework::test_vm
timeout_duration = CallerTimeout
vm = migration_from_base_and_back
vm_id = 9582478d-d984-4a1d-96bb-5c7fef877bc4
|
| 267 | 2026-09-30T02:45:54.001Z | INFO | phd-runner: [WAIT_FOR_SERIAL_OUTPUT - END]
elapsed_milliseconds = 4596
file = phd-tests/framework/src/test_vm/mod.rs
line = 913
path = phd_tests::migrate::from_base::migration_from_base_and_back
target = phd_framework::test_vm
vm = migration_from_base_and_back
vm_id = 9582478d-d984-4a1d-96bb-5c7fef877bc4
|
| 268 | 2026-09-30T02:45:54.001Z | DEBG | phd-runner: [WAIT_TO_BOOT - EVENT] executing command in boot sequence
file = phd-tests/framework/src/test_vm/mod.rs
line = 847
path = phd_tests::migrate::from_base::migration_from_base_and_back
step = WriteStr("root")
target = phd_framework::test_vm
|
| 269 | 2026-09-30T02:45:54.001Z | DEBG | phd-runner: [WAIT_TO_BOOT - EVENT] executing command in boot sequence
file = phd-tests/framework/src/test_vm/mod.rs
line = 847
path = phd_tests::migrate::from_base::migration_from_base_and_back
step = WaitFor("localhost:~#")
target = phd_framework::test_vm
|
| 270 | 2026-09-30T02:45:54.001Z | INFO | phd-runner: [WAIT_FOR_SERIAL_OUTPUT - START]
file = phd-tests/framework/src/test_vm/mod.rs
line = 913
path = phd_tests::migrate::from_base::migration_from_base_and_back
target = phd_framework::test_vm
vm = migration_from_base_and_back
vm_id = 9582478d-d984-4a1d-96bb-5c7fef877bc4
|
| 271 | 2026-09-30T02:45:54.001Z | INFO | phd-runner: [WAIT_FOR_SERIAL_OUTPUT - EVENT] Waiting for output on serial console
file = phd-tests/framework/src/test_vm/mod.rs
line = 920
path = phd_tests::migrate::from_base::migration_from_base_and_back
target = phd_framework::test_vm
timeout_duration = CallerTimeout
vm = migration_from_base_and_back
vm_id = 9582478d-d984-4a1d-96bb-5c7fef877bc4
|
| 272 | 2026-09-30T02:45:54.021Z | INFO | phd-runner: [WAIT_FOR_SERIAL_OUTPUT - END]
elapsed_milliseconds = 18
file = phd-tests/framework/src/test_vm/mod.rs
line = 913
path = phd_tests::migrate::from_base::migration_from_base_and_back
target = phd_framework::test_vm
vm = migration_from_base_and_back
vm_id = 9582478d-d984-4a1d-96bb-5c7fef877bc4
|
| 273 | 2026-09-30T02:45:54.021Z | DEBG | phd-runner: [WAIT_TO_BOOT - EVENT] executing command in boot sequence
file = phd-tests/framework/src/test_vm/mod.rs
line = 847
path = phd_tests::migrate::from_base::migration_from_base_and_back
step = WriteStr("stty -F `tty` cols 9999")
target = phd_framework::test_vm
|
| 274 | 2026-09-30T02:45:54.021Z | DEBG | phd-runner: [WAIT_TO_BOOT - EVENT] executing command in boot sequence
file = phd-tests/framework/src/test_vm/mod.rs
line = 847
path = phd_tests::migrate::from_base::migration_from_base_and_back
step = WaitFor("localhost:~#")
target = phd_framework::test_vm
|
| 275 | 2026-09-30T02:45:54.021Z | INFO | phd-runner: [WAIT_FOR_SERIAL_OUTPUT - START]
file = phd-tests/framework/src/test_vm/mod.rs
line = 913
path = phd_tests::migrate::from_base::migration_from_base_and_back
target = phd_framework::test_vm
vm = migration_from_base_and_back
vm_id = 9582478d-d984-4a1d-96bb-5c7fef877bc4
|
| 276 | 2026-09-30T02:45:54.021Z | INFO | phd-runner: [WAIT_FOR_SERIAL_OUTPUT - EVENT] Waiting for output on serial console
file = phd-tests/framework/src/test_vm/mod.rs
line = 920
path = phd_tests::migrate::from_base::migration_from_base_and_back
target = phd_framework::test_vm
timeout_duration = CallerTimeout
vm = migration_from_base_and_back
vm_id = 9582478d-d984-4a1d-96bb-5c7fef877bc4
|
| 277 | 2026-09-30T02:45:54.054Z | INFO | phd-runner: [WAIT_FOR_SERIAL_OUTPUT - END]
elapsed_milliseconds = 32
file = phd-tests/framework/src/test_vm/mod.rs
line = 913
path = phd_tests::migrate::from_base::migration_from_base_and_back
target = phd_framework::test_vm
vm = migration_from_base_and_back
vm_id = 9582478d-d984-4a1d-96bb-5c7fef877bc4
|
| 278 | 2026-09-30T02:45:54.054Z | INFO | phd-runner: [WAIT_TO_BOOT - EVENT] Guest has booted
file = phd-tests/framework/src/test_vm/mod.rs
line = 887
path = phd_tests::migrate::from_base::migration_from_base_and_back
target = phd_framework::test_vm
|
| 279 | 2026-09-30T02:45:54.054Z | INFO | phd-runner: [WAIT_TO_BOOT - END]
elapsed_milliseconds = 4649
file = phd-tests/framework/src/test_vm/mod.rs
line = 890
path = phd_tests::migrate::from_base::migration_from_base_and_back
target = phd_framework::test_vm
|
| 280 | 2026-09-30T02:45:54.054Z | INFO | phd-runner: [WAIT_FOR_SERIAL_OUTPUT - START]
file = phd-tests/framework/src/test_vm/mod.rs
line = 913
path = phd_tests::migrate::from_base::migration_from_base_and_back
target = phd_framework::test_vm
vm = migration_from_base_and_back
vm_id = 9582478d-d984-4a1d-96bb-5c7fef877bc4
|
| 281 | 2026-09-30T02:45:54.054Z | INFO | phd-runner: [WAIT_FOR_SERIAL_OUTPUT - EVENT] Waiting for output on serial console
file = phd-tests/framework/src/test_vm/mod.rs
line = 920
path = phd_tests::migrate::from_base::migration_from_base_and_back
target = phd_framework::test_vm
timeout_duration = Explicit(15s)
vm = migration_from_base_and_back
vm_id = 9582478d-d984-4a1d-96bb-5c7fef877bc4
|
| 282 | 2026-09-30T02:45:54.065Z | INFO | phd-runner: [WAIT_FOR_SERIAL_OUTPUT - END]
elapsed_milliseconds = 10
file = phd-tests/framework/src/test_vm/mod.rs
line = 913
path = phd_tests::migrate::from_base::migration_from_base_and_back
target = phd_framework::test_vm
vm = migration_from_base_and_back
vm_id = 9582478d-d984-4a1d-96bb-5c7fef877bc4
|
| 283 | 2026-09-30T02:45:54.065Z | INFO | phd-runner: [WAIT_FOR_SERIAL_OUTPUT - START]
file = phd-tests/framework/src/test_vm/mod.rs
line = 913
path = phd_tests::migrate::from_base::migration_from_base_and_back
target = phd_framework::test_vm
vm = migration_from_base_and_back
vm_id = 9582478d-d984-4a1d-96bb-5c7fef877bc4
|
| 284 | 2026-09-30T02:45:54.065Z | INFO | phd-runner: [WAIT_FOR_SERIAL_OUTPUT - EVENT] Waiting for output on serial console
file = phd-tests/framework/src/test_vm/mod.rs
line = 920
path = phd_tests::migrate::from_base::migration_from_base_and_back
target = phd_framework::test_vm
timeout_duration = Explicit(300s)
vm = migration_from_base_and_back
vm_id = 9582478d-d984-4a1d-96bb-5c7fef877bc4
|
| 285 | 2026-09-30T02:45:54.098Z | INFO | phd-runner: [WAIT_FOR_SERIAL_OUTPUT - END]
elapsed_milliseconds = 32
file = phd-tests/framework/src/test_vm/mod.rs
line = 913
path = phd_tests::migrate::from_base::migration_from_base_and_back
target = phd_framework::test_vm
vm = migration_from_base_and_back
vm_id = 9582478d-d984-4a1d-96bb-5c7fef877bc4
|
| 286 | 2026-09-30T02:45:54.099Z | INFO | phd-runner: [WAIT_FOR_SERIAL_OUTPUT - START]
file = phd-tests/framework/src/test_vm/mod.rs
line = 913
path = phd_tests::migrate::from_base::migration_from_base_and_back
target = phd_framework::test_vm
vm = migration_from_base_and_back
vm_id = 9582478d-d984-4a1d-96bb-5c7fef877bc4
|
| 287 | 2026-09-30T02:45:54.099Z | INFO | phd-runner: [WAIT_FOR_SERIAL_OUTPUT - EVENT] Waiting for output on serial console
file = phd-tests/framework/src/test_vm/mod.rs
line = 920
path = phd_tests::migrate::from_base::migration_from_base_and_back
target = phd_framework::test_vm
timeout_duration = Explicit(15s)
vm = migration_from_base_and_back
vm_id = 9582478d-d984-4a1d-96bb-5c7fef877bc4
|
| 288 | 2026-09-30T02:45:54.110Z | INFO | phd-runner: [WAIT_FOR_SERIAL_OUTPUT - END]
elapsed_milliseconds = 10
file = phd-tests/framework/src/test_vm/mod.rs
line = 913
path = phd_tests::migrate::from_base::migration_from_base_and_back
target = phd_framework::test_vm
vm = migration_from_base_and_back
vm_id = 9582478d-d984-4a1d-96bb-5c7fef877bc4
|
| 289 | 2026-09-30T02:45:54.110Z | INFO | phd-runner: [WAIT_FOR_SERIAL_OUTPUT - START]
file = phd-tests/framework/src/test_vm/mod.rs
line = 913
path = phd_tests::migrate::from_base::migration_from_base_and_back
target = phd_framework::test_vm
vm = migration_from_base_and_back
vm_id = 9582478d-d984-4a1d-96bb-5c7fef877bc4
|
| 290 | 2026-09-30T02:45:54.110Z | INFO | phd-runner: [WAIT_FOR_SERIAL_OUTPUT - EVENT] Waiting for output on serial console
file = phd-tests/framework/src/test_vm/mod.rs
line = 920
path = phd_tests::migrate::from_base::migration_from_base_and_back
target = phd_framework::test_vm
timeout_duration = Explicit(300s)
vm = migration_from_base_and_back
vm_id = 9582478d-d984-4a1d-96bb-5c7fef877bc4
|
| 291 | 2026-09-30T02:45:54.144Z | INFO | phd-runner: [WAIT_FOR_SERIAL_OUTPUT - END]
elapsed_milliseconds = 33
file = phd-tests/framework/src/test_vm/mod.rs
line = 913
path = phd_tests::migrate::from_base::migration_from_base_and_back
target = phd_framework::test_vm
vm = migration_from_base_and_back
vm_id = 9582478d-d984-4a1d-96bb-5c7fef877bc4
|
| 292 | 2026-09-30T02:45:54.144Z | INFO | phd-runner: [WAIT_FOR_SERIAL_OUTPUT - START]
file = phd-tests/framework/src/test_vm/mod.rs
line = 913
path = phd_tests::migrate::from_base::migration_from_base_and_back
target = phd_framework::test_vm
vm = migration_from_base_and_back
vm_id = 9582478d-d984-4a1d-96bb-5c7fef877bc4
|
| 293 | 2026-09-30T02:45:54.144Z | INFO | phd-runner: [WAIT_FOR_SERIAL_OUTPUT - EVENT] Waiting for output on serial console
file = phd-tests/framework/src/test_vm/mod.rs
line = 920
path = phd_tests::migrate::from_base::migration_from_base_and_back
target = phd_framework::test_vm
timeout_duration = Explicit(15s)
vm = migration_from_base_and_back
vm_id = 9582478d-d984-4a1d-96bb-5c7fef877bc4
|
| 294 | 2026-09-30T02:45:54.155Z | INFO | phd-runner: [WAIT_FOR_SERIAL_OUTPUT - END]
elapsed_milliseconds = 10
file = phd-tests/framework/src/test_vm/mod.rs
line = 913
path = phd_tests::migrate::from_base::migration_from_base_and_back
target = phd_framework::test_vm
vm = migration_from_base_and_back
vm_id = 9582478d-d984-4a1d-96bb-5c7fef877bc4
|
| 295 | 2026-09-30T02:45:54.155Z | INFO | phd-runner: [WAIT_FOR_SERIAL_OUTPUT - START]
file = phd-tests/framework/src/test_vm/mod.rs
line = 913
path = phd_tests::migrate::from_base::migration_from_base_and_back
target = phd_framework::test_vm
vm = migration_from_base_and_back
vm_id = 9582478d-d984-4a1d-96bb-5c7fef877bc4
|
| 296 | 2026-09-30T02:45:54.155Z | INFO | phd-runner: [WAIT_FOR_SERIAL_OUTPUT - EVENT] Waiting for output on serial console
file = phd-tests/framework/src/test_vm/mod.rs
line = 920
path = phd_tests::migrate::from_base::migration_from_base_and_back
target = phd_framework::test_vm
timeout_duration = Explicit(300s)
vm = migration_from_base_and_back
vm_id = 9582478d-d984-4a1d-96bb-5c7fef877bc4
|
| 297 | 2026-09-30T02:45:54.188Z | INFO | phd-runner: [WAIT_FOR_SERIAL_OUTPUT - END]
elapsed_milliseconds = 33
file = phd-tests/framework/src/test_vm/mod.rs
line = 913
path = phd_tests::migrate::from_base::migration_from_base_and_back
target = phd_framework::test_vm
vm = migration_from_base_and_back
vm_id = 9582478d-d984-4a1d-96bb-5c7fef877bc4
|
| 298 | 2026-09-30T02:45:54.189Z | INFO | phd-runner: [WAIT_FOR_SERIAL_OUTPUT - START]
file = phd-tests/framework/src/test_vm/mod.rs
line = 913
path = phd_tests::migrate::from_base::migration_from_base_and_back
target = phd_framework::test_vm
vm = migration_from_base_and_back
vm_id = 9582478d-d984-4a1d-96bb-5c7fef877bc4
|
| 299 | 2026-09-30T02:45:54.189Z | INFO | phd-runner: [WAIT_FOR_SERIAL_OUTPUT - EVENT] Waiting for output on serial console
file = phd-tests/framework/src/test_vm/mod.rs
line = 920
path = phd_tests::migrate::from_base::migration_from_base_and_back
target = phd_framework::test_vm
timeout_duration = Explicit(15s)
vm = migration_from_base_and_back
vm_id = 9582478d-d984-4a1d-96bb-5c7fef877bc4
|
| 300 | 2026-09-30T02:45:54.199Z | INFO | phd-runner: [WAIT_FOR_SERIAL_OUTPUT - END]
elapsed_milliseconds = 10
file = phd-tests/framework/src/test_vm/mod.rs
line = 913
path = phd_tests::migrate::from_base::migration_from_base_and_back
target = phd_framework::test_vm
vm = migration_from_base_and_back
vm_id = 9582478d-d984-4a1d-96bb-5c7fef877bc4
|
| 301 | 2026-09-30T02:45:54.199Z | INFO | phd-runner: [WAIT_FOR_SERIAL_OUTPUT - START]
file = phd-tests/framework/src/test_vm/mod.rs
line = 913
path = phd_tests::migrate::from_base::migration_from_base_and_back
target = phd_framework::test_vm
vm = migration_from_base_and_back
vm_id = 9582478d-d984-4a1d-96bb-5c7fef877bc4
|
| 302 | 2026-09-30T02:45:54.199Z | INFO | phd-runner: [WAIT_FOR_SERIAL_OUTPUT - EVENT] Waiting for output on serial console
file = phd-tests/framework/src/test_vm/mod.rs
line = 920
path = phd_tests::migrate::from_base::migration_from_base_and_back
target = phd_framework::test_vm
timeout_duration = Explicit(300s)
vm = migration_from_base_and_back
vm_id = 9582478d-d984-4a1d-96bb-5c7fef877bc4
|
| 303 | 2026-09-30T02:45:54.232Z | INFO | phd-runner: [WAIT_FOR_SERIAL_OUTPUT - END]
elapsed_milliseconds = 32
file = phd-tests/framework/src/test_vm/mod.rs
line = 913
path = phd_tests::migrate::from_base::migration_from_base_and_back
target = phd_framework::test_vm
vm = migration_from_base_and_back
vm_id = 9582478d-d984-4a1d-96bb-5c7fef877bc4
|
| 304 | 2026-09-30T02:45:54.232Z | INFO | phd-runner: [WAIT_FOR_SERIAL_OUTPUT - START]
file = phd-tests/framework/src/test_vm/mod.rs
line = 913
path = phd_tests::migrate::from_base::migration_from_base_and_back
target = phd_framework::test_vm
vm = migration_from_base_and_back
vm_id = 9582478d-d984-4a1d-96bb-5c7fef877bc4
|
| 305 | 2026-09-30T02:45:54.232Z | INFO | phd-runner: [WAIT_FOR_SERIAL_OUTPUT - EVENT] Waiting for output on serial console
file = phd-tests/framework/src/test_vm/mod.rs
line = 920
path = phd_tests::migrate::from_base::migration_from_base_and_back
target = phd_framework::test_vm
timeout_duration = Explicit(15s)
vm = migration_from_base_and_back
vm_id = 9582478d-d984-4a1d-96bb-5c7fef877bc4
|
| 306 | 2026-09-30T02:45:54.243Z | INFO | phd-runner: [WAIT_FOR_SERIAL_OUTPUT - END]
elapsed_milliseconds = 11
file = phd-tests/framework/src/test_vm/mod.rs
line = 913
path = phd_tests::migrate::from_base::migration_from_base_and_back
target = phd_framework::test_vm
vm = migration_from_base_and_back
vm_id = 9582478d-d984-4a1d-96bb-5c7fef877bc4
|
| 307 | 2026-09-30T02:45:54.244Z | INFO | phd-runner: [WAIT_FOR_SERIAL_OUTPUT - START]
file = phd-tests/framework/src/test_vm/mod.rs
line = 913
path = phd_tests::migrate::from_base::migration_from_base_and_back
target = phd_framework::test_vm
vm = migration_from_base_and_back
vm_id = 9582478d-d984-4a1d-96bb-5c7fef877bc4
|
| 308 | 2026-09-30T02:45:54.244Z | INFO | phd-runner: [WAIT_FOR_SERIAL_OUTPUT - EVENT] Waiting for output on serial console
file = phd-tests/framework/src/test_vm/mod.rs
line = 920
path = phd_tests::migrate::from_base::migration_from_base_and_back
target = phd_framework::test_vm
timeout_duration = Explicit(300s)
vm = migration_from_base_and_back
vm_id = 9582478d-d984-4a1d-96bb-5c7fef877bc4
|
| 309 | 2026-09-30T02:45:54.277Z | INFO | phd-runner: [WAIT_FOR_SERIAL_OUTPUT - END]
elapsed_milliseconds = 33
file = phd-tests/framework/src/test_vm/mod.rs
line = 913
path = phd_tests::migrate::from_base::migration_from_base_and_back
target = phd_framework::test_vm
vm = migration_from_base_and_back
vm_id = 9582478d-d984-4a1d-96bb-5c7fef877bc4
|
| 310 | 2026-09-30T02:45:54.277Z | INFO | phd-runner: [WAIT_FOR_SERIAL_OUTPUT - START]
file = phd-tests/framework/src/test_vm/mod.rs
line = 913
path = phd_tests::migrate::from_base::migration_from_base_and_back
target = phd_framework::test_vm
vm = migration_from_base_and_back
vm_id = 9582478d-d984-4a1d-96bb-5c7fef877bc4
|
| 311 | 2026-09-30T02:45:54.277Z | INFO | phd-runner: [WAIT_FOR_SERIAL_OUTPUT - EVENT] Waiting for output on serial console
file = phd-tests/framework/src/test_vm/mod.rs
line = 920
path = phd_tests::migrate::from_base::migration_from_base_and_back
target = phd_framework::test_vm
timeout_duration = Explicit(15s)
vm = migration_from_base_and_back
vm_id = 9582478d-d984-4a1d-96bb-5c7fef877bc4
|
| 312 | 2026-09-30T02:45:54.288Z | INFO | phd-runner: [WAIT_FOR_SERIAL_OUTPUT - END]
elapsed_milliseconds = 10
file = phd-tests/framework/src/test_vm/mod.rs
line = 913
path = phd_tests::migrate::from_base::migration_from_base_and_back
target = phd_framework::test_vm
vm = migration_from_base_and_back
vm_id = 9582478d-d984-4a1d-96bb-5c7fef877bc4
|
| 313 | 2026-09-30T02:45:54.288Z | INFO | phd-runner: [WAIT_FOR_SERIAL_OUTPUT - START]
file = phd-tests/framework/src/test_vm/mod.rs
line = 913
path = phd_tests::migrate::from_base::migration_from_base_and_back
target = phd_framework::test_vm
vm = migration_from_base_and_back
vm_id = 9582478d-d984-4a1d-96bb-5c7fef877bc4
|
| 314 | 2026-09-30T02:45:54.288Z | INFO | phd-runner: [WAIT_FOR_SERIAL_OUTPUT - EVENT] Waiting for output on serial console
file = phd-tests/framework/src/test_vm/mod.rs
line = 920
path = phd_tests::migrate::from_base::migration_from_base_and_back
target = phd_framework::test_vm
timeout_duration = Explicit(300s)
vm = migration_from_base_and_back
vm_id = 9582478d-d984-4a1d-96bb-5c7fef877bc4
|
| 315 | 2026-09-30T02:45:54.321Z | INFO | phd-runner: [WAIT_FOR_SERIAL_OUTPUT - END]
elapsed_milliseconds = 32
file = phd-tests/framework/src/test_vm/mod.rs
line = 913
path = phd_tests::migrate::from_base::migration_from_base_and_back
target = phd_framework::test_vm
vm = migration_from_base_and_back
vm_id = 9582478d-d984-4a1d-96bb-5c7fef877bc4
|
| 316 | 2026-09-30T02:45:54.321Z | INFO | phd-runner: [TEST - EVENT] migrating to new Propolis artifact for lifecycle test
file = phd-tests/framework/src/lifecycle.rs
line = 73
path = phd_tests::migrate::from_base::migration_from_base_and_back
propolis_artifact = __DEFAULT_PROPOLIS
target = phd_framework::lifecycle
vm_name = migration_from_base_and_back
|
| 317 | 2026-09-30T02:45:54.321Z | INFO | phd-runner: [NEW - START]
file = phd-tests/framework/src/test_vm/mod.rs
line = 300
path = phd_tests::migrate::from_base::migration_from_base_and_back
target = phd_framework::test_vm
|
| 318 | 2026-09-30T02:45:54.321Z | INFO | phd-runner: [NEW - EVENT] phd_framework::test_vm
environment = EnvironmentSpec { location: Local, propolis_artifact: "__DEFAULT_PROPOLIS", metrics: None }
file = phd-tests/framework/src/test_vm/mod.rs
guest_os_kind = Alpine
line = 318
path = phd_tests::migrate::from_base::migration_from_base_and_back
target = phd_framework::test_vm
vm_name = migration_from_base_and_back_lifecycle_0
|
| 319 | 2026-09-30T02:45:54.321Z | DEBG | phd-runner: [NEW - EVENT] Verified artifact already exists
file = phd-tests/framework/src/artifacts/store.rs
line = 45
path = /work/phd-test/propolis-server
target = phd_framework::artifacts::store
|
| 320 | 2026-09-30T02:45:54.321Z | INFO | phd-runner: [NEW - EVENT] Launching Propolis server
bootrom_path = "/phd-artifacts/740187046a7267d0de72d3455070333547dbc0ea023531471fb2b2a61effa448/OVMF_CODE.fd"
file = phd-tests/framework/src/test_vm/server.rs
line = 66
path = phd_tests::migrate::from_base::migration_from_base_and_back
server_addr = 127.0.0.1:9002
server_path = "/work/phd-test/propolis-server"
target = phd_framework::test_vm::server
|
| 321 | 2026-09-30T02:45:54.321Z | INFO | phd-runner: [NEW - EVENT] Opening server log files
file = phd-tests/framework/src/log_config.rs
line = 84
path = phd_tests::migrate::from_base::migration_from_base_and_back
stderr_path = "/tmp/propolis-phd/phd_tests::migrate::from_base::migration_from_base_and_back/migration_from_base_and_back_lifecycle_0.stderr.log"
stdout_path = "/tmp/propolis-phd/phd_tests::migrate::from_base::migration_from_base_and_back/migration_from_base_and_back_lifecycle_0.stdout.log"
target = phd_framework::log_config
|
| 322 | 2026-09-30T02:45:54.358Z | INFO | phd-runner: [NEW - EVENT] Launched server with pid 938
file = phd-tests/framework/src/test_vm/server.rs
line = 127
path = phd_tests::migrate::from_base::migration_from_base_and_back
target = phd_framework::test_vm::server
|
| 323 | 2026-09-30T02:45:54.371Z | INFO | phd-runner: [NEW - END]
elapsed_milliseconds = 49
file = phd-tests/framework/src/test_vm/mod.rs
line = 300
path = phd_tests::migrate::from_base::migration_from_base_and_back
target = phd_framework::test_vm
|
| 324 | 2026-09-30T02:45:54.371Z | INFO | phd-runner: [MIGRATE_FROM - START]
file = phd-tests/framework/src/test_vm/mod.rs
line = 609
path = phd_tests::migrate::from_base::migration_from_base_and_back
source = migration_from_base_and_back
source_id = 9582478d-d984-4a1d-96bb-5c7fef877bc4
target = phd_framework::test_vm
target_id = 3bbb8dc6-1826-42bb-bed3-c0ee418ac151
|
| 325 | 2026-09-30T02:45:54.371Z | INFO | phd-runner: [MIGRATE_FROM - EVENT] Migrating from source at address 127.0.0.1:9000
file = phd-tests/framework/src/test_vm/mod.rs
line = 642
migration_id = 59264776-7473-433b-961b-fda9787d2c61
path = phd_tests::migrate::from_base::migration_from_base_and_back
source = migration_from_base_and_back
source_id = 9582478d-d984-4a1d-96bb-5c7fef877bc4
target = phd_framework::test_vm
target_id = 3bbb8dc6-1826-42bb-bed3-c0ee418ac151
timeout_duration = 45s
|
| 326 | 2026-09-30T02:45:54.371Z | INFO | phd-runner: [INSTANCE_ENSURE_INTERNAL - START]
file = phd-tests/framework/src/test_vm/mod.rs
line = 412
path = phd_tests::migrate::from_base::migration_from_base_and_back
source = migration_from_base_and_back
source_id = 9582478d-d984-4a1d-96bb-5c7fef877bc4
target = phd_framework::test_vm
target_id = 3bbb8dc6-1826-42bb-bed3-c0ee418ac151
vm = migration_from_base_and_back_lifecycle_0
vm_id = 3bbb8dc6-1826-42bb-bed3-c0ee418ac151
|
| 327 | 2026-09-30T02:45:54.371Z | INFO | phd-runner: [INSTANCE_ENSURE_INTERNAL - EVENT] retriable error from instance_spec_ensure
e = Communication Error: error sending request for url (http://127.0.0.1:9002/instance)
file = phd-tests/framework/src/test_vm/mod.rs
line = 455
path = phd_tests::migrate::from_base::migration_from_base_and_back
source = migration_from_base_and_back
source_id = 9582478d-d984-4a1d-96bb-5c7fef877bc4
target = phd_framework::test_vm
target_id = 3bbb8dc6-1826-42bb-bed3-c0ee418ac151
vm = migration_from_base_and_back_lifecycle_0
vm_id = 3bbb8dc6-1826-42bb-bed3-c0ee418ac151
|
| 328 | 2026-09-30T02:45:55.012Z | INFO | phd-runner: [INSTANCE_ENSURE_INTERNAL - EVENT] Started instance
file = phd-tests/framework/src/test_vm/mod.rs
instance_description.instance = Instance { properties: InstanceProperties { id: 3bbb8dc6-1826-42bb-bed3-c0ee418ac151, name: "phd-vm-3bbb8dc6-1826-42bb-bed3-c0ee418ac151", description: "Pheidippides-managed VM", metadata: InstanceMetadata { silo_id: 87329f99-9f2f-4a1c-a24e-0b98d494e4cc, project_id: 2d110cdc-4bd7-43e4-919c-db6fb72c445b, sled_id: 1b3cb7f1-a1b4-4e45-bc2a-c3876b11fa5c, sled_serial: "1b3cb7f1-a1b4-4e45-bc2a-c3876b11fa5c", sled_revision: 1, sled_model: "pheidippes" } }, state: Migrating }
line = 514
path = phd_tests::migrate::from_base::migration_from_base_and_back
source = migration_from_base_and_back
source_id = 9582478d-d984-4a1d-96bb-5c7fef877bc4
target = phd_framework::test_vm
target_id = 3bbb8dc6-1826-42bb-bed3-c0ee418ac151
vm = migration_from_base_and_back_lifecycle_0
vm_id = 3bbb8dc6-1826-42bb-bed3-c0ee418ac151
|
| 329 | 2026-09-30T02:45:55.012Z | INFO | phd-runner: [MIGRATE - START]
file = phd-tests/framework/src/test_vm/mod.rs
line = 663
migration_id = 59264776-7473-433b-961b-fda9787d2c61
path = phd_tests::migrate::from_base::migration_from_base_and_back
source = migration_from_base_and_back
source_id = 9582478d-d984-4a1d-96bb-5c7fef877bc4
target = phd_framework::test_vm
target_id = 3bbb8dc6-1826-42bb-bed3-c0ee418ac151
|
| 330 | 2026-09-30T02:45:57.535Z | INFO | phd-runner: [SERIAL CONSOLE TASK - EVENT] serial socket control message
file = phd-tests/framework/src/serial/mod.rs
line = 275
s = {"Migrating":{"destination":"127.0.0.1:9002","from_start":7847}}
target = phd_framework::serial
|
| 331 | 2026-09-30T02:45:57.902Z | INFO | phd-runner: [MIGRATE_FROM - EVENT] Migration completed successfully
file = phd-tests/framework/src/test_vm/mod.rs
line = 676
path = phd_tests::migrate::from_base::migration_from_base_and_back
source = migration_from_base_and_back
source_id = 9582478d-d984-4a1d-96bb-5c7fef877bc4
target = phd_framework::test_vm
target_id = 3bbb8dc6-1826-42bb-bed3-c0ee418ac151
|
| 332 | 2026-09-30T02:45:57.902Z | INFO | phd-runner: [MIGRATE - END]
elapsed_milliseconds = 2888
file = phd-tests/framework/src/test_vm/mod.rs
line = 663
migration_id = 59264776-7473-433b-961b-fda9787d2c61
path = phd_tests::migrate::from_base::migration_from_base_and_back
source = migration_from_base_and_back
source_id = 9582478d-d984-4a1d-96bb-5c7fef877bc4
target = phd_framework::test_vm
target_id = 3bbb8dc6-1826-42bb-bed3-c0ee418ac151
|
| 333 | 2026-09-30T02:45:57.904Z | INFO | phd-runner: [VM CLEANUP - START]
file = phd-tests/framework/src/test_vm/mod.rs
line = 1172
path = phd_tests::migrate::from_base::migration_from_base_and_back
target = phd_framework::test_vm
vm = migration_from_base_and_back
vm_id = 9582478d-d984-4a1d-96bb-5c7fef877bc4
|
| 334 | 2026-09-30T02:45:57.904Z | INFO | phd-runner: [WAIT_FOR_SERIAL_OUTPUT - START]
file = phd-tests/framework/src/test_vm/mod.rs
line = 913
path = phd_tests::migrate::from_base::migration_from_base_and_back
target = phd_framework::test_vm
vm = migration_from_base_and_back_lifecycle_0
vm_id = 3bbb8dc6-1826-42bb-bed3-c0ee418ac151
|
| 335 | 2026-09-30T02:45:57.904Z | INFO | phd-runner: [WAIT_FOR_SERIAL_OUTPUT - EVENT] Waiting for output on serial console
file = phd-tests/framework/src/test_vm/mod.rs
line = 920
path = phd_tests::migrate::from_base::migration_from_base_and_back
target = phd_framework::test_vm
timeout_duration = Explicit(15s)
vm = migration_from_base_and_back_lifecycle_0
vm_id = 3bbb8dc6-1826-42bb-bed3-c0ee418ac151
|
| 336 | 2026-09-30T02:45:57.906Z | DEBG | phd-runner: [VM CLEANUP - EVENT] Killing Propolis server process
file = phd-tests/framework/src/test_vm/server.rs
line = 177
path = phd_tests::migrate::from_base::migration_from_base_and_back
self.address = 127.0.0.1:9000
target = phd_framework::test_vm::server
vm = migration_from_base_and_back
vm_id = 9582478d-d984-4a1d-96bb-5c7fef877bc4
|
| 337 | 2026-09-30T02:45:57.983Z | INFO | phd-runner: [VM CLEANUP - END]
elapsed_milliseconds = 79
file = phd-tests/framework/src/test_vm/mod.rs
line = 1172
path = phd_tests::migrate::from_base::migration_from_base_and_back
target = phd_framework::test_vm
vm = migration_from_base_and_back
vm_id = 9582478d-d984-4a1d-96bb-5c7fef877bc4
|
| 338 | 2026-09-30T02:45:57.984Z | INFO | phd-runner: [INSTANCE_ENSURE_INTERNAL - END]
elapsed_milliseconds = 9389
file = phd-tests/framework/src/test_vm/mod.rs
line = 412
path = phd_tests::migrate::from_base::migration_from_base_and_back
target = phd_framework::test_vm
vm = migration_from_base_and_back
vm_id = 9582478d-d984-4a1d-96bb-5c7fef877bc4
|
| 339 | 2026-09-30T02:46:00.345Z | INFO | phd-runner: [WAIT_FOR_SERIAL_OUTPUT - END]
elapsed_milliseconds = 2440
file = phd-tests/framework/src/test_vm/mod.rs
line = 913
path = phd_tests::migrate::from_base::migration_from_base_and_back
target = phd_framework::test_vm
vm = migration_from_base_and_back_lifecycle_0
vm_id = 3bbb8dc6-1826-42bb-bed3-c0ee418ac151
|
| 340 | 2026-09-30T02:46:00.345Z | INFO | phd-runner: [WAIT_FOR_SERIAL_OUTPUT - START]
file = phd-tests/framework/src/test_vm/mod.rs
line = 913
path = phd_tests::migrate::from_base::migration_from_base_and_back
target = phd_framework::test_vm
vm = migration_from_base_and_back_lifecycle_0
vm_id = 3bbb8dc6-1826-42bb-bed3-c0ee418ac151
|
| 341 | 2026-09-30T02:46:00.345Z | INFO | phd-runner: [WAIT_FOR_SERIAL_OUTPUT - EVENT] Waiting for output on serial console
file = phd-tests/framework/src/test_vm/mod.rs
line = 920
path = phd_tests::migrate::from_base::migration_from_base_and_back
target = phd_framework::test_vm
timeout_duration = Explicit(300s)
vm = migration_from_base_and_back_lifecycle_0
vm_id = 3bbb8dc6-1826-42bb-bed3-c0ee418ac151
|
| 342 | 2026-09-30T02:46:00.379Z | INFO | phd-runner: [WAIT_FOR_SERIAL_OUTPUT - END]
elapsed_milliseconds = 33
file = phd-tests/framework/src/test_vm/mod.rs
line = 913
path = phd_tests::migrate::from_base::migration_from_base_and_back
target = phd_framework::test_vm
vm = migration_from_base_and_back_lifecycle_0
vm_id = 3bbb8dc6-1826-42bb-bed3-c0ee418ac151
|
| 343 | 2026-09-30T02:46:00.379Z | INFO | phd-runner: [TEST - EVENT] migrating to new Propolis artifact for lifecycle test
file = phd-tests/framework/src/lifecycle.rs
line = 73
path = phd_tests::migrate::from_base::migration_from_base_and_back
propolis_artifact = __BASE_PROPOLIS
target = phd_framework::lifecycle
vm_name = migration_from_base_and_back
|
| 344 | 2026-09-30T02:46:00.379Z | INFO | phd-runner: [NEW - START]
file = phd-tests/framework/src/test_vm/mod.rs
line = 300
path = phd_tests::migrate::from_base::migration_from_base_and_back
target = phd_framework::test_vm
|
| 345 | 2026-09-30T02:46:00.379Z | INFO | phd-runner: [NEW - EVENT] phd_framework::test_vm
environment = EnvironmentSpec { location: Local, propolis_artifact: "__BASE_PROPOLIS", metrics: None }
file = phd-tests/framework/src/test_vm/mod.rs
guest_os_kind = Alpine
line = 318
path = phd_tests::migrate::from_base::migration_from_base_and_back
target = phd_framework::test_vm
vm_name = migration_from_base_and_back_lifecycle_1
|
| 346 | 2026-09-30T02:46:00.379Z | DEBG | phd-runner: [NEW - EVENT] Verified artifact already exists
file = phd-tests/framework/src/artifacts/store.rs
line = 45
path = /phd-artifacts/1e7667ffdc98b10de9e84d649107cd4d14e4a206aca4e30bf33d9d472c03b8ae/propolis-server
target = phd_framework::artifacts::store
|
| 347 | 2026-09-30T02:46:00.379Z | INFO | phd-runner: [NEW - EVENT] Launching Propolis server
bootrom_path = "/phd-artifacts/740187046a7267d0de72d3455070333547dbc0ea023531471fb2b2a61effa448/OVMF_CODE.fd"
file = phd-tests/framework/src/test_vm/server.rs
line = 66
path = phd_tests::migrate::from_base::migration_from_base_and_back
server_addr = 127.0.0.1:9004
server_path = "/phd-artifacts/1e7667ffdc98b10de9e84d649107cd4d14e4a206aca4e30bf33d9d472c03b8ae/propolis-server"
target = phd_framework::test_vm::server
|
| 348 | 2026-09-30T02:46:00.380Z | INFO | phd-runner: [NEW - EVENT] Opening server log files
file = phd-tests/framework/src/log_config.rs
line = 84
path = phd_tests::migrate::from_base::migration_from_base_and_back
stderr_path = "/tmp/propolis-phd/phd_tests::migrate::from_base::migration_from_base_and_back/migration_from_base_and_back_lifecycle_1.stderr.log"
stdout_path = "/tmp/propolis-phd/phd_tests::migrate::from_base::migration_from_base_and_back/migration_from_base_and_back_lifecycle_1.stdout.log"
target = phd_framework::log_config
|
| 349 | 2026-09-30T02:46:00.418Z | INFO | phd-runner: [NEW - EVENT] Launched server with pid 940
file = phd-tests/framework/src/test_vm/server.rs
line = 127
path = phd_tests::migrate::from_base::migration_from_base_and_back
target = phd_framework::test_vm::server
|
| 350 | 2026-09-30T02:46:00.431Z | INFO | phd-runner: [NEW - END]
elapsed_milliseconds = 51
file = phd-tests/framework/src/test_vm/mod.rs
line = 300
path = phd_tests::migrate::from_base::migration_from_base_and_back
target = phd_framework::test_vm
|
| 351 | 2026-09-30T02:46:00.431Z | INFO | phd-runner: [MIGRATE_FROM - START]
file = phd-tests/framework/src/test_vm/mod.rs
line = 609
path = phd_tests::migrate::from_base::migration_from_base_and_back
source = migration_from_base_and_back_lifecycle_0
source_id = 3bbb8dc6-1826-42bb-bed3-c0ee418ac151
target = phd_framework::test_vm
target_id = 28fa9835-29fb-43b2-8fa9-c1f2065b1bf7
|
| 352 | 2026-09-30T02:46:00.431Z | INFO | phd-runner: [MIGRATE_FROM - EVENT] Migrating from source at address 127.0.0.1:9002
file = phd-tests/framework/src/test_vm/mod.rs
line = 642
migration_id = fea9bfa1-5be3-4193-b7cb-fe93ce5f419a
path = phd_tests::migrate::from_base::migration_from_base_and_back
source = migration_from_base_and_back_lifecycle_0
source_id = 3bbb8dc6-1826-42bb-bed3-c0ee418ac151
target = phd_framework::test_vm
target_id = 28fa9835-29fb-43b2-8fa9-c1f2065b1bf7
timeout_duration = 45s
|
| 353 | 2026-09-30T02:46:00.431Z | INFO | phd-runner: [INSTANCE_ENSURE_INTERNAL - START]
file = phd-tests/framework/src/test_vm/mod.rs
line = 412
path = phd_tests::migrate::from_base::migration_from_base_and_back
source = migration_from_base_and_back_lifecycle_0
source_id = 3bbb8dc6-1826-42bb-bed3-c0ee418ac151
target = phd_framework::test_vm
target_id = 28fa9835-29fb-43b2-8fa9-c1f2065b1bf7
vm = migration_from_base_and_back_lifecycle_1
vm_id = 28fa9835-29fb-43b2-8fa9-c1f2065b1bf7
|
| 354 | 2026-09-30T02:46:00.432Z | INFO | phd-runner: [INSTANCE_ENSURE_INTERNAL - EVENT] retriable error from instance_spec_ensure
e = Communication Error: error sending request for url (http://127.0.0.1:9004/instance)
file = phd-tests/framework/src/test_vm/mod.rs
line = 455
path = phd_tests::migrate::from_base::migration_from_base_and_back
source = migration_from_base_and_back_lifecycle_0
source_id = 3bbb8dc6-1826-42bb-bed3-c0ee418ac151
target = phd_framework::test_vm
target_id = 28fa9835-29fb-43b2-8fa9-c1f2065b1bf7
vm = migration_from_base_and_back_lifecycle_1
vm_id = 28fa9835-29fb-43b2-8fa9-c1f2065b1bf7
|
| 355 | 2026-09-30T02:46:01.113Z | INFO | phd-runner: [INSTANCE_ENSURE_INTERNAL - EVENT] Started instance
file = phd-tests/framework/src/test_vm/mod.rs
instance_description.instance = Instance { properties: InstanceProperties { id: 28fa9835-29fb-43b2-8fa9-c1f2065b1bf7, name: "phd-vm-28fa9835-29fb-43b2-8fa9-c1f2065b1bf7", description: "Pheidippides-managed VM", metadata: InstanceMetadata { silo_id: 87329f99-9f2f-4a1c-a24e-0b98d494e4cc, project_id: 2d110cdc-4bd7-43e4-919c-db6fb72c445b, sled_id: 213d8cd2-2f3f-4438-bf61-de8022697ce5, sled_serial: "213d8cd2-2f3f-4438-bf61-de8022697ce5", sled_revision: 1, sled_model: "pheidippes" } }, state: Migrating }
line = 514
path = phd_tests::migrate::from_base::migration_from_base_and_back
source = migration_from_base_and_back_lifecycle_0
source_id = 3bbb8dc6-1826-42bb-bed3-c0ee418ac151
target = phd_framework::test_vm
target_id = 28fa9835-29fb-43b2-8fa9-c1f2065b1bf7
vm = migration_from_base_and_back_lifecycle_1
vm_id = 28fa9835-29fb-43b2-8fa9-c1f2065b1bf7
|
| 356 | 2026-09-30T02:46:01.113Z | INFO | phd-runner: [MIGRATE - START]
file = phd-tests/framework/src/test_vm/mod.rs
line = 663
migration_id = fea9bfa1-5be3-4193-b7cb-fe93ce5f419a
path = phd_tests::migrate::from_base::migration_from_base_and_back
source = migration_from_base_and_back_lifecycle_0
source_id = 3bbb8dc6-1826-42bb-bed3-c0ee418ac151
target = phd_framework::test_vm
target_id = 28fa9835-29fb-43b2-8fa9-c1f2065b1bf7
|
| 357 | 2026-09-30T02:46:03.646Z | INFO | phd-runner: [SERIAL CONSOLE TASK - EVENT] serial socket control message
file = phd-tests/framework/src/serial/mod.rs
line = 275
s = {"Migrating":{"destination":"127.0.0.1:9004","from_start":7894}}
target = phd_framework::serial
|
| 358 | 2026-09-30T02:46:05.333Z | INFO | phd-runner: [MIGRATE_FROM - EVENT] Migration completed successfully
file = phd-tests/framework/src/test_vm/mod.rs
line = 676
path = phd_tests::migrate::from_base::migration_from_base_and_back
source = migration_from_base_and_back_lifecycle_0
source_id = 3bbb8dc6-1826-42bb-bed3-c0ee418ac151
target = phd_framework::test_vm
target_id = 28fa9835-29fb-43b2-8fa9-c1f2065b1bf7
|
| 359 | 2026-09-30T02:46:05.333Z | INFO | phd-runner: [MIGRATE - END]
elapsed_milliseconds = 4220
file = phd-tests/framework/src/test_vm/mod.rs
line = 663
migration_id = fea9bfa1-5be3-4193-b7cb-fe93ce5f419a
path = phd_tests::migrate::from_base::migration_from_base_and_back
source = migration_from_base_and_back_lifecycle_0
source_id = 3bbb8dc6-1826-42bb-bed3-c0ee418ac151
target = phd_framework::test_vm
target_id = 28fa9835-29fb-43b2-8fa9-c1f2065b1bf7
|
| 360 | 2026-09-30T02:46:05.336Z | INFO | phd-runner: [VM CLEANUP - START]
file = phd-tests/framework/src/test_vm/mod.rs
line = 1172
path = phd_tests::migrate::from_base::migration_from_base_and_back
target = phd_framework::test_vm
vm = migration_from_base_and_back_lifecycle_0
vm_id = 3bbb8dc6-1826-42bb-bed3-c0ee418ac151
|
| 361 | 2026-09-30T02:46:05.336Z | INFO | phd-runner: [WAIT_FOR_SERIAL_OUTPUT - START]
file = phd-tests/framework/src/test_vm/mod.rs
line = 913
path = phd_tests::migrate::from_base::migration_from_base_and_back
target = phd_framework::test_vm
vm = migration_from_base_and_back_lifecycle_1
vm_id = 28fa9835-29fb-43b2-8fa9-c1f2065b1bf7
|
| 362 | 2026-09-30T02:46:05.336Z | INFO | phd-runner: [WAIT_FOR_SERIAL_OUTPUT - EVENT] Waiting for output on serial console
file = phd-tests/framework/src/test_vm/mod.rs
line = 920
path = phd_tests::migrate::from_base::migration_from_base_and_back
target = phd_framework::test_vm
timeout_duration = Explicit(15s)
vm = migration_from_base_and_back_lifecycle_1
vm_id = 28fa9835-29fb-43b2-8fa9-c1f2065b1bf7
|
| 363 | 2026-09-30T02:46:05.337Z | DEBG | phd-runner: [VM CLEANUP - EVENT] Killing Propolis server process
file = phd-tests/framework/src/test_vm/server.rs
line = 177
path = phd_tests::migrate::from_base::migration_from_base_and_back
self.address = 127.0.0.1:9002
target = phd_framework::test_vm::server
vm = migration_from_base_and_back_lifecycle_0
vm_id = 3bbb8dc6-1826-42bb-bed3-c0ee418ac151
|
| 364 | 2026-09-30T02:46:05.423Z | INFO | phd-runner: [VM CLEANUP - END]
elapsed_milliseconds = 87
file = phd-tests/framework/src/test_vm/mod.rs
line = 1172
path = phd_tests::migrate::from_base::migration_from_base_and_back
target = phd_framework::test_vm
vm = migration_from_base_and_back_lifecycle_0
vm_id = 3bbb8dc6-1826-42bb-bed3-c0ee418ac151
|
| 365 | 2026-09-30T02:46:05.423Z | INFO | phd-runner: [INSTANCE_ENSURE_INTERNAL - END]
elapsed_milliseconds = 11051
file = phd-tests/framework/src/test_vm/mod.rs
line = 412
path = phd_tests::migrate::from_base::migration_from_base_and_back
source = migration_from_base_and_back
source_id = 9582478d-d984-4a1d-96bb-5c7fef877bc4
target = phd_framework::test_vm
target_id = 3bbb8dc6-1826-42bb-bed3-c0ee418ac151
vm = migration_from_base_and_back_lifecycle_0
vm_id = 3bbb8dc6-1826-42bb-bed3-c0ee418ac151
|
| 366 | 2026-09-30T02:46:05.424Z | INFO | phd-runner: [MIGRATE_FROM - END]
elapsed_milliseconds = 11051
file = phd-tests/framework/src/test_vm/mod.rs
line = 609
path = phd_tests::migrate::from_base::migration_from_base_and_back
source = migration_from_base_and_back
source_id = 9582478d-d984-4a1d-96bb-5c7fef877bc4
target = phd_framework::test_vm
target_id = 3bbb8dc6-1826-42bb-bed3-c0ee418ac151
|
| 367 | 2026-09-30T02:46:05.424Z | INFO | phd-runner: [WAIT_FOR_SERIAL_OUTPUT - END]
elapsed_milliseconds = 87
file = phd-tests/framework/src/test_vm/mod.rs
line = 913
path = phd_tests::migrate::from_base::migration_from_base_and_back
target = phd_framework::test_vm
vm = migration_from_base_and_back_lifecycle_1
vm_id = 28fa9835-29fb-43b2-8fa9-c1f2065b1bf7
|
| 368 | 2026-09-30T02:46:05.424Z | INFO | phd-runner: [WAIT_FOR_SERIAL_OUTPUT - START]
file = phd-tests/framework/src/test_vm/mod.rs
line = 913
path = phd_tests::migrate::from_base::migration_from_base_and_back
target = phd_framework::test_vm
vm = migration_from_base_and_back_lifecycle_1
vm_id = 28fa9835-29fb-43b2-8fa9-c1f2065b1bf7
|
| 369 | 2026-09-30T02:46:05.424Z | INFO | phd-runner: [WAIT_FOR_SERIAL_OUTPUT - EVENT] Waiting for output on serial console
file = phd-tests/framework/src/test_vm/mod.rs
line = 920
path = phd_tests::migrate::from_base::migration_from_base_and_back
target = phd_framework::test_vm
timeout_duration = Explicit(300s)
vm = migration_from_base_and_back_lifecycle_1
vm_id = 28fa9835-29fb-43b2-8fa9-c1f2065b1bf7
|
| 370 | 2026-09-30T02:46:05.458Z | INFO | phd-runner: [WAIT_FOR_SERIAL_OUTPUT - END]
elapsed_milliseconds = 33
file = phd-tests/framework/src/test_vm/mod.rs
line = 913
path = phd_tests::migrate::from_base::migration_from_base_and_back
target = phd_framework::test_vm
vm = migration_from_base_and_back_lifecycle_1
vm_id = 28fa9835-29fb-43b2-8fa9-c1f2065b1bf7
|
| 371 | 2026-09-30T02:46:05.458Z | INFO | phd-runner: [TEST - EVENT] migrating to new Propolis artifact for lifecycle test
file = phd-tests/framework/src/lifecycle.rs
line = 73
path = phd_tests::migrate::from_base::migration_from_base_and_back
propolis_artifact = __DEFAULT_PROPOLIS
target = phd_framework::lifecycle
vm_name = migration_from_base_and_back
|
| 372 | 2026-09-30T02:46:05.459Z | INFO | phd-runner: [NEW - START]
file = phd-tests/framework/src/test_vm/mod.rs
line = 300
path = phd_tests::migrate::from_base::migration_from_base_and_back
target = phd_framework::test_vm
|
| 373 | 2026-09-30T02:46:05.459Z | INFO | phd-runner: [NEW - EVENT] phd_framework::test_vm
environment = EnvironmentSpec { location: Local, propolis_artifact: "__DEFAULT_PROPOLIS", metrics: None }
file = phd-tests/framework/src/test_vm/mod.rs
guest_os_kind = Alpine
line = 318
path = phd_tests::migrate::from_base::migration_from_base_and_back
target = phd_framework::test_vm
vm_name = migration_from_base_and_back_lifecycle_2
|
| 374 | 2026-09-30T02:46:05.459Z | DEBG | phd-runner: [NEW - EVENT] Verified artifact already exists
file = phd-tests/framework/src/artifacts/store.rs
line = 45
path = /work/phd-test/propolis-server
target = phd_framework::artifacts::store
|
| 375 | 2026-09-30T02:46:05.459Z | INFO | phd-runner: [NEW - EVENT] Launching Propolis server
bootrom_path = "/phd-artifacts/740187046a7267d0de72d3455070333547dbc0ea023531471fb2b2a61effa448/OVMF_CODE.fd"
file = phd-tests/framework/src/test_vm/server.rs
line = 66
path = phd_tests::migrate::from_base::migration_from_base_and_back
server_addr = 127.0.0.1:9006
server_path = "/work/phd-test/propolis-server"
target = phd_framework::test_vm::server
|
| 376 | 2026-09-30T02:46:05.459Z | INFO | phd-runner: [NEW - EVENT] Opening server log files
file = phd-tests/framework/src/log_config.rs
line = 84
path = phd_tests::migrate::from_base::migration_from_base_and_back
stderr_path = "/tmp/propolis-phd/phd_tests::migrate::from_base::migration_from_base_and_back/migration_from_base_and_back_lifecycle_2.stderr.log"
stdout_path = "/tmp/propolis-phd/phd_tests::migrate::from_base::migration_from_base_and_back/migration_from_base_and_back_lifecycle_2.stdout.log"
target = phd_framework::log_config
|
| 377 | 2026-09-30T02:46:05.499Z | INFO | phd-runner: [NEW - EVENT] Launched server with pid 942
file = phd-tests/framework/src/test_vm/server.rs
line = 127
path = phd_tests::migrate::from_base::migration_from_base_and_back
target = phd_framework::test_vm::server
|
| 378 | 2026-09-30T02:46:05.511Z | INFO | phd-runner: [NEW - END]
elapsed_milliseconds = 52
file = phd-tests/framework/src/test_vm/mod.rs
line = 300
path = phd_tests::migrate::from_base::migration_from_base_and_back
target = phd_framework::test_vm
|
| 379 | 2026-09-30T02:46:05.511Z | INFO | phd-runner: [MIGRATE_FROM - START]
file = phd-tests/framework/src/test_vm/mod.rs
line = 609
path = phd_tests::migrate::from_base::migration_from_base_and_back
source = migration_from_base_and_back_lifecycle_1
source_id = 28fa9835-29fb-43b2-8fa9-c1f2065b1bf7
target = phd_framework::test_vm
target_id = e8e55195-aede-4c0d-af5d-e935a6b141e9
|
| 380 | 2026-09-30T02:46:05.511Z | INFO | phd-runner: [MIGRATE_FROM - EVENT] Migrating from source at address 127.0.0.1:9004
file = phd-tests/framework/src/test_vm/mod.rs
line = 642
migration_id = 96915dc8-fcc1-418f-a0c3-62183684fe3c
path = phd_tests::migrate::from_base::migration_from_base_and_back
source = migration_from_base_and_back_lifecycle_1
source_id = 28fa9835-29fb-43b2-8fa9-c1f2065b1bf7
target = phd_framework::test_vm
target_id = e8e55195-aede-4c0d-af5d-e935a6b141e9
timeout_duration = 45s
|
| 381 | 2026-09-30T02:46:05.511Z | INFO | phd-runner: [INSTANCE_ENSURE_INTERNAL - START]
file = phd-tests/framework/src/test_vm/mod.rs
line = 412
path = phd_tests::migrate::from_base::migration_from_base_and_back
source = migration_from_base_and_back_lifecycle_1
source_id = 28fa9835-29fb-43b2-8fa9-c1f2065b1bf7
target = phd_framework::test_vm
target_id = e8e55195-aede-4c0d-af5d-e935a6b141e9
vm = migration_from_base_and_back_lifecycle_2
vm_id = e8e55195-aede-4c0d-af5d-e935a6b141e9
|
| 382 | 2026-09-30T02:46:05.512Z | INFO | phd-runner: [INSTANCE_ENSURE_INTERNAL - EVENT] retriable error from instance_spec_ensure
e = Communication Error: error sending request for url (http://127.0.0.1:9006/instance)
file = phd-tests/framework/src/test_vm/mod.rs
line = 455
path = phd_tests::migrate::from_base::migration_from_base_and_back
source = migration_from_base_and_back_lifecycle_1
source_id = 28fa9835-29fb-43b2-8fa9-c1f2065b1bf7
target = phd_framework::test_vm
target_id = e8e55195-aede-4c0d-af5d-e935a6b141e9
vm = migration_from_base_and_back_lifecycle_2
vm_id = e8e55195-aede-4c0d-af5d-e935a6b141e9
|
| 383 | 2026-09-30T02:46:06.080Z | INFO | phd-runner: [INSTANCE_ENSURE_INTERNAL - EVENT] Started instance
file = phd-tests/framework/src/test_vm/mod.rs
instance_description.instance = Instance { properties: InstanceProperties { id: e8e55195-aede-4c0d-af5d-e935a6b141e9, name: "phd-vm-e8e55195-aede-4c0d-af5d-e935a6b141e9", description: "Pheidippides-managed VM", metadata: InstanceMetadata { silo_id: 87329f99-9f2f-4a1c-a24e-0b98d494e4cc, project_id: 2d110cdc-4bd7-43e4-919c-db6fb72c445b, sled_id: e6fd302f-e182-4fe8-a386-d24a8119d04a, sled_serial: "e6fd302f-e182-4fe8-a386-d24a8119d04a", sled_revision: 1, sled_model: "pheidippes" } }, state: Migrating }
line = 514
path = phd_tests::migrate::from_base::migration_from_base_and_back
source = migration_from_base_and_back_lifecycle_1
source_id = 28fa9835-29fb-43b2-8fa9-c1f2065b1bf7
target = phd_framework::test_vm
target_id = e8e55195-aede-4c0d-af5d-e935a6b141e9
vm = migration_from_base_and_back_lifecycle_2
vm_id = e8e55195-aede-4c0d-af5d-e935a6b141e9
|
| 384 | 2026-09-30T02:46:06.080Z | INFO | phd-runner: [MIGRATE - START]
file = phd-tests/framework/src/test_vm/mod.rs
line = 663
migration_id = 96915dc8-fcc1-418f-a0c3-62183684fe3c
path = phd_tests::migrate::from_base::migration_from_base_and_back
source = migration_from_base_and_back_lifecycle_1
source_id = 28fa9835-29fb-43b2-8fa9-c1f2065b1bf7
target = phd_framework::test_vm
target_id = e8e55195-aede-4c0d-af5d-e935a6b141e9
|
| 385 | 2026-09-30T02:46:08.615Z | INFO | phd-runner: [SERIAL CONSOLE TASK - EVENT] serial socket control message
file = phd-tests/framework/src/serial/mod.rs
line = 275
s = {"Migrating":{"destination":"127.0.0.1:9006","from_start":7941}}
target = phd_framework::serial
|
| 386 | 2026-09-30T02:46:09.133Z | INFO | phd-runner: [MIGRATE_FROM - EVENT] Migration completed successfully
file = phd-tests/framework/src/test_vm/mod.rs
line = 676
path = phd_tests::migrate::from_base::migration_from_base_and_back
source = migration_from_base_and_back_lifecycle_1
source_id = 28fa9835-29fb-43b2-8fa9-c1f2065b1bf7
target = phd_framework::test_vm
target_id = e8e55195-aede-4c0d-af5d-e935a6b141e9
|
| 387 | 2026-09-30T02:46:09.134Z | INFO | phd-runner: [MIGRATE - END]
elapsed_milliseconds = 3053
file = phd-tests/framework/src/test_vm/mod.rs
line = 663
migration_id = 96915dc8-fcc1-418f-a0c3-62183684fe3c
path = phd_tests::migrate::from_base::migration_from_base_and_back
source = migration_from_base_and_back_lifecycle_1
source_id = 28fa9835-29fb-43b2-8fa9-c1f2065b1bf7
target = phd_framework::test_vm
target_id = e8e55195-aede-4c0d-af5d-e935a6b141e9
|
| 388 | 2026-09-30T02:46:09.136Z | INFO | phd-runner: [VM CLEANUP - START]
file = phd-tests/framework/src/test_vm/mod.rs
line = 1172
path = phd_tests::migrate::from_base::migration_from_base_and_back
target = phd_framework::test_vm
vm = migration_from_base_and_back_lifecycle_1
vm_id = 28fa9835-29fb-43b2-8fa9-c1f2065b1bf7
|
| 389 | 2026-09-30T02:46:09.136Z | INFO | phd-runner: [WAIT_FOR_SERIAL_OUTPUT - START]
file = phd-tests/framework/src/test_vm/mod.rs
line = 913
path = phd_tests::migrate::from_base::migration_from_base_and_back
target = phd_framework::test_vm
vm = migration_from_base_and_back_lifecycle_2
vm_id = e8e55195-aede-4c0d-af5d-e935a6b141e9
|
| 390 | 2026-09-30T02:46:09.136Z | INFO | phd-runner: [WAIT_FOR_SERIAL_OUTPUT - EVENT] Waiting for output on serial console
file = phd-tests/framework/src/test_vm/mod.rs
line = 920
path = phd_tests::migrate::from_base::migration_from_base_and_back
target = phd_framework::test_vm
timeout_duration = Explicit(15s)
vm = migration_from_base_and_back_lifecycle_2
vm_id = e8e55195-aede-4c0d-af5d-e935a6b141e9
|
| 391 | 2026-09-30T02:46:09.138Z | DEBG | phd-runner: [VM CLEANUP - EVENT] Killing Propolis server process
file = phd-tests/framework/src/test_vm/server.rs
line = 177
path = phd_tests::migrate::from_base::migration_from_base_and_back
self.address = 127.0.0.1:9004
target = phd_framework::test_vm::server
vm = migration_from_base_and_back_lifecycle_1
vm_id = 28fa9835-29fb-43b2-8fa9-c1f2065b1bf7
|
| 392 | 2026-09-30T02:46:09.218Z | INFO | phd-runner: [VM CLEANUP - END]
elapsed_milliseconds = 81
file = phd-tests/framework/src/test_vm/mod.rs
line = 1172
path = phd_tests::migrate::from_base::migration_from_base_and_back
target = phd_framework::test_vm
vm = migration_from_base_and_back_lifecycle_1
vm_id = 28fa9835-29fb-43b2-8fa9-c1f2065b1bf7
|
| 393 | 2026-09-30T02:46:09.218Z | INFO | phd-runner: [INSTANCE_ENSURE_INTERNAL - END]
elapsed_milliseconds = 8785
file = phd-tests/framework/src/test_vm/mod.rs
line = 412
path = phd_tests::migrate::from_base::migration_from_base_and_back
source = migration_from_base_and_back_lifecycle_0
source_id = 3bbb8dc6-1826-42bb-bed3-c0ee418ac151
target = phd_framework::test_vm
target_id = 28fa9835-29fb-43b2-8fa9-c1f2065b1bf7
vm = migration_from_base_and_back_lifecycle_1
vm_id = 28fa9835-29fb-43b2-8fa9-c1f2065b1bf7
|
| 394 | 2026-09-30T02:46:09.218Z | INFO | phd-runner: [MIGRATE_FROM - END]
elapsed_milliseconds = 8785
file = phd-tests/framework/src/test_vm/mod.rs
line = 609
path = phd_tests::migrate::from_base::migration_from_base_and_back
source = migration_from_base_and_back_lifecycle_0
source_id = 3bbb8dc6-1826-42bb-bed3-c0ee418ac151
target = phd_framework::test_vm
target_id = 28fa9835-29fb-43b2-8fa9-c1f2065b1bf7
|
| 395 | 2026-09-30T02:46:09.218Z | INFO | phd-runner: [WAIT_FOR_SERIAL_OUTPUT - END]
elapsed_milliseconds = 82
file = phd-tests/framework/src/test_vm/mod.rs
line = 913
path = phd_tests::migrate::from_base::migration_from_base_and_back
target = phd_framework::test_vm
vm = migration_from_base_and_back_lifecycle_2
vm_id = e8e55195-aede-4c0d-af5d-e935a6b141e9
|
| 396 | 2026-09-30T02:46:09.219Z | INFO | phd-runner: [WAIT_FOR_SERIAL_OUTPUT - START]
file = phd-tests/framework/src/test_vm/mod.rs
line = 913
path = phd_tests::migrate::from_base::migration_from_base_and_back
target = phd_framework::test_vm
vm = migration_from_base_and_back_lifecycle_2
vm_id = e8e55195-aede-4c0d-af5d-e935a6b141e9
|
| 397 | 2026-09-30T02:46:09.219Z | INFO | phd-runner: [WAIT_FOR_SERIAL_OUTPUT - EVENT] Waiting for output on serial console
file = phd-tests/framework/src/test_vm/mod.rs
line = 920
path = phd_tests::migrate::from_base::migration_from_base_and_back
target = phd_framework::test_vm
timeout_duration = Explicit(300s)
vm = migration_from_base_and_back_lifecycle_2
vm_id = e8e55195-aede-4c0d-af5d-e935a6b141e9
|
| 398 | 2026-09-30T02:46:09.247Z | INFO | phd-runner: [WAIT_FOR_SERIAL_OUTPUT - END]
elapsed_milliseconds = 28
file = phd-tests/framework/src/test_vm/mod.rs
line = 913
path = phd_tests::migrate::from_base::migration_from_base_and_back
target = phd_framework::test_vm
vm = migration_from_base_and_back_lifecycle_2
vm_id = e8e55195-aede-4c0d-af5d-e935a6b141e9
|
| 399 | 2026-09-30T02:46:09.247Z | INFO | phd-runner: [VM CLEANUP - START]
file = phd-tests/framework/src/test_vm/mod.rs
line = 1172
path = phd_tests::migrate::from_base::migration_from_base_and_back
target = phd_framework::test_vm
vm = migration_from_base_and_back_lifecycle_2
vm_id = e8e55195-aede-4c0d-af5d-e935a6b141e9
|
| 400 | 2026-09-30T02:46:09.247Z | DEBG | phd-runner: [SERIAL CONSOLE TASK - EVENT] serial console command channel was closed
file = phd-tests/framework/src/serial/mod.rs
line = 213
target = phd_framework::serial
|
| 401 | 2026-09-30T02:46:09.247Z | INFO | phd-runner: [SERIAL CONSOLE TASK - END]
elapsed_milliseconds = 19842
file = phd-tests/framework/src/serial/mod.rs
line = 200
target = phd_framework::serial
|
| 402 | 2026-09-30T02:46:09.248Z | INFO | phd-runner: test phd_tests::migrate::from_base::migration_from_base_and_back ... ok
file = phd-tests/runner/src/execute.rs
line = 141
target = phd_runner::execute
|
| 403 | 2026-09-30T02:46:09.248Z | INFO | phd-runner: [TEST_CLEANUP - START]
file = phd-tests/runner/src/fixtures.rs
line = 51
target = phd_runner::fixtures
|
| 404 | 2026-09-30T02:46:09.249Z | DEBG | phd-runner: [VM CLEANUP - EVENT] trying to ensure Propolis server VM is destroyed
file = phd-tests/framework/src/test_vm/mod.rs
line = 1195
path = phd_tests::migrate::from_base::migration_from_base_and_back
target = phd_framework::test_vm
vm = migration_from_base_and_back_lifecycle_2
vm_id = e8e55195-aede-4c0d-af5d-e935a6b141e9
|
| 405 | 2026-09-30T02:46:10.003Z | DEBG | phd-runner: [VM CLEANUP - EVENT] Killing Propolis server process
file = phd-tests/framework/src/test_vm/server.rs
line = 177
path = phd_tests::migrate::from_base::migration_from_base_and_back
self.address = 127.0.0.1:9006
target = phd_framework::test_vm::server
vm = migration_from_base_and_back_lifecycle_2
vm_id = e8e55195-aede-4c0d-af5d-e935a6b141e9
|
| 406 | 2026-09-30T02:46:10.097Z | DEBG | phd-runner: [VM CLEANUP - EVENT] zfs clone dropped
file = phd-tests/framework/src/zfs.rs
line = 83
path = phd_tests::migrate::from_base::migration_from_base_and_back
target = phd_framework::zfs
vm = migration_from_base_and_back_lifecycle_2
vm_id = e8e55195-aede-4c0d-af5d-e935a6b141e9
|
| 407 | 2026-09-30T02:46:10.097Z | DEBG | phd-runner: [VM CLEANUP - EVENT] executing ZFS command
args = ["phd-artifacts/phd-clone-da6a707d-31f0-4485-bf45-58d2c9c90a22"]
file = phd-tests/framework/src/zfs.rs
line = 304
path = phd_tests::migrate::from_base::migration_from_base_and_back
target = phd_framework::zfs
verb = destroy
vm = migration_from_base_and_back_lifecycle_2
vm_id = e8e55195-aede-4c0d-af5d-e935a6b141e9
|
| 408 | 2026-09-30T02:46:10.125Z | DEBG | phd-runner: [VM CLEANUP - EVENT] zfs snapshot dropped
file = phd-tests/framework/src/zfs.rs
line = 57
path = phd_tests::migrate::from_base::migration_from_base_and_back
target = phd_framework::zfs
vm = migration_from_base_and_back_lifecycle_2
vm_id = e8e55195-aede-4c0d-af5d-e935a6b141e9
|
| 409 | 2026-09-30T02:46:10.125Z | DEBG | phd-runner: [VM CLEANUP - EVENT] executing ZFS command
args = ["phd-artifacts@phd-559112da-8b82-4ff9-b749-3819b3dfada8"]
file = phd-tests/framework/src/zfs.rs
line = 304
path = phd_tests::migrate::from_base::migration_from_base_and_back
target = phd_framework::zfs
verb = destroy
vm = migration_from_base_and_back_lifecycle_2
vm_id = e8e55195-aede-4c0d-af5d-e935a6b141e9
|
| 410 | 2026-09-30T02:46:10.142Z | INFO | phd-runner: [VM CLEANUP - END]
elapsed_milliseconds = 894
file = phd-tests/framework/src/test_vm/mod.rs
line = 1172
path = phd_tests::migrate::from_base::migration_from_base_and_back
target = phd_framework::test_vm
vm = migration_from_base_and_back_lifecycle_2
vm_id = e8e55195-aede-4c0d-af5d-e935a6b141e9
|
| 411 | 2026-09-30T02:46:10.142Z | INFO | phd-runner: [INSTANCE_ENSURE_INTERNAL - END]
elapsed_milliseconds = 4629
file = phd-tests/framework/src/test_vm/mod.rs
line = 412
path = phd_tests::migrate::from_base::migration_from_base_and_back
source = migration_from_base_and_back_lifecycle_1
source_id = 28fa9835-29fb-43b2-8fa9-c1f2065b1bf7
target = phd_framework::test_vm
target_id = e8e55195-aede-4c0d-af5d-e935a6b141e9
vm = migration_from_base_and_back_lifecycle_2
vm_id = e8e55195-aede-4c0d-af5d-e935a6b141e9
|
| 412 | 2026-09-30T02:46:10.142Z | INFO | phd-runner: [MIGRATE_FROM - END]
elapsed_milliseconds = 4630
file = phd-tests/framework/src/test_vm/mod.rs
line = 609
path = phd_tests::migrate::from_base::migration_from_base_and_back
source = migration_from_base_and_back_lifecycle_1
source_id = 28fa9835-29fb-43b2-8fa9-c1f2065b1bf7
target = phd_framework::test_vm
target_id = e8e55195-aede-4c0d-af5d-e935a6b141e9
|
| 413 | 2026-09-30T02:46:10.142Z | INFO | phd-runner: [TEST_CLEANUP - END]
elapsed_milliseconds = 893
file = phd-tests/runner/src/fixtures.rs
line = 51
target = phd_runner::fixtures
|
| 414 | 2026-09-30T02:46:10.142Z | INFO | phd-runner: [TEST - END]
elapsed_milliseconds = 21662
file = phd-tests/tests/src/migrate.rs
line = 52
path = phd_tests::migrate::from_base::migration_from_base_and_back
target = phd_tests::migrate::from_base
|
| 415 | 2026-09-30T02:46:10.142Z | INFO | phd-runner: [EXECUTION_CLEANUP - START]
file = phd-tests/runner/src/fixtures.rs
line = 35
target = phd_runner::fixtures
|
| 416 | 2026-09-30T02:46:10.142Z | INFO | phd-runner: [EXECUTION_CLEANUP - END]
elapsed_milliseconds = 0
file = phd-tests/runner/src/fixtures.rs
line = 35
target = phd_runner::fixtures
|
| 417 | | test result: ok. 3 passed; 0 failed; 0 skipped; 0 not run; finished in 93.77s |
| 418 | | |
| 419 | 2026-09-30T02:46:10.145Z | DEBG | phd-runner: phd_runner
exit_code = 0
file = phd-tests/runner/src/main.rs
line = 41
target = phd_runner
|