| 1 | 2026-10-02T23:36:18.937Z | INFO | phd-runner: phd_runner
file = phd-tests/runner/src/main.rs
line = 36
runner_args = ProcessArgs { command: Run(RunOptions { propolis_server_cmd: "/work/phd-test/propolis-server", base_propolis_branch: Some("master"), base_propolis_commit: None, base_propolis_cmd: None, crucible_downstairs_cmd: None, crucible_downstairs_commit: Some(Auto), tmp_directory: "/tmp/propolis-phd", artifact_directory: Some("/phd-artifacts"), output_mode: TmpFile, default_guest_cpus: 2, default_guest_memory_mib: 512, artifact_toml_path: "/work/phd-test/artifacts.toml", default_guest_artifact: "alpine", default_bootrom_artifact: "ovmf", include_filter: ["phd_tests::migrate::from_base"], exclude_filter: [], max_buildomat_wait_secs: 1200, manual_stop_on_failure: false }), disable_ansi: false, emit_bunyan: true }
target = phd_runner
|
| 2 | 2026-10-02T23:36:18.965Z | DEBG | phd-runner: Created new artifact store from manifest
file = phd-tests/framework/src/artifacts/store.rs
line = 219
store = Store { local_dir: "/phd-artifacts", artifacts: {"alpine": Mutex { data: StoredArtifact { description: Artifact { filename: "alpine.iso", kind: GuestOs(Alpine), source: RemoteServer { sha256: "ba8007f74f9b54fbae3b2520da577831b4834778a498d732f091260c61aa7ca1" }, untar: None }, cached_path: None } }, "ovmf": Mutex { data: StoredArtifact { description: Artifact { filename: "OVMF_CODE.fd", kind: Bootrom, source: Buildomat(BuildomatArtifact { repo: Repo("oxidecomputer/edk2"), series: Series("image_debug"), commit: Commit("bf64f45b1a58e69d126a3c6ca1e4512c88668132"), sha256: "740187046a7267d0de72d3455070333547dbc0ea023531471fb2b2a61effa448" }), untar: None }, cached_path: None } }}, downloader: DownloadConfig { timeout: 600s, buildomat_backoff: ExponentialBackoff { current_interval: 1s, initial_interval: 1s, randomization_factor: 0.5, multiplier: 1.5, max_interval: 60s, start_time: Instant { tv_sec: 254, tv_nsec: 442431621 }, max_elapsed_time: Some(1200s), clock: SystemClock }, remote_server_uris: ["https://oxide-omicron-build.s3.amazonaws.com"] } }
target = phd_framework::artifacts::store
|
| 3 | 2026-10-02T23:36:18.965Z | INFO | phd-runner: Adding Propolis server from local command
file = phd-tests/framework/src/artifacts/store.rs
line = 227
propolis_server_cmd = /work/phd-test/propolis-server
target = phd_framework::artifacts::store
|
| 4 | 2026-10-02T23:36:18.966Z | INFO | phd-runner: Adding crucible-downstairs from Buildomat Git revision
commit = ad8a31742adc45e925e63443a5b43c8e30604022
file = phd-tests/framework/src/artifacts/store.rs
line = 311
target = phd_framework::artifacts::store
|
| 5 | 2026-10-02T23:36:18.972Z | DEBG | phd-runner: Downloading file from Buildomat...
file = phd-tests/framework/src/artifacts/buildomat.rs
line = 215
target = phd_framework::artifacts::buildomat
timeout = 600s
uri = https://buildomat.eng.oxide.computer/public/file/oxidecomputer/crucible/nightly-image/ad8a31742adc45e925e63443a5b43c8e30604022/crucible-nightly.sha256.txt
|
| 6 | 2026-10-02T23:36:27.469Z | INFO | phd-runner: Adding 'current' Propolis server from Buildomat Git branch 'master'
file = phd-tests/framework/src/artifacts/store.rs
line = 248
target = phd_framework::artifacts::store
|
| 7 | 2026-10-02T23:36:28.233Z | DEBG | phd-runner: Downloading file from Buildomat...
file = phd-tests/framework/src/artifacts/buildomat.rs
line = 215
target = phd_framework::artifacts::buildomat
timeout = 600s
uri = https://buildomat.eng.oxide.computer/public/file/oxidecomputer/propolis/phd_build/1caf33fefedaee70e1934ff4af82ecc212fc4f39/propolis-server.sha256.txt
|
| 8 | 2026-10-02T23:36:28.395Z | INFO | phd-runner: [EXECUTION_SETUP - START]
file = phd-tests/runner/src/fixtures.rs
line = 25
target = phd_runner::fixtures
|
| 9 | 2026-10-02T23:36:28.396Z | INFO | phd-runner: [EXECUTION_SETUP - END]
elapsed_milliseconds = 0
file = phd-tests/runner/src/fixtures.rs
line = 25
target = phd_runner::fixtures
|
| 10 | 2026-10-02T23:36:28.398Z | INFO | phd-runner: Running 3 test(s)
file = phd-tests/runner/src/execute.rs
line = 83
target = phd_runner::execute
|
| 11 | 2026-10-02T23:36:28.398Z | INFO | phd-runner: Starting test phd_tests::migrate::from_base::serial_history
file = phd-tests/runner/src/execute.rs
line = 91
target = phd_runner::execute
|
| 12 | 2026-10-02T23:36:28.399Z | INFO | phd-runner: [TEST_SETUP - START]
file = phd-tests/runner/src/fixtures.rs
line = 41
target = phd_runner::fixtures
|
| 13 | 2026-10-02T23:36:28.399Z | INFO | phd-runner: [TEST_SETUP - END]
elapsed_milliseconds = 0
file = phd-tests/runner/src/fixtures.rs
line = 41
target = phd_runner::fixtures
|
| 14 | 2026-10-02T23:36:28.400Z | INFO | phd-runner: [TEST - START]
file = phd-tests/tests/src/migrate.rs
line = 40
path = phd_tests::migrate::from_base::serial_history
target = phd_tests::migrate::from_base
|
| 15 | 2026-10-02T23:36:28.401Z | DEBG | phd-runner: [TEST - EVENT] checking for existing copy of artifact
file = phd-tests/framework/src/artifacts/store.rs
line = 89
maybe_path = /phd-artifacts/740187046a7267d0de72d3455070333547dbc0ea023531471fb2b2a61effa448/OVMF_CODE.fd
path = phd_tests::migrate::from_base::serial_history
target = phd_framework::artifacts::store
|
| 16 | 2026-10-02T23:36:28.403Z | DEBG | phd-runner: [TEST - EVENT] Downloading file from Buildomat...
file = phd-tests/framework/src/artifacts/buildomat.rs
line = 215
path = phd_tests::migrate::from_base::serial_history
target = phd_framework::artifacts::buildomat
timeout = 600s
uri = https://buildomat.eng.oxide.computer/public/file/oxidecomputer/edk2/image_debug/bf64f45b1a58e69d126a3c6ca1e4512c88668132/OVMF_CODE.fd
|
| 17 | 2026-10-02T23:36:28.880Z | DEBG | phd-runner: [TEST - EVENT] checking for existing copy of artifact
file = phd-tests/framework/src/artifacts/store.rs
line = 89
maybe_path = /phd-artifacts/ba8007f74f9b54fbae3b2520da577831b4834778a498d732f091260c61aa7ca1/alpine.iso
path = phd_tests::migrate::from_base::serial_history
target = phd_framework::artifacts::store
|
| 18 | 2026-10-02T23:36:28.893Z | DEBG | phd-runner: [TEST - EVENT] Downloading alpine.iso from https://oxide-omicron-build.s3.amazonaws.com/alpine.iso
file = phd-tests/framework/src/artifacts/store.rs
line = 614
path = phd_tests::migrate::from_base::serial_history
target = phd_framework::artifacts::store
timeout = 600s
|
| 19 | 2026-10-02T23:36:35.981Z | DEBG | phd-runner: [TEST - EVENT] Verified artifact already exists
file = phd-tests/framework/src/artifacts/store.rs
line = 45
path = /phd-artifacts/ba8007f74f9b54fbae3b2520da577831b4834778a498d732f091260c61aa7ca1/alpine.iso
target = phd_framework::artifacts::store
|
| 20 | 2026-10-02T23:36:35.982Z | DEBG | phd-runner: [TEST - EVENT] executing ZFS command
args = ["/phd-artifacts/ba8007f74f9b54fbae3b2520da577831b4834778a498d732f091260c61aa7ca1/alpine.iso"]
file = phd-tests/framework/src/zfs.rs
line = 304
path = phd_tests::migrate::from_base::serial_history
target = phd_framework::zfs
verb = list
|
| 21 | 2026-10-02T23:36:35.997Z | DEBG | phd-runner: [TEST - EVENT] parsing zfs list output
file = phd-tests/framework/src/zfs.rs
line = 238
path = phd_tests::migrate::from_base::serial_history
stdout = NAME USED AVAIL REFER MOUNTPOINT\nphd-artifacts 4.21M 25.3T 2M /phd-artifacts\n
target = phd_framework::zfs
|
| 22 | 2026-10-02T23:36:35.999Z | DEBG | phd-runner: [TEST - EVENT] executing ZFS command
args = ["phd-artifacts@phd-5d368db8-5727-4564-a16d-d6edf1b51e51"]
file = phd-tests/framework/src/zfs.rs
line = 304
path = phd_tests::migrate::from_base::serial_history
target = phd_framework::zfs
verb = snapshot
|
| 23 | 2026-10-02T23:36:36.021Z | DEBG | phd-runner: [TEST - EVENT] executing ZFS command
args = ["phd-artifacts@phd-5d368db8-5727-4564-a16d-d6edf1b51e51", "phd-artifacts/phd-clone-fbcd6e29-67b8-4f85-b926-e494afc0cfce"]
file = phd-tests/framework/src/zfs.rs
line = 304
path = phd_tests::migrate::from_base::serial_history
target = phd_framework::zfs
verb = clone
|
| 24 | 2026-10-02T23:36:36.038Z | DEBG | phd-runner: [TEST - EVENT] executing ZFS command
args = ["phd-artifacts/phd-clone-fbcd6e29-67b8-4f85-b926-e494afc0cfce"]
file = phd-tests/framework/src/zfs.rs
line = 304
path = phd_tests::migrate::from_base::serial_history
target = phd_framework::zfs
verb = list
|
| 25 | 2026-10-02T23:36:36.050Z | DEBG | phd-runner: [TEST - EVENT] parsing zfs list output
file = phd-tests/framework/src/zfs.rs
line = 238
path = phd_tests::migrate::from_base::serial_history
stdout = NAME USED AVAIL REFER MOUNTPOINT\nphd-artifacts/phd-clone-fbcd6e29-67b8-4f85-b926-e494afc0cfce 0B 25.3T 49.0M /phd-artifacts/phd-clone-fbcd6e29-67b8-4f85-b926-e494afc0cfce\n
target = phd_framework::zfs
|
| 26 | 2026-10-02T23:36:36.054Z | INFO | phd-runner: [NEW - START]
file = phd-tests/framework/src/test_vm/mod.rs
line = 300
path = phd_tests::migrate::from_base::serial_history
target = phd_framework::test_vm
|
| 27 | 2026-10-02T23:36:36.054Z | INFO | phd-runner: [NEW - EVENT] phd_framework::test_vm
environment = EnvironmentSpec { location: Local, propolis_artifact: "__BASE_PROPOLIS", metrics: None }
file = phd-tests/framework/src/test_vm/mod.rs
guest_os_kind = Alpine
line = 318
path = phd_tests::migrate::from_base::serial_history
target = phd_framework::test_vm
vm_name = migration_serial_history_base
|
| 28 | 2026-10-02T23:36:36.054Z | DEBG | phd-runner: [NEW - EVENT] checking for existing copy of artifact
file = phd-tests/framework/src/artifacts/store.rs
line = 89
maybe_path = /phd-artifacts/c39ee71b9b334e87523f19fd9694492a794ad7a287ed999d3aaee7dc836e0a17/propolis-server.tar.gz
path = phd_tests::migrate::from_base::serial_history
target = phd_framework::artifacts::store
|
| 29 | 2026-10-02T23:36:36.055Z | DEBG | phd-runner: [NEW - EVENT] Downloading file from Buildomat...
file = phd-tests/framework/src/artifacts/buildomat.rs
line = 215
path = phd_tests::migrate::from_base::serial_history
target = phd_framework::artifacts::buildomat
timeout = 600s
uri = https://buildomat.eng.oxide.computer/public/file/oxidecomputer/propolis/phd_build/1caf33fefedaee70e1934ff4af82ecc212fc4f39/propolis-server.tar.gz
|
| 30 | 2026-10-02T23:36:51.770Z | DEBG | phd-runner: [NEW - EVENT] Extracting artifact from tarball
extracted_path = /phd-artifacts/c39ee71b9b334e87523f19fd9694492a794ad7a287ed999d3aaee7dc836e0a17/propolis-server
file = phd-tests/framework/src/artifacts/store.rs
line = 160
path = phd_tests::migrate::from_base::serial_history
target = phd_framework::artifacts::store
untar_path = propolis-server
|
| 31 | 2026-10-02T23:36:51.770Z | DEBG | phd-runner: [NEW - EVENT] Extracting gzipped tarball...
file = phd-tests/framework/src/artifacts/store.rs
line = 514
path = phd_tests::migrate::from_base::serial_history
target = phd_framework::artifacts::store
|
| 32 | 2026-10-02T23:37:17.082Z | INFO | phd-runner: [NEW - EVENT] Launching Propolis server
bootrom_path = "/phd-artifacts/740187046a7267d0de72d3455070333547dbc0ea023531471fb2b2a61effa448/OVMF_CODE.fd"
file = phd-tests/framework/src/test_vm/server.rs
line = 66
path = phd_tests::migrate::from_base::serial_history
server_addr = 127.0.0.1:9000
server_path = "/phd-artifacts/c39ee71b9b334e87523f19fd9694492a794ad7a287ed999d3aaee7dc836e0a17/propolis-server"
target = phd_framework::test_vm::server
|
| 33 | 2026-10-02T23:37:17.082Z | INFO | phd-runner: [NEW - EVENT] Opening server log files
file = phd-tests/framework/src/log_config.rs
line = 84
path = phd_tests::migrate::from_base::serial_history
stderr_path = "/tmp/propolis-phd/phd_tests::migrate::from_base::serial_history/migration_serial_history_base.stderr.log"
stdout_path = "/tmp/propolis-phd/phd_tests::migrate::from_base::serial_history/migration_serial_history_base.stdout.log"
target = phd_framework::log_config
|
| 34 | 2026-10-02T23:37:17.240Z | INFO | phd-runner: [NEW - EVENT] Launched server with pid 917
file = phd-tests/framework/src/test_vm/server.rs
line = 127
path = phd_tests::migrate::from_base::serial_history
target = phd_framework::test_vm::server
|
| 35 | 2026-10-02T23:37:17.257Z | INFO | phd-runner: [INSTANCE_ENSURE_INTERNAL - START]
file = phd-tests/framework/src/test_vm/mod.rs
line = 412
path = phd_tests::migrate::from_base::serial_history
target = phd_framework::test_vm
vm = migration_serial_history_base
vm_id = c18790a7-e7da-443f-999c-dff8776497b0
|
| 36 | 2026-10-02T23:37:17.270Z | INFO | phd-runner: [INSTANCE_ENSURE_INTERNAL - EVENT] retriable error from instance_spec_ensure
e = Communication Error: error sending request for url (http://127.0.0.1:9000/instance)
file = phd-tests/framework/src/test_vm/mod.rs
line = 455
path = phd_tests::migrate::from_base::serial_history
target = phd_framework::test_vm
vm = migration_serial_history_base
vm_id = c18790a7-e7da-443f-999c-dff8776497b0
|
| 37 | 2026-10-02T23:37:17.273Z | INFO | phd-runner: [NEW - END]
elapsed_milliseconds = 41218
file = phd-tests/framework/src/test_vm/mod.rs
line = 300
path = phd_tests::migrate::from_base::serial_history
target = phd_framework::test_vm
|
| 38 | 2026-10-02T23:37:17.985Z | INFO | phd-runner: [SERIAL CONSOLE TASK - START]
file = phd-tests/framework/src/serial/mod.rs
line = 200
target = phd_framework::serial
|
| 39 | 2026-10-02T23:37:17.992Z | INFO | phd-runner: [INSTANCE_ENSURE_INTERNAL - EVENT] Started instance
file = phd-tests/framework/src/test_vm/mod.rs
instance_description.instance = Instance { properties: InstanceProperties { id: c18790a7-e7da-443f-999c-dff8776497b0, name: "phd-vm-c18790a7-e7da-443f-999c-dff8776497b0", description: "Pheidippides-managed VM", metadata: InstanceMetadata { silo_id: 1932e245-1c15-484c-8060-f50a62753eb3, project_id: 7de8d25b-5470-4f37-859e-761fe00d5410, sled_id: d498587e-195c-44b0-8a03-d366986dcc7f, sled_serial: "d498587e-195c-44b0-8a03-d366986dcc7f", sled_revision: 1, sled_model: "pheidippes" } }, state: Creating }
line = 514
path = phd_tests::migrate::from_base::serial_history
target = phd_framework::test_vm
vm = migration_serial_history_base
vm_id = c18790a7-e7da-443f-999c-dff8776497b0
|
| 40 | 2026-10-02T23:37:17.992Z | INFO | phd-runner: [PUT_INSTANCE_STATE - START]
file = phd-tests/framework/src/test_vm/mod.rs
line = 575
path = phd_tests::migrate::from_base::serial_history
target = phd_framework::test_vm
vm = migration_serial_history_base
vm_id = c18790a7-e7da-443f-999c-dff8776497b0
|
| 41 | 2026-10-02T23:37:17.992Z | INFO | phd-runner: [PUT_INSTANCE_STATE - EVENT] Requesting instance state change
file = phd-tests/framework/src/test_vm/mod.rs
line = 580
path = phd_tests::migrate::from_base::serial_history
state = Run
target = phd_framework::test_vm
vm = migration_serial_history_base
vm_id = c18790a7-e7da-443f-999c-dff8776497b0
|
| 42 | 2026-10-02T23:37:18.002Z | INFO | phd-runner: [PUT_INSTANCE_STATE - END]
elapsed_milliseconds = 10
file = phd-tests/framework/src/test_vm/mod.rs
line = 575
path = phd_tests::migrate::from_base::serial_history
target = phd_framework::test_vm
vm = migration_serial_history_base
vm_id = c18790a7-e7da-443f-999c-dff8776497b0
|
| 43 | 2026-10-02T23:37:18.002Z | INFO | phd-runner: [WAIT_TO_BOOT - START]
file = phd-tests/framework/src/test_vm/mod.rs
line = 890
path = phd_tests::migrate::from_base::serial_history
target = phd_framework::test_vm
|
| 44 | 2026-10-02T23:37:18.002Z | INFO | phd-runner: [WAIT_TO_BOOT - EVENT] waiting for guest to boot
file = phd-tests/framework/src/test_vm/mod.rs
line = 839
path = phd_tests::migrate::from_base::serial_history
target = phd_framework::test_vm
timeout_duration = 300s
vm = migration_serial_history_base
vm_id = c18790a7-e7da-443f-999c-dff8776497b0
|
| 45 | 2026-10-02T23:37:18.002Z | DEBG | phd-runner: [WAIT_TO_BOOT - EVENT] executing command in boot sequence
file = phd-tests/framework/src/test_vm/mod.rs
line = 847
path = phd_tests::migrate::from_base::serial_history
step = WaitFor("localhost login: ")
target = phd_framework::test_vm
|
| 46 | 2026-10-02T23:37:18.002Z | INFO | phd-runner: [WAIT_FOR_SERIAL_OUTPUT - START]
file = phd-tests/framework/src/test_vm/mod.rs
line = 913
path = phd_tests::migrate::from_base::serial_history
target = phd_framework::test_vm
vm = migration_serial_history_base
vm_id = c18790a7-e7da-443f-999c-dff8776497b0
|
| 47 | 2026-10-02T23:37:18.002Z | INFO | phd-runner: [WAIT_FOR_SERIAL_OUTPUT - EVENT] Waiting for output on serial console
file = phd-tests/framework/src/test_vm/mod.rs
line = 920
path = phd_tests::migrate::from_base::serial_history
target = phd_framework::test_vm
timeout_duration = CallerTimeout
vm = migration_serial_history_base
vm_id = c18790a7-e7da-443f-999c-dff8776497b0
|
| 48 | 2026-10-02T23:37:22.604Z | INFO | phd-runner: [WAIT_FOR_SERIAL_OUTPUT - END]
elapsed_milliseconds = 4601
file = phd-tests/framework/src/test_vm/mod.rs
line = 913
path = phd_tests::migrate::from_base::serial_history
target = phd_framework::test_vm
vm = migration_serial_history_base
vm_id = c18790a7-e7da-443f-999c-dff8776497b0
|
| 49 | 2026-10-02T23:37:22.604Z | DEBG | phd-runner: [WAIT_TO_BOOT - EVENT] executing command in boot sequence
file = phd-tests/framework/src/test_vm/mod.rs
line = 847
path = phd_tests::migrate::from_base::serial_history
step = WriteStr("root")
target = phd_framework::test_vm
|
| 50 | 2026-10-02T23:37:22.609Z | DEBG | phd-runner: [WAIT_TO_BOOT - EVENT] executing command in boot sequence
file = phd-tests/framework/src/test_vm/mod.rs
line = 847
path = phd_tests::migrate::from_base::serial_history
step = WaitFor("localhost:~#")
target = phd_framework::test_vm
|
| 51 | 2026-10-02T23:37:22.609Z | INFO | phd-runner: [WAIT_FOR_SERIAL_OUTPUT - START]
file = phd-tests/framework/src/test_vm/mod.rs
line = 913
path = phd_tests::migrate::from_base::serial_history
target = phd_framework::test_vm
vm = migration_serial_history_base
vm_id = c18790a7-e7da-443f-999c-dff8776497b0
|
| 52 | 2026-10-02T23:37:22.609Z | INFO | phd-runner: [WAIT_FOR_SERIAL_OUTPUT - EVENT] Waiting for output on serial console
file = phd-tests/framework/src/test_vm/mod.rs
line = 920
path = phd_tests::migrate::from_base::serial_history
target = phd_framework::test_vm
timeout_duration = CallerTimeout
vm = migration_serial_history_base
vm_id = c18790a7-e7da-443f-999c-dff8776497b0
|
| 53 | 2026-10-02T23:37:22.633Z | INFO | phd-runner: [WAIT_FOR_SERIAL_OUTPUT - END]
elapsed_milliseconds = 24
file = phd-tests/framework/src/test_vm/mod.rs
line = 913
path = phd_tests::migrate::from_base::serial_history
target = phd_framework::test_vm
vm = migration_serial_history_base
vm_id = c18790a7-e7da-443f-999c-dff8776497b0
|
| 54 | 2026-10-02T23:37:22.633Z | DEBG | phd-runner: [WAIT_TO_BOOT - EVENT] executing command in boot sequence
file = phd-tests/framework/src/test_vm/mod.rs
line = 847
path = phd_tests::migrate::from_base::serial_history
step = WriteStr("stty -F `tty` cols 9999")
target = phd_framework::test_vm
|
| 55 | 2026-10-02T23:37:22.634Z | DEBG | phd-runner: [WAIT_TO_BOOT - EVENT] executing command in boot sequence
file = phd-tests/framework/src/test_vm/mod.rs
line = 847
path = phd_tests::migrate::from_base::serial_history
step = WaitFor("localhost:~#")
target = phd_framework::test_vm
|
| 56 | 2026-10-02T23:37:22.634Z | INFO | phd-runner: [WAIT_FOR_SERIAL_OUTPUT - START]
file = phd-tests/framework/src/test_vm/mod.rs
line = 913
path = phd_tests::migrate::from_base::serial_history
target = phd_framework::test_vm
vm = migration_serial_history_base
vm_id = c18790a7-e7da-443f-999c-dff8776497b0
|
| 57 | 2026-10-02T23:37:22.634Z | INFO | phd-runner: [WAIT_FOR_SERIAL_OUTPUT - EVENT] Waiting for output on serial console
file = phd-tests/framework/src/test_vm/mod.rs
line = 920
path = phd_tests::migrate::from_base::serial_history
target = phd_framework::test_vm
timeout_duration = CallerTimeout
vm = migration_serial_history_base
vm_id = c18790a7-e7da-443f-999c-dff8776497b0
|
| 58 | 2026-10-02T23:37:22.667Z | INFO | phd-runner: [WAIT_FOR_SERIAL_OUTPUT - END]
elapsed_milliseconds = 32
file = phd-tests/framework/src/test_vm/mod.rs
line = 913
path = phd_tests::migrate::from_base::serial_history
target = phd_framework::test_vm
vm = migration_serial_history_base
vm_id = c18790a7-e7da-443f-999c-dff8776497b0
|
| 59 | 2026-10-02T23:37:22.667Z | INFO | phd-runner: [WAIT_TO_BOOT - EVENT] Guest has booted
file = phd-tests/framework/src/test_vm/mod.rs
line = 887
path = phd_tests::migrate::from_base::serial_history
target = phd_framework::test_vm
|
| 60 | 2026-10-02T23:37:22.667Z | INFO | phd-runner: [WAIT_TO_BOOT - END]
elapsed_milliseconds = 4664
file = phd-tests/framework/src/test_vm/mod.rs
line = 890
path = phd_tests::migrate::from_base::serial_history
target = phd_framework::test_vm
|
| 61 | 2026-10-02T23:37:22.667Z | INFO | phd-runner: [WAIT_FOR_SERIAL_OUTPUT - START]
file = phd-tests/framework/src/test_vm/mod.rs
line = 913
path = phd_tests::migrate::from_base::serial_history
target = phd_framework::test_vm
vm = migration_serial_history_base
vm_id = c18790a7-e7da-443f-999c-dff8776497b0
|
| 62 | 2026-10-02T23:37:22.668Z | INFO | phd-runner: [WAIT_FOR_SERIAL_OUTPUT - EVENT] Waiting for output on serial console
file = phd-tests/framework/src/test_vm/mod.rs
line = 920
path = phd_tests::migrate::from_base::serial_history
target = phd_framework::test_vm
timeout_duration = Explicit(15s)
vm = migration_serial_history_base
vm_id = c18790a7-e7da-443f-999c-dff8776497b0
|
| 63 | 2026-10-02T23:37:22.677Z | INFO | phd-runner: [WAIT_FOR_SERIAL_OUTPUT - END]
elapsed_milliseconds = 9
file = phd-tests/framework/src/test_vm/mod.rs
line = 913
path = phd_tests::migrate::from_base::serial_history
target = phd_framework::test_vm
vm = migration_serial_history_base
vm_id = c18790a7-e7da-443f-999c-dff8776497b0
|
| 64 | 2026-10-02T23:37:22.678Z | INFO | phd-runner: [WAIT_FOR_SERIAL_OUTPUT - START]
file = phd-tests/framework/src/test_vm/mod.rs
line = 913
path = phd_tests::migrate::from_base::serial_history
target = phd_framework::test_vm
vm = migration_serial_history_base
vm_id = c18790a7-e7da-443f-999c-dff8776497b0
|
| 65 | 2026-10-02T23:37:22.678Z | INFO | phd-runner: [WAIT_FOR_SERIAL_OUTPUT - EVENT] Waiting for output on serial console
file = phd-tests/framework/src/test_vm/mod.rs
line = 920
path = phd_tests::migrate::from_base::serial_history
target = phd_framework::test_vm
timeout_duration = Explicit(300s)
vm = migration_serial_history_base
vm_id = c18790a7-e7da-443f-999c-dff8776497b0
|
| 66 | 2026-10-02T23:37:22.710Z | INFO | phd-runner: [WAIT_FOR_SERIAL_OUTPUT - END]
elapsed_milliseconds = 32
file = phd-tests/framework/src/test_vm/mod.rs
line = 913
path = phd_tests::migrate::from_base::serial_history
target = phd_framework::test_vm
vm = migration_serial_history_base
vm_id = c18790a7-e7da-443f-999c-dff8776497b0
|
| 67 | 2026-10-02T23:37:22.711Z | INFO | phd-runner: [WAIT_FOR_SERIAL_OUTPUT - START]
file = phd-tests/framework/src/test_vm/mod.rs
line = 913
path = phd_tests::migrate::from_base::serial_history
target = phd_framework::test_vm
vm = migration_serial_history_base
vm_id = c18790a7-e7da-443f-999c-dff8776497b0
|
| 68 | 2026-10-02T23:37:22.711Z | INFO | phd-runner: [WAIT_FOR_SERIAL_OUTPUT - EVENT] Waiting for output on serial console
file = phd-tests/framework/src/test_vm/mod.rs
line = 920
path = phd_tests::migrate::from_base::serial_history
target = phd_framework::test_vm
timeout_duration = Explicit(15s)
vm = migration_serial_history_base
vm_id = c18790a7-e7da-443f-999c-dff8776497b0
|
| 69 | 2026-10-02T23:37:22.721Z | INFO | phd-runner: [WAIT_FOR_SERIAL_OUTPUT - END]
elapsed_milliseconds = 10
file = phd-tests/framework/src/test_vm/mod.rs
line = 913
path = phd_tests::migrate::from_base::serial_history
target = phd_framework::test_vm
vm = migration_serial_history_base
vm_id = c18790a7-e7da-443f-999c-dff8776497b0
|
| 70 | 2026-10-02T23:37:22.722Z | INFO | phd-runner: [WAIT_FOR_SERIAL_OUTPUT - START]
file = phd-tests/framework/src/test_vm/mod.rs
line = 913
path = phd_tests::migrate::from_base::serial_history
target = phd_framework::test_vm
vm = migration_serial_history_base
vm_id = c18790a7-e7da-443f-999c-dff8776497b0
|
| 71 | 2026-10-02T23:37:22.722Z | INFO | phd-runner: [WAIT_FOR_SERIAL_OUTPUT - EVENT] Waiting for output on serial console
file = phd-tests/framework/src/test_vm/mod.rs
line = 920
path = phd_tests::migrate::from_base::serial_history
target = phd_framework::test_vm
timeout_duration = Explicit(300s)
vm = migration_serial_history_base
vm_id = c18790a7-e7da-443f-999c-dff8776497b0
|
| 72 | 2026-10-02T23:37:22.755Z | INFO | phd-runner: [WAIT_FOR_SERIAL_OUTPUT - END]
elapsed_milliseconds = 32
file = phd-tests/framework/src/test_vm/mod.rs
line = 913
path = phd_tests::migrate::from_base::serial_history
target = phd_framework::test_vm
vm = migration_serial_history_base
vm_id = c18790a7-e7da-443f-999c-dff8776497b0
|
| 73 | 2026-10-02T23:37:22.765Z | INFO | phd-runner: [TEST - EVENT] migrating to new Propolis artifact for lifecycle test
file = phd-tests/framework/src/lifecycle.rs
line = 73
path = phd_tests::migrate::from_base::serial_history
propolis_artifact = __DEFAULT_PROPOLIS
target = phd_framework::lifecycle
vm_name = migration_serial_history_base
|
| 74 | 2026-10-02T23:37:22.765Z | INFO | phd-runner: [NEW - START]
file = phd-tests/framework/src/test_vm/mod.rs
line = 300
path = phd_tests::migrate::from_base::serial_history
target = phd_framework::test_vm
|
| 75 | 2026-10-02T23:37:22.765Z | INFO | phd-runner: [NEW - EVENT] phd_framework::test_vm
environment = EnvironmentSpec { location: Local, propolis_artifact: "__DEFAULT_PROPOLIS", metrics: None }
file = phd-tests/framework/src/test_vm/mod.rs
guest_os_kind = Alpine
line = 318
path = phd_tests::migrate::from_base::serial_history
target = phd_framework::test_vm
vm_name = migration_serial_history_base_lifecycle_0
|
| 76 | 2026-10-02T23:37:22.765Z | DEBG | phd-runner: [NEW - EVENT] Examining locally-sourced artifact
file = phd-tests/framework/src/artifacts/store.rs
line = 56
path = /work/phd-test/propolis-server
sha256 = None
target = phd_framework::artifacts::store
|
| 77 | 2026-10-02T23:37:22.765Z | DEBG | phd-runner: [NEW - EVENT] Locally-sourced artifact is valid, caching its path
file = phd-tests/framework/src/artifacts/store.rs
line = 69
path = /work/phd-test/propolis-server
target = phd_framework::artifacts::store
|
| 78 | 2026-10-02T23:37:22.765Z | INFO | phd-runner: [NEW - EVENT] Launching Propolis server
bootrom_path = "/phd-artifacts/740187046a7267d0de72d3455070333547dbc0ea023531471fb2b2a61effa448/OVMF_CODE.fd"
file = phd-tests/framework/src/test_vm/server.rs
line = 66
path = phd_tests::migrate::from_base::serial_history
server_addr = 127.0.0.1:9002
server_path = "/work/phd-test/propolis-server"
target = phd_framework::test_vm::server
|
| 79 | 2026-10-02T23:37:22.765Z | INFO | phd-runner: [NEW - EVENT] Opening server log files
file = phd-tests/framework/src/log_config.rs
line = 84
path = phd_tests::migrate::from_base::serial_history
stderr_path = "/tmp/propolis-phd/phd_tests::migrate::from_base::serial_history/migration_serial_history_base_lifecycle_0.stderr.log"
stdout_path = "/tmp/propolis-phd/phd_tests::migrate::from_base::serial_history/migration_serial_history_base_lifecycle_0.stdout.log"
target = phd_framework::log_config
|
| 80 | 2026-10-02T23:37:22.803Z | INFO | phd-runner: [NEW - EVENT] Launched server with pid 918
file = phd-tests/framework/src/test_vm/server.rs
line = 127
path = phd_tests::migrate::from_base::serial_history
target = phd_framework::test_vm::server
|
| 81 | 2026-10-02T23:37:22.816Z | INFO | phd-runner: [NEW - END]
elapsed_milliseconds = 51
file = phd-tests/framework/src/test_vm/mod.rs
line = 300
path = phd_tests::migrate::from_base::serial_history
target = phd_framework::test_vm
|
| 82 | 2026-10-02T23:37:22.816Z | INFO | phd-runner: [MIGRATE_FROM - START]
file = phd-tests/framework/src/test_vm/mod.rs
line = 609
path = phd_tests::migrate::from_base::serial_history
source = migration_serial_history_base
source_id = c18790a7-e7da-443f-999c-dff8776497b0
target = phd_framework::test_vm
target_id = ba62da04-4e2f-41b1-8925-8bc1ee028e7d
|
| 83 | 2026-10-02T23:37:22.816Z | INFO | phd-runner: [MIGRATE_FROM - EVENT] Migrating from source at address 127.0.0.1:9000
file = phd-tests/framework/src/test_vm/mod.rs
line = 642
migration_id = 814a3645-512d-4e97-aa1a-2816cf939e44
path = phd_tests::migrate::from_base::serial_history
source = migration_serial_history_base
source_id = c18790a7-e7da-443f-999c-dff8776497b0
target = phd_framework::test_vm
target_id = ba62da04-4e2f-41b1-8925-8bc1ee028e7d
timeout_duration = 45s
|
| 84 | 2026-10-02T23:37:22.816Z | INFO | phd-runner: [INSTANCE_ENSURE_INTERNAL - START]
file = phd-tests/framework/src/test_vm/mod.rs
line = 412
path = phd_tests::migrate::from_base::serial_history
source = migration_serial_history_base
source_id = c18790a7-e7da-443f-999c-dff8776497b0
target = phd_framework::test_vm
target_id = ba62da04-4e2f-41b1-8925-8bc1ee028e7d
vm = migration_serial_history_base_lifecycle_0
vm_id = ba62da04-4e2f-41b1-8925-8bc1ee028e7d
|
| 85 | 2026-10-02T23:37:22.817Z | INFO | phd-runner: [INSTANCE_ENSURE_INTERNAL - EVENT] retriable error from instance_spec_ensure
e = Communication Error: error sending request for url (http://127.0.0.1:9002/instance)
file = phd-tests/framework/src/test_vm/mod.rs
line = 455
path = phd_tests::migrate::from_base::serial_history
source = migration_serial_history_base
source_id = c18790a7-e7da-443f-999c-dff8776497b0
target = phd_framework::test_vm
target_id = ba62da04-4e2f-41b1-8925-8bc1ee028e7d
vm = migration_serial_history_base_lifecycle_0
vm_id = ba62da04-4e2f-41b1-8925-8bc1ee028e7d
|
| 86 | 2026-10-02T23:37:23.624Z | INFO | phd-runner: [INSTANCE_ENSURE_INTERNAL - EVENT] Started instance
file = phd-tests/framework/src/test_vm/mod.rs
instance_description.instance = Instance { properties: InstanceProperties { id: ba62da04-4e2f-41b1-8925-8bc1ee028e7d, name: "phd-vm-ba62da04-4e2f-41b1-8925-8bc1ee028e7d", description: "Pheidippides-managed VM", metadata: InstanceMetadata { silo_id: 1932e245-1c15-484c-8060-f50a62753eb3, project_id: 7de8d25b-5470-4f37-859e-761fe00d5410, sled_id: 99ee2296-7242-491f-9da2-4a8f5dbda3ff, sled_serial: "99ee2296-7242-491f-9da2-4a8f5dbda3ff", sled_revision: 1, sled_model: "pheidippes" } }, state: Migrating }
line = 514
path = phd_tests::migrate::from_base::serial_history
source = migration_serial_history_base
source_id = c18790a7-e7da-443f-999c-dff8776497b0
target = phd_framework::test_vm
target_id = ba62da04-4e2f-41b1-8925-8bc1ee028e7d
vm = migration_serial_history_base_lifecycle_0
vm_id = ba62da04-4e2f-41b1-8925-8bc1ee028e7d
|
| 87 | 2026-10-02T23:37:23.626Z | INFO | phd-runner: [MIGRATE - START]
file = phd-tests/framework/src/test_vm/mod.rs
line = 663
migration_id = 814a3645-512d-4e97-aa1a-2816cf939e44
path = phd_tests::migrate::from_base::serial_history
source = migration_serial_history_base
source_id = c18790a7-e7da-443f-999c-dff8776497b0
target = phd_framework::test_vm
target_id = ba62da04-4e2f-41b1-8925-8bc1ee028e7d
|
| 88 | 2026-10-02T23:37:26.149Z | INFO | phd-runner: [SERIAL CONSOLE TASK - EVENT] serial socket control message
file = phd-tests/framework/src/serial/mod.rs
line = 275
s = {"Migrating":{"destination":"127.0.0.1:9002","from_start":7756}}
target = phd_framework::serial
|
| 89 | 2026-10-02T23:37:26.523Z | INFO | phd-runner: [MIGRATE_FROM - EVENT] Migration completed successfully
file = phd-tests/framework/src/test_vm/mod.rs
line = 676
path = phd_tests::migrate::from_base::serial_history
source = migration_serial_history_base
source_id = c18790a7-e7da-443f-999c-dff8776497b0
target = phd_framework::test_vm
target_id = ba62da04-4e2f-41b1-8925-8bc1ee028e7d
|
| 90 | 2026-10-02T23:37:26.523Z | INFO | phd-runner: [MIGRATE - END]
elapsed_milliseconds = 2897
file = phd-tests/framework/src/test_vm/mod.rs
line = 663
migration_id = 814a3645-512d-4e97-aa1a-2816cf939e44
path = phd_tests::migrate::from_base::serial_history
source = migration_serial_history_base
source_id = c18790a7-e7da-443f-999c-dff8776497b0
target = phd_framework::test_vm
target_id = ba62da04-4e2f-41b1-8925-8bc1ee028e7d
|
| 91 | 2026-10-02T23:37:26.526Z | INFO | phd-runner: [VM CLEANUP - START]
file = phd-tests/framework/src/test_vm/mod.rs
line = 1172
path = phd_tests::migrate::from_base::serial_history
target = phd_framework::test_vm
vm = migration_serial_history_base
vm_id = c18790a7-e7da-443f-999c-dff8776497b0
|
| 92 | 2026-10-02T23:37:26.531Z | DEBG | phd-runner: [VM CLEANUP - EVENT] Killing Propolis server process
file = phd-tests/framework/src/test_vm/server.rs
line = 177
path = phd_tests::migrate::from_base::serial_history
self.address = 127.0.0.1:9000
target = phd_framework::test_vm::server
vm = migration_serial_history_base
vm_id = c18790a7-e7da-443f-999c-dff8776497b0
|
| 93 | 2026-10-02T23:37:26.534Z | INFO | phd-runner: [VM CLEANUP - START]
file = phd-tests/framework/src/test_vm/mod.rs
line = 1172
path = phd_tests::migrate::from_base::serial_history
target = phd_framework::test_vm
vm = migration_serial_history_base_lifecycle_0
vm_id = ba62da04-4e2f-41b1-8925-8bc1ee028e7d
|
| 94 | 2026-10-02T23:37:26.535Z | DEBG | phd-runner: [SERIAL CONSOLE TASK - EVENT] serial console command channel was closed
file = phd-tests/framework/src/serial/mod.rs
line = 213
target = phd_framework::serial
|
| 95 | 2026-10-02T23:37:26.536Z | DEBG | phd-runner: [VM CLEANUP - EVENT] trying to ensure Propolis server VM is destroyed
file = phd-tests/framework/src/test_vm/mod.rs
line = 1195
path = phd_tests::migrate::from_base::serial_history
target = phd_framework::test_vm
vm = migration_serial_history_base_lifecycle_0
vm_id = ba62da04-4e2f-41b1-8925-8bc1ee028e7d
|
| 96 | 2026-10-02T23:37:26.537Z | INFO | phd-runner: [SERIAL CONSOLE TASK - END]
elapsed_milliseconds = 8551
file = phd-tests/framework/src/serial/mod.rs
line = 200
target = phd_framework::serial
|
| 97 | 2026-10-02T23:37:26.537Z | INFO | phd-runner: test phd_tests::migrate::from_base::serial_history ... ok
file = phd-tests/runner/src/execute.rs
line = 141
target = phd_runner::execute
|
| 98 | 2026-10-02T23:37:26.537Z | INFO | phd-runner: [TEST_CLEANUP - START]
file = phd-tests/runner/src/fixtures.rs
line = 51
target = phd_runner::fixtures
|
| 99 | 2026-10-02T23:37:26.608Z | INFO | phd-runner: [VM CLEANUP - END]
elapsed_milliseconds = 79
file = phd-tests/framework/src/test_vm/mod.rs
line = 1172
path = phd_tests::migrate::from_base::serial_history
target = phd_framework::test_vm
vm = migration_serial_history_base
vm_id = c18790a7-e7da-443f-999c-dff8776497b0
|
| 100 | 2026-10-02T23:37:26.608Z | INFO | phd-runner: [INSTANCE_ENSURE_INTERNAL - END]
elapsed_milliseconds = 9351
file = phd-tests/framework/src/test_vm/mod.rs
line = 412
path = phd_tests::migrate::from_base::serial_history
target = phd_framework::test_vm
vm = migration_serial_history_base
vm_id = c18790a7-e7da-443f-999c-dff8776497b0
|
| 101 | 2026-10-02T23:37:26.970Z | DEBG | phd-runner: [VM CLEANUP - EVENT] Killing Propolis server process
file = phd-tests/framework/src/test_vm/server.rs
line = 177
path = phd_tests::migrate::from_base::serial_history
self.address = 127.0.0.1:9002
target = phd_framework::test_vm::server
vm = migration_serial_history_base_lifecycle_0
vm_id = ba62da04-4e2f-41b1-8925-8bc1ee028e7d
|
| 102 | 2026-10-02T23:37:27.063Z | DEBG | phd-runner: [VM CLEANUP - EVENT] zfs clone dropped
file = phd-tests/framework/src/zfs.rs
line = 83
path = phd_tests::migrate::from_base::serial_history
target = phd_framework::zfs
vm = migration_serial_history_base_lifecycle_0
vm_id = ba62da04-4e2f-41b1-8925-8bc1ee028e7d
|
| 103 | 2026-10-02T23:37:27.063Z | DEBG | phd-runner: [VM CLEANUP - EVENT] executing ZFS command
args = ["phd-artifacts/phd-clone-fbcd6e29-67b8-4f85-b926-e494afc0cfce"]
file = phd-tests/framework/src/zfs.rs
line = 304
path = phd_tests::migrate::from_base::serial_history
target = phd_framework::zfs
verb = destroy
vm = migration_serial_history_base_lifecycle_0
vm_id = ba62da04-4e2f-41b1-8925-8bc1ee028e7d
|
| 104 | 2026-10-02T23:37:27.088Z | DEBG | phd-runner: [VM CLEANUP - EVENT] zfs snapshot dropped
file = phd-tests/framework/src/zfs.rs
line = 57
path = phd_tests::migrate::from_base::serial_history
target = phd_framework::zfs
vm = migration_serial_history_base_lifecycle_0
vm_id = ba62da04-4e2f-41b1-8925-8bc1ee028e7d
|
| 105 | 2026-10-02T23:37:27.088Z | DEBG | phd-runner: [VM CLEANUP - EVENT] executing ZFS command
args = ["phd-artifacts@phd-5d368db8-5727-4564-a16d-d6edf1b51e51"]
file = phd-tests/framework/src/zfs.rs
line = 304
path = phd_tests::migrate::from_base::serial_history
target = phd_framework::zfs
verb = destroy
vm = migration_serial_history_base_lifecycle_0
vm_id = ba62da04-4e2f-41b1-8925-8bc1ee028e7d
|
| 106 | 2026-10-02T23:37:27.106Z | INFO | phd-runner: [VM CLEANUP - END]
elapsed_milliseconds = 571
file = phd-tests/framework/src/test_vm/mod.rs
line = 1172
path = phd_tests::migrate::from_base::serial_history
target = phd_framework::test_vm
vm = migration_serial_history_base_lifecycle_0
vm_id = ba62da04-4e2f-41b1-8925-8bc1ee028e7d
|
| 107 | 2026-10-02T23:37:27.107Z | INFO | phd-runner: [INSTANCE_ENSURE_INTERNAL - END]
elapsed_milliseconds = 4290
file = phd-tests/framework/src/test_vm/mod.rs
line = 412
path = phd_tests::migrate::from_base::serial_history
source = migration_serial_history_base
source_id = c18790a7-e7da-443f-999c-dff8776497b0
target = phd_framework::test_vm
target_id = ba62da04-4e2f-41b1-8925-8bc1ee028e7d
vm = migration_serial_history_base_lifecycle_0
vm_id = ba62da04-4e2f-41b1-8925-8bc1ee028e7d
|
| 108 | 2026-10-02T23:37:27.107Z | INFO | phd-runner: [MIGRATE_FROM - END]
elapsed_milliseconds = 4290
file = phd-tests/framework/src/test_vm/mod.rs
line = 609
path = phd_tests::migrate::from_base::serial_history
source = migration_serial_history_base
source_id = c18790a7-e7da-443f-999c-dff8776497b0
target = phd_framework::test_vm
target_id = ba62da04-4e2f-41b1-8925-8bc1ee028e7d
|
| 109 | 2026-10-02T23:37:27.107Z | INFO | phd-runner: [TEST - END]
elapsed_milliseconds = 58705
file = phd-tests/tests/src/migrate.rs
line = 40
path = phd_tests::migrate::from_base::serial_history
target = phd_tests::migrate::from_base
|
| 110 | 2026-10-02T23:37:27.107Z | INFO | phd-runner: [TEST_CLEANUP - END]
elapsed_milliseconds = 569
file = phd-tests/runner/src/fixtures.rs
line = 51
target = phd_runner::fixtures
|
| 111 | 2026-10-02T23:37:27.107Z | INFO | phd-runner: Starting test phd_tests::migrate::from_base::can_migrate_from_base
file = phd-tests/runner/src/execute.rs
line = 91
target = phd_runner::execute
|
| 112 | 2026-10-02T23:37:27.107Z | INFO | phd-runner: [TEST_SETUP - START]
file = phd-tests/runner/src/fixtures.rs
line = 41
target = phd_runner::fixtures
|
| 113 | 2026-10-02T23:37:27.108Z | INFO | phd-runner: [TEST_SETUP - END]
elapsed_milliseconds = 0
file = phd-tests/runner/src/fixtures.rs
line = 41
target = phd_runner::fixtures
|
| 114 | 2026-10-02T23:37:27.108Z | INFO | phd-runner: [TEST - START]
file = phd-tests/tests/src/migrate.rs
line = 34
path = phd_tests::migrate::from_base::can_migrate_from_base
target = phd_tests::migrate::from_base
|
| 115 | 2026-10-02T23:37:27.108Z | DEBG | phd-runner: [TEST - EVENT] Verified artifact already exists
file = phd-tests/framework/src/artifacts/store.rs
line = 45
path = /phd-artifacts/740187046a7267d0de72d3455070333547dbc0ea023531471fb2b2a61effa448/OVMF_CODE.fd
target = phd_framework::artifacts::store
|
| 116 | 2026-10-02T23:37:27.108Z | DEBG | phd-runner: [TEST - EVENT] Verified artifact already exists
file = phd-tests/framework/src/artifacts/store.rs
line = 45
path = /phd-artifacts/ba8007f74f9b54fbae3b2520da577831b4834778a498d732f091260c61aa7ca1/alpine.iso
target = phd_framework::artifacts::store
|
| 117 | 2026-10-02T23:37:27.108Z | DEBG | phd-runner: [TEST - EVENT] Verified artifact already exists
file = phd-tests/framework/src/artifacts/store.rs
line = 45
path = /phd-artifacts/ba8007f74f9b54fbae3b2520da577831b4834778a498d732f091260c61aa7ca1/alpine.iso
target = phd_framework::artifacts::store
|
| 118 | 2026-10-02T23:37:27.108Z | DEBG | phd-runner: [TEST - EVENT] executing ZFS command
args = ["/phd-artifacts/ba8007f74f9b54fbae3b2520da577831b4834778a498d732f091260c61aa7ca1/alpine.iso"]
file = phd-tests/framework/src/zfs.rs
line = 304
path = phd_tests::migrate::from_base::can_migrate_from_base
target = phd_framework::zfs
verb = list
|
| 119 | 2026-10-02T23:37:27.121Z | DEBG | phd-runner: [TEST - EVENT] parsing zfs list output
file = phd-tests/framework/src/zfs.rs
line = 238
path = phd_tests::migrate::from_base::can_migrate_from_base
stdout = NAME USED AVAIL REFER MOUNTPOINT\nphd-artifacts 1.30G 25.3T 1.30G /phd-artifacts\n
target = phd_framework::zfs
|
| 120 | 2026-10-02T23:37:27.121Z | DEBG | phd-runner: [TEST - EVENT] executing ZFS command
args = ["phd-artifacts@phd-b70063f2-f7dc-4188-ae92-29dcb008c63a"]
file = phd-tests/framework/src/zfs.rs
line = 304
path = phd_tests::migrate::from_base::can_migrate_from_base
target = phd_framework::zfs
verb = snapshot
|
| 121 | 2026-10-02T23:37:27.140Z | DEBG | phd-runner: [TEST - EVENT] executing ZFS command
args = ["phd-artifacts@phd-b70063f2-f7dc-4188-ae92-29dcb008c63a", "phd-artifacts/phd-clone-0ada50f6-0f48-4c9d-a66e-49fe37f37811"]
file = phd-tests/framework/src/zfs.rs
line = 304
path = phd_tests::migrate::from_base::can_migrate_from_base
target = phd_framework::zfs
verb = clone
|
| 122 | 2026-10-02T23:37:27.158Z | DEBG | phd-runner: [TEST - EVENT] executing ZFS command
args = ["phd-artifacts/phd-clone-0ada50f6-0f48-4c9d-a66e-49fe37f37811"]
file = phd-tests/framework/src/zfs.rs
line = 304
path = phd_tests::migrate::from_base::can_migrate_from_base
target = phd_framework::zfs
verb = list
|
| 123 | 2026-10-02T23:37:27.173Z | DEBG | phd-runner: [TEST - EVENT] parsing zfs list output
file = phd-tests/framework/src/zfs.rs
line = 238
path = phd_tests::migrate::from_base::can_migrate_from_base
stdout = NAME USED AVAIL REFER MOUNTPOINT\nphd-artifacts/phd-clone-0ada50f6-0f48-4c9d-a66e-49fe37f37811 0B 25.3T 1.30G /phd-artifacts/phd-clone-0ada50f6-0f48-4c9d-a66e-49fe37f37811\n
target = phd_framework::zfs
|
| 124 | 2026-10-02T23:37:27.174Z | INFO | phd-runner: [NEW - START]
file = phd-tests/framework/src/test_vm/mod.rs
line = 300
path = phd_tests::migrate::from_base::can_migrate_from_base
target = phd_framework::test_vm
|
| 125 | 2026-10-02T23:37:27.174Z | INFO | phd-runner: [NEW - EVENT] phd_framework::test_vm
environment = EnvironmentSpec { location: Local, propolis_artifact: "__BASE_PROPOLIS", metrics: None }
file = phd-tests/framework/src/test_vm/mod.rs
guest_os_kind = Alpine
line = 318
path = phd_tests::migrate::from_base::can_migrate_from_base
target = phd_framework::test_vm
vm_name = migration_from_base
|
| 126 | 2026-10-02T23:37:27.174Z | DEBG | phd-runner: [NEW - EVENT] Verified artifact already exists
file = phd-tests/framework/src/artifacts/store.rs
line = 45
path = /phd-artifacts/c39ee71b9b334e87523f19fd9694492a794ad7a287ed999d3aaee7dc836e0a17/propolis-server
target = phd_framework::artifacts::store
|
| 127 | 2026-10-02T23:37:27.174Z | INFO | phd-runner: [NEW - EVENT] Launching Propolis server
bootrom_path = "/phd-artifacts/740187046a7267d0de72d3455070333547dbc0ea023531471fb2b2a61effa448/OVMF_CODE.fd"
file = phd-tests/framework/src/test_vm/server.rs
line = 66
path = phd_tests::migrate::from_base::can_migrate_from_base
server_addr = 127.0.0.1:9000
server_path = "/phd-artifacts/c39ee71b9b334e87523f19fd9694492a794ad7a287ed999d3aaee7dc836e0a17/propolis-server"
target = phd_framework::test_vm::server
|
| 128 | 2026-10-02T23:37:27.174Z | INFO | phd-runner: [NEW - EVENT] Opening server log files
file = phd-tests/framework/src/log_config.rs
line = 84
path = phd_tests::migrate::from_base::can_migrate_from_base
stderr_path = "/tmp/propolis-phd/phd_tests::migrate::from_base::can_migrate_from_base/migration_from_base.stderr.log"
stdout_path = "/tmp/propolis-phd/phd_tests::migrate::from_base::can_migrate_from_base/migration_from_base.stdout.log"
target = phd_framework::log_config
|
| 129 | 2026-10-02T23:37:27.217Z | INFO | phd-runner: [NEW - EVENT] Launched server with pid 927
file = phd-tests/framework/src/test_vm/server.rs
line = 127
path = phd_tests::migrate::from_base::can_migrate_from_base
target = phd_framework::test_vm::server
|
| 130 | 2026-10-02T23:37:27.232Z | INFO | phd-runner: [NEW - END]
elapsed_milliseconds = 57
file = phd-tests/framework/src/test_vm/mod.rs
line = 300
path = phd_tests::migrate::from_base::can_migrate_from_base
target = phd_framework::test_vm
|
| 131 | 2026-10-02T23:37:27.232Z | INFO | phd-runner: [INSTANCE_ENSURE_INTERNAL - START]
file = phd-tests/framework/src/test_vm/mod.rs
line = 412
path = phd_tests::migrate::from_base::can_migrate_from_base
target = phd_framework::test_vm
vm = migration_from_base
vm_id = 428836e7-b385-422f-b844-7add071b8b1e
|
| 132 | 2026-10-02T23:37:27.233Z | INFO | phd-runner: [INSTANCE_ENSURE_INTERNAL - EVENT] retriable error from instance_spec_ensure
e = Communication Error: error sending request for url (http://127.0.0.1:9000/instance)
file = phd-tests/framework/src/test_vm/mod.rs
line = 455
path = phd_tests::migrate::from_base::can_migrate_from_base
target = phd_framework::test_vm
vm = migration_from_base
vm_id = 428836e7-b385-422f-b844-7add071b8b1e
|
| 133 | 2026-10-02T23:37:27.744Z | INFO | phd-runner: [SERIAL CONSOLE TASK - START]
file = phd-tests/framework/src/serial/mod.rs
line = 200
target = phd_framework::serial
|
| 134 | 2026-10-02T23:37:27.745Z | INFO | phd-runner: [INSTANCE_ENSURE_INTERNAL - EVENT] Started instance
file = phd-tests/framework/src/test_vm/mod.rs
instance_description.instance = Instance { properties: InstanceProperties { id: 428836e7-b385-422f-b844-7add071b8b1e, name: "phd-vm-428836e7-b385-422f-b844-7add071b8b1e", description: "Pheidippides-managed VM", metadata: InstanceMetadata { silo_id: 8e2454c3-05fb-425c-92ef-0202b4cb13e2, project_id: 5d4e4843-aebc-4d7c-a1c6-52cbacd8db5a, sled_id: f5cbf33b-27fc-49a2-8150-060a27914775, sled_serial: "f5cbf33b-27fc-49a2-8150-060a27914775", sled_revision: 1, sled_model: "pheidippes" } }, state: Creating }
line = 514
path = phd_tests::migrate::from_base::can_migrate_from_base
target = phd_framework::test_vm
vm = migration_from_base
vm_id = 428836e7-b385-422f-b844-7add071b8b1e
|
| 135 | 2026-10-02T23:37:27.745Z | INFO | phd-runner: [PUT_INSTANCE_STATE - START]
file = phd-tests/framework/src/test_vm/mod.rs
line = 575
path = phd_tests::migrate::from_base::can_migrate_from_base
target = phd_framework::test_vm
vm = migration_from_base
vm_id = 428836e7-b385-422f-b844-7add071b8b1e
|
| 136 | 2026-10-02T23:37:27.745Z | INFO | phd-runner: [PUT_INSTANCE_STATE - EVENT] Requesting instance state change
file = phd-tests/framework/src/test_vm/mod.rs
line = 580
path = phd_tests::migrate::from_base::can_migrate_from_base
state = Run
target = phd_framework::test_vm
vm = migration_from_base
vm_id = 428836e7-b385-422f-b844-7add071b8b1e
|
| 137 | 2026-10-02T23:37:27.746Z | INFO | phd-runner: [PUT_INSTANCE_STATE - END]
elapsed_milliseconds = 0
file = phd-tests/framework/src/test_vm/mod.rs
line = 575
path = phd_tests::migrate::from_base::can_migrate_from_base
target = phd_framework::test_vm
vm = migration_from_base
vm_id = 428836e7-b385-422f-b844-7add071b8b1e
|
| 138 | 2026-10-02T23:37:27.746Z | INFO | phd-runner: [WAIT_TO_BOOT - START]
file = phd-tests/framework/src/test_vm/mod.rs
line = 890
path = phd_tests::migrate::from_base::can_migrate_from_base
target = phd_framework::test_vm
|
| 139 | 2026-10-02T23:37:27.746Z | INFO | phd-runner: [WAIT_TO_BOOT - EVENT] waiting for guest to boot
file = phd-tests/framework/src/test_vm/mod.rs
line = 839
path = phd_tests::migrate::from_base::can_migrate_from_base
target = phd_framework::test_vm
timeout_duration = 300s
vm = migration_from_base
vm_id = 428836e7-b385-422f-b844-7add071b8b1e
|
| 140 | 2026-10-02T23:37:27.746Z | DEBG | phd-runner: [WAIT_TO_BOOT - EVENT] executing command in boot sequence
file = phd-tests/framework/src/test_vm/mod.rs
line = 847
path = phd_tests::migrate::from_base::can_migrate_from_base
step = WaitFor("localhost login: ")
target = phd_framework::test_vm
|
| 141 | 2026-10-02T23:37:27.746Z | INFO | phd-runner: [WAIT_FOR_SERIAL_OUTPUT - START]
file = phd-tests/framework/src/test_vm/mod.rs
line = 913
path = phd_tests::migrate::from_base::can_migrate_from_base
target = phd_framework::test_vm
vm = migration_from_base
vm_id = 428836e7-b385-422f-b844-7add071b8b1e
|
| 142 | 2026-10-02T23:37:27.746Z | INFO | phd-runner: [WAIT_FOR_SERIAL_OUTPUT - EVENT] Waiting for output on serial console
file = phd-tests/framework/src/test_vm/mod.rs
line = 920
path = phd_tests::migrate::from_base::can_migrate_from_base
target = phd_framework::test_vm
timeout_duration = CallerTimeout
vm = migration_from_base
vm_id = 428836e7-b385-422f-b844-7add071b8b1e
|
| 143 | 2026-10-02T23:37:32.350Z | INFO | phd-runner: [WAIT_FOR_SERIAL_OUTPUT - END]
elapsed_milliseconds = 4603
file = phd-tests/framework/src/test_vm/mod.rs
line = 913
path = phd_tests::migrate::from_base::can_migrate_from_base
target = phd_framework::test_vm
vm = migration_from_base
vm_id = 428836e7-b385-422f-b844-7add071b8b1e
|
| 144 | 2026-10-02T23:37:32.350Z | DEBG | phd-runner: [WAIT_TO_BOOT - EVENT] executing command in boot sequence
file = phd-tests/framework/src/test_vm/mod.rs
line = 847
path = phd_tests::migrate::from_base::can_migrate_from_base
step = WriteStr("root")
target = phd_framework::test_vm
|
| 145 | 2026-10-02T23:37:32.350Z | DEBG | phd-runner: [WAIT_TO_BOOT - EVENT] executing command in boot sequence
file = phd-tests/framework/src/test_vm/mod.rs
line = 847
path = phd_tests::migrate::from_base::can_migrate_from_base
step = WaitFor("localhost:~#")
target = phd_framework::test_vm
|
| 146 | 2026-10-02T23:37:32.350Z | INFO | phd-runner: [WAIT_FOR_SERIAL_OUTPUT - START]
file = phd-tests/framework/src/test_vm/mod.rs
line = 913
path = phd_tests::migrate::from_base::can_migrate_from_base
target = phd_framework::test_vm
vm = migration_from_base
vm_id = 428836e7-b385-422f-b844-7add071b8b1e
|
| 147 | 2026-10-02T23:37:32.350Z | INFO | phd-runner: [WAIT_FOR_SERIAL_OUTPUT - EVENT] Waiting for output on serial console
file = phd-tests/framework/src/test_vm/mod.rs
line = 920
path = phd_tests::migrate::from_base::can_migrate_from_base
target = phd_framework::test_vm
timeout_duration = CallerTimeout
vm = migration_from_base
vm_id = 428836e7-b385-422f-b844-7add071b8b1e
|
| 148 | 2026-10-02T23:37:32.369Z | INFO | phd-runner: [WAIT_FOR_SERIAL_OUTPUT - END]
elapsed_milliseconds = 19
file = phd-tests/framework/src/test_vm/mod.rs
line = 913
path = phd_tests::migrate::from_base::can_migrate_from_base
target = phd_framework::test_vm
vm = migration_from_base
vm_id = 428836e7-b385-422f-b844-7add071b8b1e
|
| 149 | 2026-10-02T23:37:32.370Z | DEBG | phd-runner: [WAIT_TO_BOOT - EVENT] executing command in boot sequence
file = phd-tests/framework/src/test_vm/mod.rs
line = 847
path = phd_tests::migrate::from_base::can_migrate_from_base
step = WriteStr("stty -F `tty` cols 9999")
target = phd_framework::test_vm
|
| 150 | 2026-10-02T23:37:32.370Z | DEBG | phd-runner: [WAIT_TO_BOOT - EVENT] executing command in boot sequence
file = phd-tests/framework/src/test_vm/mod.rs
line = 847
path = phd_tests::migrate::from_base::can_migrate_from_base
step = WaitFor("localhost:~#")
target = phd_framework::test_vm
|
| 151 | 2026-10-02T23:37:32.370Z | INFO | phd-runner: [WAIT_FOR_SERIAL_OUTPUT - START]
file = phd-tests/framework/src/test_vm/mod.rs
line = 913
path = phd_tests::migrate::from_base::can_migrate_from_base
target = phd_framework::test_vm
vm = migration_from_base
vm_id = 428836e7-b385-422f-b844-7add071b8b1e
|
| 152 | 2026-10-02T23:37:32.370Z | INFO | phd-runner: [WAIT_FOR_SERIAL_OUTPUT - EVENT] Waiting for output on serial console
file = phd-tests/framework/src/test_vm/mod.rs
line = 920
path = phd_tests::migrate::from_base::can_migrate_from_base
target = phd_framework::test_vm
timeout_duration = CallerTimeout
vm = migration_from_base
vm_id = 428836e7-b385-422f-b844-7add071b8b1e
|
| 153 | 2026-10-02T23:37:32.402Z | INFO | phd-runner: [WAIT_FOR_SERIAL_OUTPUT - END]
elapsed_milliseconds = 31
file = phd-tests/framework/src/test_vm/mod.rs
line = 913
path = phd_tests::migrate::from_base::can_migrate_from_base
target = phd_framework::test_vm
vm = migration_from_base
vm_id = 428836e7-b385-422f-b844-7add071b8b1e
|
| 154 | 2026-10-02T23:37:32.402Z | INFO | phd-runner: [WAIT_TO_BOOT - EVENT] Guest has booted
file = phd-tests/framework/src/test_vm/mod.rs
line = 887
path = phd_tests::migrate::from_base::can_migrate_from_base
target = phd_framework::test_vm
|
| 155 | 2026-10-02T23:37:32.402Z | INFO | phd-runner: [WAIT_TO_BOOT - END]
elapsed_milliseconds = 4655
file = phd-tests/framework/src/test_vm/mod.rs
line = 890
path = phd_tests::migrate::from_base::can_migrate_from_base
target = phd_framework::test_vm
|
| 156 | 2026-10-02T23:37:32.402Z | INFO | phd-runner: [WAIT_FOR_SERIAL_OUTPUT - START]
file = phd-tests/framework/src/test_vm/mod.rs
line = 913
path = phd_tests::migrate::from_base::can_migrate_from_base
target = phd_framework::test_vm
vm = migration_from_base
vm_id = 428836e7-b385-422f-b844-7add071b8b1e
|
| 157 | 2026-10-02T23:37:32.402Z | INFO | phd-runner: [WAIT_FOR_SERIAL_OUTPUT - EVENT] Waiting for output on serial console
file = phd-tests/framework/src/test_vm/mod.rs
line = 920
path = phd_tests::migrate::from_base::can_migrate_from_base
target = phd_framework::test_vm
timeout_duration = Explicit(15s)
vm = migration_from_base
vm_id = 428836e7-b385-422f-b844-7add071b8b1e
|
| 158 | 2026-10-02T23:37:32.413Z | INFO | phd-runner: [WAIT_FOR_SERIAL_OUTPUT - END]
elapsed_milliseconds = 10
file = phd-tests/framework/src/test_vm/mod.rs
line = 913
path = phd_tests::migrate::from_base::can_migrate_from_base
target = phd_framework::test_vm
vm = migration_from_base
vm_id = 428836e7-b385-422f-b844-7add071b8b1e
|
| 159 | 2026-10-02T23:37:32.414Z | INFO | phd-runner: [WAIT_FOR_SERIAL_OUTPUT - START]
file = phd-tests/framework/src/test_vm/mod.rs
line = 913
path = phd_tests::migrate::from_base::can_migrate_from_base
target = phd_framework::test_vm
vm = migration_from_base
vm_id = 428836e7-b385-422f-b844-7add071b8b1e
|
| 160 | 2026-10-02T23:37:32.414Z | INFO | phd-runner: [WAIT_FOR_SERIAL_OUTPUT - EVENT] Waiting for output on serial console
file = phd-tests/framework/src/test_vm/mod.rs
line = 920
path = phd_tests::migrate::from_base::can_migrate_from_base
target = phd_framework::test_vm
timeout_duration = Explicit(300s)
vm = migration_from_base
vm_id = 428836e7-b385-422f-b844-7add071b8b1e
|
| 161 | 2026-10-02T23:37:32.446Z | INFO | phd-runner: [WAIT_FOR_SERIAL_OUTPUT - END]
elapsed_milliseconds = 32
file = phd-tests/framework/src/test_vm/mod.rs
line = 913
path = phd_tests::migrate::from_base::can_migrate_from_base
target = phd_framework::test_vm
vm = migration_from_base
vm_id = 428836e7-b385-422f-b844-7add071b8b1e
|
| 162 | 2026-10-02T23:37:32.447Z | INFO | phd-runner: [WAIT_FOR_SERIAL_OUTPUT - START]
file = phd-tests/framework/src/test_vm/mod.rs
line = 913
path = phd_tests::migrate::from_base::can_migrate_from_base
target = phd_framework::test_vm
vm = migration_from_base
vm_id = 428836e7-b385-422f-b844-7add071b8b1e
|
| 163 | 2026-10-02T23:37:32.447Z | INFO | phd-runner: [WAIT_FOR_SERIAL_OUTPUT - EVENT] Waiting for output on serial console
file = phd-tests/framework/src/test_vm/mod.rs
line = 920
path = phd_tests::migrate::from_base::can_migrate_from_base
target = phd_framework::test_vm
timeout_duration = Explicit(15s)
vm = migration_from_base
vm_id = 428836e7-b385-422f-b844-7add071b8b1e
|
| 164 | 2026-10-02T23:37:32.456Z | INFO | phd-runner: [WAIT_FOR_SERIAL_OUTPUT - END]
elapsed_milliseconds = 9
file = phd-tests/framework/src/test_vm/mod.rs
line = 913
path = phd_tests::migrate::from_base::can_migrate_from_base
target = phd_framework::test_vm
vm = migration_from_base
vm_id = 428836e7-b385-422f-b844-7add071b8b1e
|
| 165 | 2026-10-02T23:37:32.457Z | INFO | phd-runner: [WAIT_FOR_SERIAL_OUTPUT - START]
file = phd-tests/framework/src/test_vm/mod.rs
line = 913
path = phd_tests::migrate::from_base::can_migrate_from_base
target = phd_framework::test_vm
vm = migration_from_base
vm_id = 428836e7-b385-422f-b844-7add071b8b1e
|
| 166 | 2026-10-02T23:37:32.457Z | INFO | phd-runner: [WAIT_FOR_SERIAL_OUTPUT - EVENT] Waiting for output on serial console
file = phd-tests/framework/src/test_vm/mod.rs
line = 920
path = phd_tests::migrate::from_base::can_migrate_from_base
target = phd_framework::test_vm
timeout_duration = Explicit(300s)
vm = migration_from_base
vm_id = 428836e7-b385-422f-b844-7add071b8b1e
|
| 167 | 2026-10-02T23:37:32.490Z | INFO | phd-runner: [WAIT_FOR_SERIAL_OUTPUT - END]
elapsed_milliseconds = 33
file = phd-tests/framework/src/test_vm/mod.rs
line = 913
path = phd_tests::migrate::from_base::can_migrate_from_base
target = phd_framework::test_vm
vm = migration_from_base
vm_id = 428836e7-b385-422f-b844-7add071b8b1e
|
| 168 | 2026-10-02T23:37:32.490Z | INFO | phd-runner: [WAIT_FOR_SERIAL_OUTPUT - START]
file = phd-tests/framework/src/test_vm/mod.rs
line = 913
path = phd_tests::migrate::from_base::can_migrate_from_base
target = phd_framework::test_vm
vm = migration_from_base
vm_id = 428836e7-b385-422f-b844-7add071b8b1e
|
| 169 | 2026-10-02T23:37:32.490Z | INFO | phd-runner: [WAIT_FOR_SERIAL_OUTPUT - EVENT] Waiting for output on serial console
file = phd-tests/framework/src/test_vm/mod.rs
line = 920
path = phd_tests::migrate::from_base::can_migrate_from_base
target = phd_framework::test_vm
timeout_duration = Explicit(15s)
vm = migration_from_base
vm_id = 428836e7-b385-422f-b844-7add071b8b1e
|
| 170 | 2026-10-02T23:37:32.501Z | INFO | phd-runner: [WAIT_FOR_SERIAL_OUTPUT - END]
elapsed_milliseconds = 10
file = phd-tests/framework/src/test_vm/mod.rs
line = 913
path = phd_tests::migrate::from_base::can_migrate_from_base
target = phd_framework::test_vm
vm = migration_from_base
vm_id = 428836e7-b385-422f-b844-7add071b8b1e
|
| 171 | 2026-10-02T23:37:32.501Z | INFO | phd-runner: [WAIT_FOR_SERIAL_OUTPUT - START]
file = phd-tests/framework/src/test_vm/mod.rs
line = 913
path = phd_tests::migrate::from_base::can_migrate_from_base
target = phd_framework::test_vm
vm = migration_from_base
vm_id = 428836e7-b385-422f-b844-7add071b8b1e
|
| 172 | 2026-10-02T23:37:32.502Z | INFO | phd-runner: [WAIT_FOR_SERIAL_OUTPUT - EVENT] Waiting for output on serial console
file = phd-tests/framework/src/test_vm/mod.rs
line = 920
path = phd_tests::migrate::from_base::can_migrate_from_base
target = phd_framework::test_vm
timeout_duration = Explicit(300s)
vm = migration_from_base
vm_id = 428836e7-b385-422f-b844-7add071b8b1e
|
| 173 | 2026-10-02T23:37:32.534Z | INFO | phd-runner: [WAIT_FOR_SERIAL_OUTPUT - END]
elapsed_milliseconds = 32
file = phd-tests/framework/src/test_vm/mod.rs
line = 913
path = phd_tests::migrate::from_base::can_migrate_from_base
target = phd_framework::test_vm
vm = migration_from_base
vm_id = 428836e7-b385-422f-b844-7add071b8b1e
|
| 174 | 2026-10-02T23:37:32.535Z | INFO | phd-runner: [WAIT_FOR_SERIAL_OUTPUT - START]
file = phd-tests/framework/src/test_vm/mod.rs
line = 913
path = phd_tests::migrate::from_base::can_migrate_from_base
target = phd_framework::test_vm
vm = migration_from_base
vm_id = 428836e7-b385-422f-b844-7add071b8b1e
|
| 175 | 2026-10-02T23:37:32.535Z | INFO | phd-runner: [WAIT_FOR_SERIAL_OUTPUT - EVENT] Waiting for output on serial console
file = phd-tests/framework/src/test_vm/mod.rs
line = 920
path = phd_tests::migrate::from_base::can_migrate_from_base
target = phd_framework::test_vm
timeout_duration = Explicit(15s)
vm = migration_from_base
vm_id = 428836e7-b385-422f-b844-7add071b8b1e
|
| 176 | 2026-10-02T23:37:32.546Z | INFO | phd-runner: [WAIT_FOR_SERIAL_OUTPUT - END]
elapsed_milliseconds = 11
file = phd-tests/framework/src/test_vm/mod.rs
line = 913
path = phd_tests::migrate::from_base::can_migrate_from_base
target = phd_framework::test_vm
vm = migration_from_base
vm_id = 428836e7-b385-422f-b844-7add071b8b1e
|
| 177 | 2026-10-02T23:37:32.547Z | INFO | phd-runner: [WAIT_FOR_SERIAL_OUTPUT - START]
file = phd-tests/framework/src/test_vm/mod.rs
line = 913
path = phd_tests::migrate::from_base::can_migrate_from_base
target = phd_framework::test_vm
vm = migration_from_base
vm_id = 428836e7-b385-422f-b844-7add071b8b1e
|
| 178 | 2026-10-02T23:37:32.547Z | INFO | phd-runner: [WAIT_FOR_SERIAL_OUTPUT - EVENT] Waiting for output on serial console
file = phd-tests/framework/src/test_vm/mod.rs
line = 920
path = phd_tests::migrate::from_base::can_migrate_from_base
target = phd_framework::test_vm
timeout_duration = Explicit(300s)
vm = migration_from_base
vm_id = 428836e7-b385-422f-b844-7add071b8b1e
|
| 179 | 2026-10-02T23:37:32.580Z | INFO | phd-runner: [WAIT_FOR_SERIAL_OUTPUT - END]
elapsed_milliseconds = 33
file = phd-tests/framework/src/test_vm/mod.rs
line = 913
path = phd_tests::migrate::from_base::can_migrate_from_base
target = phd_framework::test_vm
vm = migration_from_base
vm_id = 428836e7-b385-422f-b844-7add071b8b1e
|
| 180 | 2026-10-02T23:37:32.580Z | INFO | phd-runner: [WAIT_FOR_SERIAL_OUTPUT - START]
file = phd-tests/framework/src/test_vm/mod.rs
line = 913
path = phd_tests::migrate::from_base::can_migrate_from_base
target = phd_framework::test_vm
vm = migration_from_base
vm_id = 428836e7-b385-422f-b844-7add071b8b1e
|
| 181 | 2026-10-02T23:37:32.580Z | INFO | phd-runner: [WAIT_FOR_SERIAL_OUTPUT - EVENT] Waiting for output on serial console
file = phd-tests/framework/src/test_vm/mod.rs
line = 920
path = phd_tests::migrate::from_base::can_migrate_from_base
target = phd_framework::test_vm
timeout_duration = Explicit(15s)
vm = migration_from_base
vm_id = 428836e7-b385-422f-b844-7add071b8b1e
|
| 182 | 2026-10-02T23:37:32.591Z | INFO | phd-runner: [WAIT_FOR_SERIAL_OUTPUT - END]
elapsed_milliseconds = 10
file = phd-tests/framework/src/test_vm/mod.rs
line = 913
path = phd_tests::migrate::from_base::can_migrate_from_base
target = phd_framework::test_vm
vm = migration_from_base
vm_id = 428836e7-b385-422f-b844-7add071b8b1e
|
| 183 | 2026-10-02T23:37:32.592Z | INFO | phd-runner: [WAIT_FOR_SERIAL_OUTPUT - START]
file = phd-tests/framework/src/test_vm/mod.rs
line = 913
path = phd_tests::migrate::from_base::can_migrate_from_base
target = phd_framework::test_vm
vm = migration_from_base
vm_id = 428836e7-b385-422f-b844-7add071b8b1e
|
| 184 | 2026-10-02T23:37:32.592Z | INFO | phd-runner: [WAIT_FOR_SERIAL_OUTPUT - EVENT] Waiting for output on serial console
file = phd-tests/framework/src/test_vm/mod.rs
line = 920
path = phd_tests::migrate::from_base::can_migrate_from_base
target = phd_framework::test_vm
timeout_duration = Explicit(300s)
vm = migration_from_base
vm_id = 428836e7-b385-422f-b844-7add071b8b1e
|
| 185 | 2026-10-02T23:37:32.624Z | INFO | phd-runner: [WAIT_FOR_SERIAL_OUTPUT - END]
elapsed_milliseconds = 32
file = phd-tests/framework/src/test_vm/mod.rs
line = 913
path = phd_tests::migrate::from_base::can_migrate_from_base
target = phd_framework::test_vm
vm = migration_from_base
vm_id = 428836e7-b385-422f-b844-7add071b8b1e
|
| 186 | 2026-10-02T23:37:32.625Z | INFO | phd-runner: [WAIT_FOR_SERIAL_OUTPUT - START]
file = phd-tests/framework/src/test_vm/mod.rs
line = 913
path = phd_tests::migrate::from_base::can_migrate_from_base
target = phd_framework::test_vm
vm = migration_from_base
vm_id = 428836e7-b385-422f-b844-7add071b8b1e
|
| 187 | 2026-10-02T23:37:32.625Z | INFO | phd-runner: [WAIT_FOR_SERIAL_OUTPUT - EVENT] Waiting for output on serial console
file = phd-tests/framework/src/test_vm/mod.rs
line = 920
path = phd_tests::migrate::from_base::can_migrate_from_base
target = phd_framework::test_vm
timeout_duration = Explicit(15s)
vm = migration_from_base
vm_id = 428836e7-b385-422f-b844-7add071b8b1e
|
| 188 | 2026-10-02T23:37:32.635Z | INFO | phd-runner: [WAIT_FOR_SERIAL_OUTPUT - END]
elapsed_milliseconds = 9
file = phd-tests/framework/src/test_vm/mod.rs
line = 913
path = phd_tests::migrate::from_base::can_migrate_from_base
target = phd_framework::test_vm
vm = migration_from_base
vm_id = 428836e7-b385-422f-b844-7add071b8b1e
|
| 189 | 2026-10-02T23:37:32.635Z | INFO | phd-runner: [WAIT_FOR_SERIAL_OUTPUT - START]
file = phd-tests/framework/src/test_vm/mod.rs
line = 913
path = phd_tests::migrate::from_base::can_migrate_from_base
target = phd_framework::test_vm
vm = migration_from_base
vm_id = 428836e7-b385-422f-b844-7add071b8b1e
|
| 190 | 2026-10-02T23:37:32.635Z | INFO | phd-runner: [WAIT_FOR_SERIAL_OUTPUT - EVENT] Waiting for output on serial console
file = phd-tests/framework/src/test_vm/mod.rs
line = 920
path = phd_tests::migrate::from_base::can_migrate_from_base
target = phd_framework::test_vm
timeout_duration = Explicit(300s)
vm = migration_from_base
vm_id = 428836e7-b385-422f-b844-7add071b8b1e
|
| 191 | 2026-10-02T23:37:32.668Z | INFO | phd-runner: [WAIT_FOR_SERIAL_OUTPUT - END]
elapsed_milliseconds = 33
file = phd-tests/framework/src/test_vm/mod.rs
line = 913
path = phd_tests::migrate::from_base::can_migrate_from_base
target = phd_framework::test_vm
vm = migration_from_base
vm_id = 428836e7-b385-422f-b844-7add071b8b1e
|
| 192 | 2026-10-02T23:37:32.669Z | INFO | phd-runner: [TEST - EVENT] migrating to new Propolis artifact for lifecycle test
file = phd-tests/framework/src/lifecycle.rs
line = 73
path = phd_tests::migrate::from_base::can_migrate_from_base
propolis_artifact = __DEFAULT_PROPOLIS
target = phd_framework::lifecycle
vm_name = migration_from_base
|
| 193 | 2026-10-02T23:37:32.669Z | INFO | phd-runner: [NEW - START]
file = phd-tests/framework/src/test_vm/mod.rs
line = 300
path = phd_tests::migrate::from_base::can_migrate_from_base
target = phd_framework::test_vm
|
| 194 | 2026-10-02T23:37:32.669Z | INFO | phd-runner: [NEW - EVENT] phd_framework::test_vm
environment = EnvironmentSpec { location: Local, propolis_artifact: "__DEFAULT_PROPOLIS", metrics: None }
file = phd-tests/framework/src/test_vm/mod.rs
guest_os_kind = Alpine
line = 318
path = phd_tests::migrate::from_base::can_migrate_from_base
target = phd_framework::test_vm
vm_name = migration_from_base_lifecycle_0
|
| 195 | 2026-10-02T23:37:32.669Z | DEBG | phd-runner: [NEW - EVENT] Verified artifact already exists
file = phd-tests/framework/src/artifacts/store.rs
line = 45
path = /work/phd-test/propolis-server
target = phd_framework::artifacts::store
|
| 196 | 2026-10-02T23:37:32.669Z | INFO | phd-runner: [NEW - EVENT] Launching Propolis server
bootrom_path = "/phd-artifacts/740187046a7267d0de72d3455070333547dbc0ea023531471fb2b2a61effa448/OVMF_CODE.fd"
file = phd-tests/framework/src/test_vm/server.rs
line = 66
path = phd_tests::migrate::from_base::can_migrate_from_base
server_addr = 127.0.0.1:9002
server_path = "/work/phd-test/propolis-server"
target = phd_framework::test_vm::server
|
| 197 | 2026-10-02T23:37:32.669Z | INFO | phd-runner: [NEW - EVENT] Opening server log files
file = phd-tests/framework/src/log_config.rs
line = 84
path = phd_tests::migrate::from_base::can_migrate_from_base
stderr_path = "/tmp/propolis-phd/phd_tests::migrate::from_base::can_migrate_from_base/migration_from_base_lifecycle_0.stderr.log"
stdout_path = "/tmp/propolis-phd/phd_tests::migrate::from_base::can_migrate_from_base/migration_from_base_lifecycle_0.stdout.log"
target = phd_framework::log_config
|
| 198 | 2026-10-02T23:37:32.709Z | INFO | phd-runner: [NEW - EVENT] Launched server with pid 928
file = phd-tests/framework/src/test_vm/server.rs
line = 127
path = phd_tests::migrate::from_base::can_migrate_from_base
target = phd_framework::test_vm::server
|
| 199 | 2026-10-02T23:37:32.723Z | INFO | phd-runner: [NEW - END]
elapsed_milliseconds = 54
file = phd-tests/framework/src/test_vm/mod.rs
line = 300
path = phd_tests::migrate::from_base::can_migrate_from_base
target = phd_framework::test_vm
|
| 200 | 2026-10-02T23:37:32.723Z | INFO | phd-runner: [MIGRATE_FROM - START]
file = phd-tests/framework/src/test_vm/mod.rs
line = 609
path = phd_tests::migrate::from_base::can_migrate_from_base
source = migration_from_base
source_id = 428836e7-b385-422f-b844-7add071b8b1e
target = phd_framework::test_vm
target_id = 7d6f72f5-c2ed-42a5-ba75-7db69e9231db
|
| 201 | 2026-10-02T23:37:32.723Z | INFO | phd-runner: [MIGRATE_FROM - EVENT] Migrating from source at address 127.0.0.1:9000
file = phd-tests/framework/src/test_vm/mod.rs
line = 642
migration_id = ee3544c1-d163-41ae-a81a-a809be879b16
path = phd_tests::migrate::from_base::can_migrate_from_base
source = migration_from_base
source_id = 428836e7-b385-422f-b844-7add071b8b1e
target = phd_framework::test_vm
target_id = 7d6f72f5-c2ed-42a5-ba75-7db69e9231db
timeout_duration = 45s
|
| 202 | 2026-10-02T23:37:32.723Z | INFO | phd-runner: [INSTANCE_ENSURE_INTERNAL - START]
file = phd-tests/framework/src/test_vm/mod.rs
line = 412
path = phd_tests::migrate::from_base::can_migrate_from_base
source = migration_from_base
source_id = 428836e7-b385-422f-b844-7add071b8b1e
target = phd_framework::test_vm
target_id = 7d6f72f5-c2ed-42a5-ba75-7db69e9231db
vm = migration_from_base_lifecycle_0
vm_id = 7d6f72f5-c2ed-42a5-ba75-7db69e9231db
|
| 203 | 2026-10-02T23:37:32.724Z | INFO | phd-runner: [INSTANCE_ENSURE_INTERNAL - EVENT] retriable error from instance_spec_ensure
e = Communication Error: error sending request for url (http://127.0.0.1:9002/instance)
file = phd-tests/framework/src/test_vm/mod.rs
line = 455
path = phd_tests::migrate::from_base::can_migrate_from_base
source = migration_from_base
source_id = 428836e7-b385-422f-b844-7add071b8b1e
target = phd_framework::test_vm
target_id = 7d6f72f5-c2ed-42a5-ba75-7db69e9231db
vm = migration_from_base_lifecycle_0
vm_id = 7d6f72f5-c2ed-42a5-ba75-7db69e9231db
|
| 204 | 2026-10-02T23:37:33.487Z | INFO | phd-runner: [INSTANCE_ENSURE_INTERNAL - EVENT] Started instance
file = phd-tests/framework/src/test_vm/mod.rs
instance_description.instance = Instance { properties: InstanceProperties { id: 7d6f72f5-c2ed-42a5-ba75-7db69e9231db, name: "phd-vm-7d6f72f5-c2ed-42a5-ba75-7db69e9231db", description: "Pheidippides-managed VM", metadata: InstanceMetadata { silo_id: 8e2454c3-05fb-425c-92ef-0202b4cb13e2, project_id: 5d4e4843-aebc-4d7c-a1c6-52cbacd8db5a, sled_id: d134782f-ddbf-49e9-9771-1d6c7165cfed, sled_serial: "d134782f-ddbf-49e9-9771-1d6c7165cfed", sled_revision: 1, sled_model: "pheidippes" } }, state: Migrating }
line = 514
path = phd_tests::migrate::from_base::can_migrate_from_base
source = migration_from_base
source_id = 428836e7-b385-422f-b844-7add071b8b1e
target = phd_framework::test_vm
target_id = 7d6f72f5-c2ed-42a5-ba75-7db69e9231db
vm = migration_from_base_lifecycle_0
vm_id = 7d6f72f5-c2ed-42a5-ba75-7db69e9231db
|
| 205 | 2026-10-02T23:37:33.488Z | INFO | phd-runner: [MIGRATE - START]
file = phd-tests/framework/src/test_vm/mod.rs
line = 663
migration_id = ee3544c1-d163-41ae-a81a-a809be879b16
path = phd_tests::migrate::from_base::can_migrate_from_base
source = migration_from_base
source_id = 428836e7-b385-422f-b844-7add071b8b1e
target = phd_framework::test_vm
target_id = 7d6f72f5-c2ed-42a5-ba75-7db69e9231db
|
| 206 | 2026-10-02T23:37:35.982Z | INFO | phd-runner: [SERIAL CONSOLE TASK - EVENT] serial socket control message
file = phd-tests/framework/src/serial/mod.rs
line = 275
s = {"Migrating":{"destination":"127.0.0.1:9002","from_start":7847}}
target = phd_framework::serial
|
| 207 | 2026-10-02T23:37:36.981Z | INFO | phd-runner: [MIGRATE_FROM - EVENT] Migration completed successfully
file = phd-tests/framework/src/test_vm/mod.rs
line = 676
path = phd_tests::migrate::from_base::can_migrate_from_base
source = migration_from_base
source_id = 428836e7-b385-422f-b844-7add071b8b1e
target = phd_framework::test_vm
target_id = 7d6f72f5-c2ed-42a5-ba75-7db69e9231db
|
| 208 | 2026-10-02T23:37:36.981Z | INFO | phd-runner: [MIGRATE - END]
elapsed_milliseconds = 3492
file = phd-tests/framework/src/test_vm/mod.rs
line = 663
migration_id = ee3544c1-d163-41ae-a81a-a809be879b16
path = phd_tests::migrate::from_base::can_migrate_from_base
source = migration_from_base
source_id = 428836e7-b385-422f-b844-7add071b8b1e
target = phd_framework::test_vm
target_id = 7d6f72f5-c2ed-42a5-ba75-7db69e9231db
|
| 209 | 2026-10-02T23:37:36.983Z | INFO | phd-runner: [VM CLEANUP - START]
file = phd-tests/framework/src/test_vm/mod.rs
line = 1172
path = phd_tests::migrate::from_base::can_migrate_from_base
target = phd_framework::test_vm
vm = migration_from_base
vm_id = 428836e7-b385-422f-b844-7add071b8b1e
|
| 210 | 2026-10-02T23:37:36.983Z | INFO | phd-runner: [WAIT_FOR_SERIAL_OUTPUT - START]
file = phd-tests/framework/src/test_vm/mod.rs
line = 913
path = phd_tests::migrate::from_base::can_migrate_from_base
target = phd_framework::test_vm
vm = migration_from_base_lifecycle_0
vm_id = 7d6f72f5-c2ed-42a5-ba75-7db69e9231db
|
| 211 | 2026-10-02T23:37:36.983Z | INFO | phd-runner: [WAIT_FOR_SERIAL_OUTPUT - EVENT] Waiting for output on serial console
file = phd-tests/framework/src/test_vm/mod.rs
line = 920
path = phd_tests::migrate::from_base::can_migrate_from_base
target = phd_framework::test_vm
timeout_duration = Explicit(15s)
vm = migration_from_base_lifecycle_0
vm_id = 7d6f72f5-c2ed-42a5-ba75-7db69e9231db
|
| 212 | 2026-10-02T23:37:36.985Z | DEBG | phd-runner: [VM CLEANUP - EVENT] Killing Propolis server process
file = phd-tests/framework/src/test_vm/server.rs
line = 177
path = phd_tests::migrate::from_base::can_migrate_from_base
self.address = 127.0.0.1:9000
target = phd_framework::test_vm::server
vm = migration_from_base
vm_id = 428836e7-b385-422f-b844-7add071b8b1e
|
| 213 | 2026-10-02T23:37:37.063Z | INFO | phd-runner: [VM CLEANUP - END]
elapsed_milliseconds = 79
file = phd-tests/framework/src/test_vm/mod.rs
line = 1172
path = phd_tests::migrate::from_base::can_migrate_from_base
target = phd_framework::test_vm
vm = migration_from_base
vm_id = 428836e7-b385-422f-b844-7add071b8b1e
|
| 214 | 2026-10-02T23:37:37.063Z | INFO | phd-runner: [INSTANCE_ENSURE_INTERNAL - END]
elapsed_milliseconds = 9830
file = phd-tests/framework/src/test_vm/mod.rs
line = 412
path = phd_tests::migrate::from_base::can_migrate_from_base
target = phd_framework::test_vm
vm = migration_from_base
vm_id = 428836e7-b385-422f-b844-7add071b8b1e
|
| 215 | 2026-10-02T23:37:37.063Z | INFO | phd-runner: [WAIT_FOR_SERIAL_OUTPUT - END]
elapsed_milliseconds = 79
file = phd-tests/framework/src/test_vm/mod.rs
line = 913
path = phd_tests::migrate::from_base::can_migrate_from_base
target = phd_framework::test_vm
vm = migration_from_base_lifecycle_0
vm_id = 7d6f72f5-c2ed-42a5-ba75-7db69e9231db
|
| 216 | 2026-10-02T23:37:37.063Z | INFO | phd-runner: [WAIT_FOR_SERIAL_OUTPUT - START]
file = phd-tests/framework/src/test_vm/mod.rs
line = 913
path = phd_tests::migrate::from_base::can_migrate_from_base
target = phd_framework::test_vm
vm = migration_from_base_lifecycle_0
vm_id = 7d6f72f5-c2ed-42a5-ba75-7db69e9231db
|
| 217 | 2026-10-02T23:37:37.063Z | INFO | phd-runner: [WAIT_FOR_SERIAL_OUTPUT - EVENT] Waiting for output on serial console
file = phd-tests/framework/src/test_vm/mod.rs
line = 920
path = phd_tests::migrate::from_base::can_migrate_from_base
target = phd_framework::test_vm
timeout_duration = Explicit(300s)
vm = migration_from_base_lifecycle_0
vm_id = 7d6f72f5-c2ed-42a5-ba75-7db69e9231db
|
| 218 | 2026-10-02T23:37:37.095Z | INFO | phd-runner: [WAIT_FOR_SERIAL_OUTPUT - END]
elapsed_milliseconds = 31
file = phd-tests/framework/src/test_vm/mod.rs
line = 913
path = phd_tests::migrate::from_base::can_migrate_from_base
target = phd_framework::test_vm
vm = migration_from_base_lifecycle_0
vm_id = 7d6f72f5-c2ed-42a5-ba75-7db69e9231db
|
| 219 | 2026-10-02T23:37:37.095Z | INFO | phd-runner: [VM CLEANUP - START]
file = phd-tests/framework/src/test_vm/mod.rs
line = 1172
path = phd_tests::migrate::from_base::can_migrate_from_base
target = phd_framework::test_vm
vm = migration_from_base_lifecycle_0
vm_id = 7d6f72f5-c2ed-42a5-ba75-7db69e9231db
|
| 220 | 2026-10-02T23:37:37.095Z | DEBG | phd-runner: [SERIAL CONSOLE TASK - EVENT] serial console command channel was closed
file = phd-tests/framework/src/serial/mod.rs
line = 213
target = phd_framework::serial
|
| 221 | 2026-10-02T23:37:37.095Z | INFO | phd-runner: [SERIAL CONSOLE TASK - END]
elapsed_milliseconds = 9350
file = phd-tests/framework/src/serial/mod.rs
line = 200
target = phd_framework::serial
|
| 222 | 2026-10-02T23:37:37.095Z | INFO | phd-runner: test phd_tests::migrate::from_base::can_migrate_from_base ... ok
file = phd-tests/runner/src/execute.rs
line = 141
target = phd_runner::execute
|
| 223 | 2026-10-02T23:37:37.095Z | INFO | phd-runner: [TEST_CLEANUP - START]
file = phd-tests/runner/src/fixtures.rs
line = 51
target = phd_runner::fixtures
|
| 224 | 2026-10-02T23:37:37.097Z | DEBG | phd-runner: [VM CLEANUP - EVENT] trying to ensure Propolis server VM is destroyed
file = phd-tests/framework/src/test_vm/mod.rs
line = 1195
path = phd_tests::migrate::from_base::can_migrate_from_base
target = phd_framework::test_vm
vm = migration_from_base_lifecycle_0
vm_id = 7d6f72f5-c2ed-42a5-ba75-7db69e9231db
|
| 225 | 2026-10-02T23:37:37.393Z | DEBG | phd-runner: [VM CLEANUP - EVENT] Killing Propolis server process
file = phd-tests/framework/src/test_vm/server.rs
line = 177
path = phd_tests::migrate::from_base::can_migrate_from_base
self.address = 127.0.0.1:9002
target = phd_framework::test_vm::server
vm = migration_from_base_lifecycle_0
vm_id = 7d6f72f5-c2ed-42a5-ba75-7db69e9231db
|
| 226 | 2026-10-02T23:37:37.477Z | DEBG | phd-runner: [VM CLEANUP - EVENT] zfs clone dropped
file = phd-tests/framework/src/zfs.rs
line = 83
path = phd_tests::migrate::from_base::can_migrate_from_base
target = phd_framework::zfs
vm = migration_from_base_lifecycle_0
vm_id = 7d6f72f5-c2ed-42a5-ba75-7db69e9231db
|
| 227 | 2026-10-02T23:37:37.477Z | DEBG | phd-runner: [VM CLEANUP - EVENT] executing ZFS command
args = ["phd-artifacts/phd-clone-0ada50f6-0f48-4c9d-a66e-49fe37f37811"]
file = phd-tests/framework/src/zfs.rs
line = 304
path = phd_tests::migrate::from_base::can_migrate_from_base
target = phd_framework::zfs
verb = destroy
vm = migration_from_base_lifecycle_0
vm_id = 7d6f72f5-c2ed-42a5-ba75-7db69e9231db
|
| 228 | 2026-10-02T23:37:37.503Z | DEBG | phd-runner: [VM CLEANUP - EVENT] zfs snapshot dropped
file = phd-tests/framework/src/zfs.rs
line = 57
path = phd_tests::migrate::from_base::can_migrate_from_base
target = phd_framework::zfs
vm = migration_from_base_lifecycle_0
vm_id = 7d6f72f5-c2ed-42a5-ba75-7db69e9231db
|
| 229 | 2026-10-02T23:37:37.503Z | DEBG | phd-runner: [VM CLEANUP - EVENT] executing ZFS command
args = ["phd-artifacts@phd-b70063f2-f7dc-4188-ae92-29dcb008c63a"]
file = phd-tests/framework/src/zfs.rs
line = 304
path = phd_tests::migrate::from_base::can_migrate_from_base
target = phd_framework::zfs
verb = destroy
vm = migration_from_base_lifecycle_0
vm_id = 7d6f72f5-c2ed-42a5-ba75-7db69e9231db
|
| 230 | 2026-10-02T23:37:37.521Z | INFO | phd-runner: [VM CLEANUP - END]
elapsed_milliseconds = 426
file = phd-tests/framework/src/test_vm/mod.rs
line = 1172
path = phd_tests::migrate::from_base::can_migrate_from_base
target = phd_framework::test_vm
vm = migration_from_base_lifecycle_0
vm_id = 7d6f72f5-c2ed-42a5-ba75-7db69e9231db
|
| 231 | 2026-10-02T23:37:37.522Z | INFO | phd-runner: [INSTANCE_ENSURE_INTERNAL - END]
elapsed_milliseconds = 4798
file = phd-tests/framework/src/test_vm/mod.rs
line = 412
path = phd_tests::migrate::from_base::can_migrate_from_base
source = migration_from_base
source_id = 428836e7-b385-422f-b844-7add071b8b1e
target = phd_framework::test_vm
target_id = 7d6f72f5-c2ed-42a5-ba75-7db69e9231db
vm = migration_from_base_lifecycle_0
vm_id = 7d6f72f5-c2ed-42a5-ba75-7db69e9231db
|
| 232 | 2026-10-02T23:37:37.522Z | INFO | phd-runner: [MIGRATE_FROM - END]
elapsed_milliseconds = 4798
file = phd-tests/framework/src/test_vm/mod.rs
line = 609
path = phd_tests::migrate::from_base::can_migrate_from_base
source = migration_from_base
source_id = 428836e7-b385-422f-b844-7add071b8b1e
target = phd_framework::test_vm
target_id = 7d6f72f5-c2ed-42a5-ba75-7db69e9231db
|
| 233 | 2026-10-02T23:37:37.522Z | INFO | phd-runner: [TEST - END]
elapsed_milliseconds = 10413
file = phd-tests/tests/src/migrate.rs
line = 34
path = phd_tests::migrate::from_base::can_migrate_from_base
target = phd_tests::migrate::from_base
|
| 234 | 2026-10-02T23:37:37.522Z | INFO | phd-runner: [TEST_CLEANUP - END]
elapsed_milliseconds = 426
file = phd-tests/runner/src/fixtures.rs
line = 51
target = phd_runner::fixtures
|
| 235 | 2026-10-02T23:37:37.522Z | INFO | phd-runner: Starting test phd_tests::migrate::from_base::migration_from_base_and_back
file = phd-tests/runner/src/execute.rs
line = 91
target = phd_runner::execute
|
| 236 | 2026-10-02T23:37:37.522Z | INFO | phd-runner: [TEST_SETUP - START]
file = phd-tests/runner/src/fixtures.rs
line = 41
target = phd_runner::fixtures
|
| 237 | 2026-10-02T23:37:37.522Z | INFO | phd-runner: [TEST_SETUP - END]
elapsed_milliseconds = 0
file = phd-tests/runner/src/fixtures.rs
line = 41
target = phd_runner::fixtures
|
| 238 | 2026-10-02T23:37:37.522Z | INFO | phd-runner: [TEST - START]
file = phd-tests/tests/src/migrate.rs
line = 52
path = phd_tests::migrate::from_base::migration_from_base_and_back
target = phd_tests::migrate::from_base
|
| 239 | 2026-10-02T23:37:37.522Z | DEBG | phd-runner: [TEST - EVENT] Verified artifact already exists
file = phd-tests/framework/src/artifacts/store.rs
line = 45
path = /phd-artifacts/740187046a7267d0de72d3455070333547dbc0ea023531471fb2b2a61effa448/OVMF_CODE.fd
target = phd_framework::artifacts::store
|
| 240 | 2026-10-02T23:37:37.522Z | DEBG | phd-runner: [TEST - EVENT] Verified artifact already exists
file = phd-tests/framework/src/artifacts/store.rs
line = 45
path = /phd-artifacts/ba8007f74f9b54fbae3b2520da577831b4834778a498d732f091260c61aa7ca1/alpine.iso
target = phd_framework::artifacts::store
|
| 241 | 2026-10-02T23:37:37.522Z | DEBG | phd-runner: [TEST - EVENT] Verified artifact already exists
file = phd-tests/framework/src/artifacts/store.rs
line = 45
path = /phd-artifacts/ba8007f74f9b54fbae3b2520da577831b4834778a498d732f091260c61aa7ca1/alpine.iso
target = phd_framework::artifacts::store
|
| 242 | 2026-10-02T23:37:37.522Z | DEBG | phd-runner: [TEST - EVENT] executing ZFS command
args = ["/phd-artifacts/ba8007f74f9b54fbae3b2520da577831b4834778a498d732f091260c61aa7ca1/alpine.iso"]
file = phd-tests/framework/src/zfs.rs
line = 304
path = phd_tests::migrate::from_base::migration_from_base_and_back
target = phd_framework::zfs
verb = list
|
| 243 | 2026-10-02T23:37:37.533Z | DEBG | phd-runner: [TEST - EVENT] parsing zfs list output
file = phd-tests/framework/src/zfs.rs
line = 238
path = phd_tests::migrate::from_base::migration_from_base_and_back
stdout = NAME USED AVAIL REFER MOUNTPOINT\nphd-artifacts 1.30G 25.3T 1.30G /phd-artifacts\n
target = phd_framework::zfs
|
| 244 | 2026-10-02T23:37:37.533Z | DEBG | phd-runner: [TEST - EVENT] executing ZFS command
args = ["phd-artifacts@phd-7ebef259-cca3-47d6-a895-5208372c3144"]
file = phd-tests/framework/src/zfs.rs
line = 304
path = phd_tests::migrate::from_base::migration_from_base_and_back
target = phd_framework::zfs
verb = snapshot
|
| 245 | 2026-10-02T23:37:37.550Z | DEBG | phd-runner: [TEST - EVENT] executing ZFS command
args = ["phd-artifacts@phd-7ebef259-cca3-47d6-a895-5208372c3144", "phd-artifacts/phd-clone-007277c0-1dcd-441a-8471-dc96fd923009"]
file = phd-tests/framework/src/zfs.rs
line = 304
path = phd_tests::migrate::from_base::migration_from_base_and_back
target = phd_framework::zfs
verb = clone
|
| 246 | 2026-10-02T23:37:37.567Z | DEBG | phd-runner: [TEST - EVENT] executing ZFS command
args = ["phd-artifacts/phd-clone-007277c0-1dcd-441a-8471-dc96fd923009"]
file = phd-tests/framework/src/zfs.rs
line = 304
path = phd_tests::migrate::from_base::migration_from_base_and_back
target = phd_framework::zfs
verb = list
|
| 247 | 2026-10-02T23:37:37.579Z | DEBG | phd-runner: [TEST - EVENT] parsing zfs list output
file = phd-tests/framework/src/zfs.rs
line = 238
path = phd_tests::migrate::from_base::migration_from_base_and_back
stdout = NAME USED AVAIL REFER MOUNTPOINT\nphd-artifacts/phd-clone-007277c0-1dcd-441a-8471-dc96fd923009 0B 25.3T 1.30G /phd-artifacts/phd-clone-007277c0-1dcd-441a-8471-dc96fd923009\n
target = phd_framework::zfs
|
| 248 | 2026-10-02T23:37:37.580Z | INFO | phd-runner: [NEW - START]
file = phd-tests/framework/src/test_vm/mod.rs
line = 300
path = phd_tests::migrate::from_base::migration_from_base_and_back
target = phd_framework::test_vm
|
| 249 | 2026-10-02T23:37:37.580Z | INFO | phd-runner: [NEW - EVENT] phd_framework::test_vm
environment = EnvironmentSpec { location: Local, propolis_artifact: "__BASE_PROPOLIS", metrics: None }
file = phd-tests/framework/src/test_vm/mod.rs
guest_os_kind = Alpine
line = 318
path = phd_tests::migrate::from_base::migration_from_base_and_back
target = phd_framework::test_vm
vm_name = migration_from_base_and_back
|
| 250 | 2026-10-02T23:37:37.580Z | DEBG | phd-runner: [NEW - EVENT] Verified artifact already exists
file = phd-tests/framework/src/artifacts/store.rs
line = 45
path = /phd-artifacts/c39ee71b9b334e87523f19fd9694492a794ad7a287ed999d3aaee7dc836e0a17/propolis-server
target = phd_framework::artifacts::store
|
| 251 | 2026-10-02T23:37:37.580Z | INFO | phd-runner: [NEW - EVENT] Launching Propolis server
bootrom_path = "/phd-artifacts/740187046a7267d0de72d3455070333547dbc0ea023531471fb2b2a61effa448/OVMF_CODE.fd"
file = phd-tests/framework/src/test_vm/server.rs
line = 66
path = phd_tests::migrate::from_base::migration_from_base_and_back
server_addr = 127.0.0.1:9000
server_path = "/phd-artifacts/c39ee71b9b334e87523f19fd9694492a794ad7a287ed999d3aaee7dc836e0a17/propolis-server"
target = phd_framework::test_vm::server
|
| 252 | 2026-10-02T23:37:37.580Z | INFO | phd-runner: [NEW - EVENT] Opening server log files
file = phd-tests/framework/src/log_config.rs
line = 84
path = phd_tests::migrate::from_base::migration_from_base_and_back
stderr_path = "/tmp/propolis-phd/phd_tests::migrate::from_base::migration_from_base_and_back/migration_from_base_and_back.stderr.log"
stdout_path = "/tmp/propolis-phd/phd_tests::migrate::from_base::migration_from_base_and_back/migration_from_base_and_back.stdout.log"
target = phd_framework::log_config
|
| 253 | 2026-10-02T23:37:37.617Z | INFO | phd-runner: [NEW - EVENT] Launched server with pid 937
file = phd-tests/framework/src/test_vm/server.rs
line = 127
path = phd_tests::migrate::from_base::migration_from_base_and_back
target = phd_framework::test_vm::server
|
| 254 | 2026-10-02T23:37:37.631Z | INFO | phd-runner: [NEW - END]
elapsed_milliseconds = 51
file = phd-tests/framework/src/test_vm/mod.rs
line = 300
path = phd_tests::migrate::from_base::migration_from_base_and_back
target = phd_framework::test_vm
|
| 255 | 2026-10-02T23:37:37.631Z | INFO | phd-runner: [INSTANCE_ENSURE_INTERNAL - START]
file = phd-tests/framework/src/test_vm/mod.rs
line = 412
path = phd_tests::migrate::from_base::migration_from_base_and_back
target = phd_framework::test_vm
vm = migration_from_base_and_back
vm_id = 82b56887-95bb-4390-8b00-a282d3eb2b6b
|
| 256 | 2026-10-02T23:37:37.632Z | INFO | phd-runner: [INSTANCE_ENSURE_INTERNAL - EVENT] retriable error from instance_spec_ensure
e = Communication Error: error sending request for url (http://127.0.0.1:9000/instance)
file = phd-tests/framework/src/test_vm/mod.rs
line = 455
path = phd_tests::migrate::from_base::migration_from_base_and_back
target = phd_framework::test_vm
vm = migration_from_base_and_back
vm_id = 82b56887-95bb-4390-8b00-a282d3eb2b6b
|
| 257 | 2026-10-02T23:37:38.354Z | INFO | phd-runner: [SERIAL CONSOLE TASK - START]
file = phd-tests/framework/src/serial/mod.rs
line = 200
target = phd_framework::serial
|
| 258 | 2026-10-02T23:37:38.355Z | INFO | phd-runner: [INSTANCE_ENSURE_INTERNAL - EVENT] Started instance
file = phd-tests/framework/src/test_vm/mod.rs
instance_description.instance = Instance { properties: InstanceProperties { id: 82b56887-95bb-4390-8b00-a282d3eb2b6b, name: "phd-vm-82b56887-95bb-4390-8b00-a282d3eb2b6b", description: "Pheidippides-managed VM", metadata: InstanceMetadata { silo_id: 96622ddd-a800-449d-afaa-3143ec6e2aba, project_id: e7625039-4930-41b1-80e2-cb7498503058, sled_id: e37b114f-0a8b-4ca7-b7b6-e66d309d99aa, sled_serial: "e37b114f-0a8b-4ca7-b7b6-e66d309d99aa", sled_revision: 1, sled_model: "pheidippes" } }, state: Creating }
line = 514
path = phd_tests::migrate::from_base::migration_from_base_and_back
target = phd_framework::test_vm
vm = migration_from_base_and_back
vm_id = 82b56887-95bb-4390-8b00-a282d3eb2b6b
|
| 259 | 2026-10-02T23:37:38.356Z | INFO | phd-runner: [PUT_INSTANCE_STATE - START]
file = phd-tests/framework/src/test_vm/mod.rs
line = 575
path = phd_tests::migrate::from_base::migration_from_base_and_back
target = phd_framework::test_vm
vm = migration_from_base_and_back
vm_id = 82b56887-95bb-4390-8b00-a282d3eb2b6b
|
| 260 | 2026-10-02T23:37:38.356Z | INFO | phd-runner: [PUT_INSTANCE_STATE - EVENT] Requesting instance state change
file = phd-tests/framework/src/test_vm/mod.rs
line = 580
path = phd_tests::migrate::from_base::migration_from_base_and_back
state = Run
target = phd_framework::test_vm
vm = migration_from_base_and_back
vm_id = 82b56887-95bb-4390-8b00-a282d3eb2b6b
|
| 261 | 2026-10-02T23:37:38.357Z | INFO | phd-runner: [PUT_INSTANCE_STATE - END]
elapsed_milliseconds = 0
file = phd-tests/framework/src/test_vm/mod.rs
line = 575
path = phd_tests::migrate::from_base::migration_from_base_and_back
target = phd_framework::test_vm
vm = migration_from_base_and_back
vm_id = 82b56887-95bb-4390-8b00-a282d3eb2b6b
|
| 262 | 2026-10-02T23:37:38.357Z | INFO | phd-runner: [WAIT_TO_BOOT - START]
file = phd-tests/framework/src/test_vm/mod.rs
line = 890
path = phd_tests::migrate::from_base::migration_from_base_and_back
target = phd_framework::test_vm
|
| 263 | 2026-10-02T23:37:38.357Z | INFO | phd-runner: [WAIT_TO_BOOT - EVENT] waiting for guest to boot
file = phd-tests/framework/src/test_vm/mod.rs
line = 839
path = phd_tests::migrate::from_base::migration_from_base_and_back
target = phd_framework::test_vm
timeout_duration = 300s
vm = migration_from_base_and_back
vm_id = 82b56887-95bb-4390-8b00-a282d3eb2b6b
|
| 264 | 2026-10-02T23:37:38.357Z | DEBG | phd-runner: [WAIT_TO_BOOT - EVENT] executing command in boot sequence
file = phd-tests/framework/src/test_vm/mod.rs
line = 847
path = phd_tests::migrate::from_base::migration_from_base_and_back
step = WaitFor("localhost login: ")
target = phd_framework::test_vm
|
| 265 | 2026-10-02T23:37:38.357Z | INFO | phd-runner: [WAIT_FOR_SERIAL_OUTPUT - START]
file = phd-tests/framework/src/test_vm/mod.rs
line = 913
path = phd_tests::migrate::from_base::migration_from_base_and_back
target = phd_framework::test_vm
vm = migration_from_base_and_back
vm_id = 82b56887-95bb-4390-8b00-a282d3eb2b6b
|
| 266 | 2026-10-02T23:37:38.357Z | INFO | phd-runner: [WAIT_FOR_SERIAL_OUTPUT - EVENT] Waiting for output on serial console
file = phd-tests/framework/src/test_vm/mod.rs
line = 920
path = phd_tests::migrate::from_base::migration_from_base_and_back
target = phd_framework::test_vm
timeout_duration = CallerTimeout
vm = migration_from_base_and_back
vm_id = 82b56887-95bb-4390-8b00-a282d3eb2b6b
|
| 267 | 2026-10-02T23:37:43.028Z | INFO | phd-runner: [WAIT_FOR_SERIAL_OUTPUT - END]
elapsed_milliseconds = 4668
file = phd-tests/framework/src/test_vm/mod.rs
line = 913
path = phd_tests::migrate::from_base::migration_from_base_and_back
target = phd_framework::test_vm
vm = migration_from_base_and_back
vm_id = 82b56887-95bb-4390-8b00-a282d3eb2b6b
|
| 268 | 2026-10-02T23:37:43.028Z | DEBG | phd-runner: [WAIT_TO_BOOT - EVENT] executing command in boot sequence
file = phd-tests/framework/src/test_vm/mod.rs
line = 847
path = phd_tests::migrate::from_base::migration_from_base_and_back
step = WriteStr("root")
target = phd_framework::test_vm
|
| 269 | 2026-10-02T23:37:43.029Z | DEBG | phd-runner: [WAIT_TO_BOOT - EVENT] executing command in boot sequence
file = phd-tests/framework/src/test_vm/mod.rs
line = 847
path = phd_tests::migrate::from_base::migration_from_base_and_back
step = WaitFor("localhost:~#")
target = phd_framework::test_vm
|
| 270 | 2026-10-02T23:37:43.029Z | INFO | phd-runner: [WAIT_FOR_SERIAL_OUTPUT - START]
file = phd-tests/framework/src/test_vm/mod.rs
line = 913
path = phd_tests::migrate::from_base::migration_from_base_and_back
target = phd_framework::test_vm
vm = migration_from_base_and_back
vm_id = 82b56887-95bb-4390-8b00-a282d3eb2b6b
|
| 271 | 2026-10-02T23:37:43.029Z | INFO | phd-runner: [WAIT_FOR_SERIAL_OUTPUT - EVENT] Waiting for output on serial console
file = phd-tests/framework/src/test_vm/mod.rs
line = 920
path = phd_tests::migrate::from_base::migration_from_base_and_back
target = phd_framework::test_vm
timeout_duration = CallerTimeout
vm = migration_from_base_and_back
vm_id = 82b56887-95bb-4390-8b00-a282d3eb2b6b
|
| 272 | 2026-10-02T23:37:43.047Z | INFO | phd-runner: [WAIT_FOR_SERIAL_OUTPUT - END]
elapsed_milliseconds = 18
file = phd-tests/framework/src/test_vm/mod.rs
line = 913
path = phd_tests::migrate::from_base::migration_from_base_and_back
target = phd_framework::test_vm
vm = migration_from_base_and_back
vm_id = 82b56887-95bb-4390-8b00-a282d3eb2b6b
|
| 273 | 2026-10-02T23:37:43.047Z | DEBG | phd-runner: [WAIT_TO_BOOT - EVENT] executing command in boot sequence
file = phd-tests/framework/src/test_vm/mod.rs
line = 847
path = phd_tests::migrate::from_base::migration_from_base_and_back
step = WriteStr("stty -F `tty` cols 9999")
target = phd_framework::test_vm
|
| 274 | 2026-10-02T23:37:43.048Z | DEBG | phd-runner: [WAIT_TO_BOOT - EVENT] executing command in boot sequence
file = phd-tests/framework/src/test_vm/mod.rs
line = 847
path = phd_tests::migrate::from_base::migration_from_base_and_back
step = WaitFor("localhost:~#")
target = phd_framework::test_vm
|
| 275 | 2026-10-02T23:37:43.048Z | INFO | phd-runner: [WAIT_FOR_SERIAL_OUTPUT - START]
file = phd-tests/framework/src/test_vm/mod.rs
line = 913
path = phd_tests::migrate::from_base::migration_from_base_and_back
target = phd_framework::test_vm
vm = migration_from_base_and_back
vm_id = 82b56887-95bb-4390-8b00-a282d3eb2b6b
|
| 276 | 2026-10-02T23:37:43.048Z | INFO | phd-runner: [WAIT_FOR_SERIAL_OUTPUT - EVENT] Waiting for output on serial console
file = phd-tests/framework/src/test_vm/mod.rs
line = 920
path = phd_tests::migrate::from_base::migration_from_base_and_back
target = phd_framework::test_vm
timeout_duration = CallerTimeout
vm = migration_from_base_and_back
vm_id = 82b56887-95bb-4390-8b00-a282d3eb2b6b
|
| 277 | 2026-10-02T23:37:43.080Z | INFO | phd-runner: [WAIT_FOR_SERIAL_OUTPUT - END]
elapsed_milliseconds = 32
file = phd-tests/framework/src/test_vm/mod.rs
line = 913
path = phd_tests::migrate::from_base::migration_from_base_and_back
target = phd_framework::test_vm
vm = migration_from_base_and_back
vm_id = 82b56887-95bb-4390-8b00-a282d3eb2b6b
|
| 278 | 2026-10-02T23:37:43.080Z | INFO | phd-runner: [WAIT_TO_BOOT - EVENT] Guest has booted
file = phd-tests/framework/src/test_vm/mod.rs
line = 887
path = phd_tests::migrate::from_base::migration_from_base_and_back
target = phd_framework::test_vm
|
| 279 | 2026-10-02T23:37:43.080Z | INFO | phd-runner: [WAIT_TO_BOOT - END]
elapsed_milliseconds = 4720
file = phd-tests/framework/src/test_vm/mod.rs
line = 890
path = phd_tests::migrate::from_base::migration_from_base_and_back
target = phd_framework::test_vm
|
| 280 | 2026-10-02T23:37:43.080Z | INFO | phd-runner: [WAIT_FOR_SERIAL_OUTPUT - START]
file = phd-tests/framework/src/test_vm/mod.rs
line = 913
path = phd_tests::migrate::from_base::migration_from_base_and_back
target = phd_framework::test_vm
vm = migration_from_base_and_back
vm_id = 82b56887-95bb-4390-8b00-a282d3eb2b6b
|
| 281 | 2026-10-02T23:37:43.080Z | INFO | phd-runner: [WAIT_FOR_SERIAL_OUTPUT - EVENT] Waiting for output on serial console
file = phd-tests/framework/src/test_vm/mod.rs
line = 920
path = phd_tests::migrate::from_base::migration_from_base_and_back
target = phd_framework::test_vm
timeout_duration = Explicit(15s)
vm = migration_from_base_and_back
vm_id = 82b56887-95bb-4390-8b00-a282d3eb2b6b
|
| 282 | 2026-10-02T23:37:43.092Z | INFO | phd-runner: [WAIT_FOR_SERIAL_OUTPUT - END]
elapsed_milliseconds = 11
file = phd-tests/framework/src/test_vm/mod.rs
line = 913
path = phd_tests::migrate::from_base::migration_from_base_and_back
target = phd_framework::test_vm
vm = migration_from_base_and_back
vm_id = 82b56887-95bb-4390-8b00-a282d3eb2b6b
|
| 283 | 2026-10-02T23:37:43.092Z | INFO | phd-runner: [WAIT_FOR_SERIAL_OUTPUT - START]
file = phd-tests/framework/src/test_vm/mod.rs
line = 913
path = phd_tests::migrate::from_base::migration_from_base_and_back
target = phd_framework::test_vm
vm = migration_from_base_and_back
vm_id = 82b56887-95bb-4390-8b00-a282d3eb2b6b
|
| 284 | 2026-10-02T23:37:43.092Z | INFO | phd-runner: [WAIT_FOR_SERIAL_OUTPUT - EVENT] Waiting for output on serial console
file = phd-tests/framework/src/test_vm/mod.rs
line = 920
path = phd_tests::migrate::from_base::migration_from_base_and_back
target = phd_framework::test_vm
timeout_duration = Explicit(300s)
vm = migration_from_base_and_back
vm_id = 82b56887-95bb-4390-8b00-a282d3eb2b6b
|
| 285 | 2026-10-02T23:37:43.124Z | INFO | phd-runner: [WAIT_FOR_SERIAL_OUTPUT - END]
elapsed_milliseconds = 31
file = phd-tests/framework/src/test_vm/mod.rs
line = 913
path = phd_tests::migrate::from_base::migration_from_base_and_back
target = phd_framework::test_vm
vm = migration_from_base_and_back
vm_id = 82b56887-95bb-4390-8b00-a282d3eb2b6b
|
| 286 | 2026-10-02T23:37:43.124Z | INFO | phd-runner: [WAIT_FOR_SERIAL_OUTPUT - START]
file = phd-tests/framework/src/test_vm/mod.rs
line = 913
path = phd_tests::migrate::from_base::migration_from_base_and_back
target = phd_framework::test_vm
vm = migration_from_base_and_back
vm_id = 82b56887-95bb-4390-8b00-a282d3eb2b6b
|
| 287 | 2026-10-02T23:37:43.124Z | INFO | phd-runner: [WAIT_FOR_SERIAL_OUTPUT - EVENT] Waiting for output on serial console
file = phd-tests/framework/src/test_vm/mod.rs
line = 920
path = phd_tests::migrate::from_base::migration_from_base_and_back
target = phd_framework::test_vm
timeout_duration = Explicit(15s)
vm = migration_from_base_and_back
vm_id = 82b56887-95bb-4390-8b00-a282d3eb2b6b
|
| 288 | 2026-10-02T23:37:43.136Z | INFO | phd-runner: [WAIT_FOR_SERIAL_OUTPUT - END]
elapsed_milliseconds = 11
file = phd-tests/framework/src/test_vm/mod.rs
line = 913
path = phd_tests::migrate::from_base::migration_from_base_and_back
target = phd_framework::test_vm
vm = migration_from_base_and_back
vm_id = 82b56887-95bb-4390-8b00-a282d3eb2b6b
|
| 289 | 2026-10-02T23:37:43.136Z | INFO | phd-runner: [WAIT_FOR_SERIAL_OUTPUT - START]
file = phd-tests/framework/src/test_vm/mod.rs
line = 913
path = phd_tests::migrate::from_base::migration_from_base_and_back
target = phd_framework::test_vm
vm = migration_from_base_and_back
vm_id = 82b56887-95bb-4390-8b00-a282d3eb2b6b
|
| 290 | 2026-10-02T23:37:43.136Z | INFO | phd-runner: [WAIT_FOR_SERIAL_OUTPUT - EVENT] Waiting for output on serial console
file = phd-tests/framework/src/test_vm/mod.rs
line = 920
path = phd_tests::migrate::from_base::migration_from_base_and_back
target = phd_framework::test_vm
timeout_duration = Explicit(300s)
vm = migration_from_base_and_back
vm_id = 82b56887-95bb-4390-8b00-a282d3eb2b6b
|
| 291 | 2026-10-02T23:37:43.168Z | INFO | phd-runner: [WAIT_FOR_SERIAL_OUTPUT - END]
elapsed_milliseconds = 31
file = phd-tests/framework/src/test_vm/mod.rs
line = 913
path = phd_tests::migrate::from_base::migration_from_base_and_back
target = phd_framework::test_vm
vm = migration_from_base_and_back
vm_id = 82b56887-95bb-4390-8b00-a282d3eb2b6b
|
| 292 | 2026-10-02T23:37:43.168Z | INFO | phd-runner: [WAIT_FOR_SERIAL_OUTPUT - START]
file = phd-tests/framework/src/test_vm/mod.rs
line = 913
path = phd_tests::migrate::from_base::migration_from_base_and_back
target = phd_framework::test_vm
vm = migration_from_base_and_back
vm_id = 82b56887-95bb-4390-8b00-a282d3eb2b6b
|
| 293 | 2026-10-02T23:37:43.168Z | INFO | phd-runner: [WAIT_FOR_SERIAL_OUTPUT - EVENT] Waiting for output on serial console
file = phd-tests/framework/src/test_vm/mod.rs
line = 920
path = phd_tests::migrate::from_base::migration_from_base_and_back
target = phd_framework::test_vm
timeout_duration = Explicit(15s)
vm = migration_from_base_and_back
vm_id = 82b56887-95bb-4390-8b00-a282d3eb2b6b
|
| 294 | 2026-10-02T23:37:43.179Z | INFO | phd-runner: [WAIT_FOR_SERIAL_OUTPUT - END]
elapsed_milliseconds = 10
file = phd-tests/framework/src/test_vm/mod.rs
line = 913
path = phd_tests::migrate::from_base::migration_from_base_and_back
target = phd_framework::test_vm
vm = migration_from_base_and_back
vm_id = 82b56887-95bb-4390-8b00-a282d3eb2b6b
|
| 295 | 2026-10-02T23:37:43.179Z | INFO | phd-runner: [WAIT_FOR_SERIAL_OUTPUT - START]
file = phd-tests/framework/src/test_vm/mod.rs
line = 913
path = phd_tests::migrate::from_base::migration_from_base_and_back
target = phd_framework::test_vm
vm = migration_from_base_and_back
vm_id = 82b56887-95bb-4390-8b00-a282d3eb2b6b
|
| 296 | 2026-10-02T23:37:43.179Z | INFO | phd-runner: [WAIT_FOR_SERIAL_OUTPUT - EVENT] Waiting for output on serial console
file = phd-tests/framework/src/test_vm/mod.rs
line = 920
path = phd_tests::migrate::from_base::migration_from_base_and_back
target = phd_framework::test_vm
timeout_duration = Explicit(300s)
vm = migration_from_base_and_back
vm_id = 82b56887-95bb-4390-8b00-a282d3eb2b6b
|
| 297 | 2026-10-02T23:37:43.212Z | INFO | phd-runner: [WAIT_FOR_SERIAL_OUTPUT - END]
elapsed_milliseconds = 32
file = phd-tests/framework/src/test_vm/mod.rs
line = 913
path = phd_tests::migrate::from_base::migration_from_base_and_back
target = phd_framework::test_vm
vm = migration_from_base_and_back
vm_id = 82b56887-95bb-4390-8b00-a282d3eb2b6b
|
| 298 | 2026-10-02T23:37:43.212Z | INFO | phd-runner: [WAIT_FOR_SERIAL_OUTPUT - START]
file = phd-tests/framework/src/test_vm/mod.rs
line = 913
path = phd_tests::migrate::from_base::migration_from_base_and_back
target = phd_framework::test_vm
vm = migration_from_base_and_back
vm_id = 82b56887-95bb-4390-8b00-a282d3eb2b6b
|
| 299 | 2026-10-02T23:37:43.212Z | INFO | phd-runner: [WAIT_FOR_SERIAL_OUTPUT - EVENT] Waiting for output on serial console
file = phd-tests/framework/src/test_vm/mod.rs
line = 920
path = phd_tests::migrate::from_base::migration_from_base_and_back
target = phd_framework::test_vm
timeout_duration = Explicit(15s)
vm = migration_from_base_and_back
vm_id = 82b56887-95bb-4390-8b00-a282d3eb2b6b
|
| 300 | 2026-10-02T23:37:43.223Z | INFO | phd-runner: [WAIT_FOR_SERIAL_OUTPUT - END]
elapsed_milliseconds = 10
file = phd-tests/framework/src/test_vm/mod.rs
line = 913
path = phd_tests::migrate::from_base::migration_from_base_and_back
target = phd_framework::test_vm
vm = migration_from_base_and_back
vm_id = 82b56887-95bb-4390-8b00-a282d3eb2b6b
|
| 301 | 2026-10-02T23:37:43.223Z | INFO | phd-runner: [WAIT_FOR_SERIAL_OUTPUT - START]
file = phd-tests/framework/src/test_vm/mod.rs
line = 913
path = phd_tests::migrate::from_base::migration_from_base_and_back
target = phd_framework::test_vm
vm = migration_from_base_and_back
vm_id = 82b56887-95bb-4390-8b00-a282d3eb2b6b
|
| 302 | 2026-10-02T23:37:43.223Z | INFO | phd-runner: [WAIT_FOR_SERIAL_OUTPUT - EVENT] Waiting for output on serial console
file = phd-tests/framework/src/test_vm/mod.rs
line = 920
path = phd_tests::migrate::from_base::migration_from_base_and_back
target = phd_framework::test_vm
timeout_duration = Explicit(300s)
vm = migration_from_base_and_back
vm_id = 82b56887-95bb-4390-8b00-a282d3eb2b6b
|
| 303 | 2026-10-02T23:37:43.256Z | INFO | phd-runner: [WAIT_FOR_SERIAL_OUTPUT - END]
elapsed_milliseconds = 33
file = phd-tests/framework/src/test_vm/mod.rs
line = 913
path = phd_tests::migrate::from_base::migration_from_base_and_back
target = phd_framework::test_vm
vm = migration_from_base_and_back
vm_id = 82b56887-95bb-4390-8b00-a282d3eb2b6b
|
| 304 | 2026-10-02T23:37:43.257Z | INFO | phd-runner: [WAIT_FOR_SERIAL_OUTPUT - START]
file = phd-tests/framework/src/test_vm/mod.rs
line = 913
path = phd_tests::migrate::from_base::migration_from_base_and_back
target = phd_framework::test_vm
vm = migration_from_base_and_back
vm_id = 82b56887-95bb-4390-8b00-a282d3eb2b6b
|
| 305 | 2026-10-02T23:37:43.257Z | INFO | phd-runner: [WAIT_FOR_SERIAL_OUTPUT - EVENT] Waiting for output on serial console
file = phd-tests/framework/src/test_vm/mod.rs
line = 920
path = phd_tests::migrate::from_base::migration_from_base_and_back
target = phd_framework::test_vm
timeout_duration = Explicit(15s)
vm = migration_from_base_and_back
vm_id = 82b56887-95bb-4390-8b00-a282d3eb2b6b
|
| 306 | 2026-10-02T23:37:43.267Z | INFO | phd-runner: [WAIT_FOR_SERIAL_OUTPUT - END]
elapsed_milliseconds = 10
file = phd-tests/framework/src/test_vm/mod.rs
line = 913
path = phd_tests::migrate::from_base::migration_from_base_and_back
target = phd_framework::test_vm
vm = migration_from_base_and_back
vm_id = 82b56887-95bb-4390-8b00-a282d3eb2b6b
|
| 307 | 2026-10-02T23:37:43.267Z | INFO | phd-runner: [WAIT_FOR_SERIAL_OUTPUT - START]
file = phd-tests/framework/src/test_vm/mod.rs
line = 913
path = phd_tests::migrate::from_base::migration_from_base_and_back
target = phd_framework::test_vm
vm = migration_from_base_and_back
vm_id = 82b56887-95bb-4390-8b00-a282d3eb2b6b
|
| 308 | 2026-10-02T23:37:43.268Z | INFO | phd-runner: [WAIT_FOR_SERIAL_OUTPUT - EVENT] Waiting for output on serial console
file = phd-tests/framework/src/test_vm/mod.rs
line = 920
path = phd_tests::migrate::from_base::migration_from_base_and_back
target = phd_framework::test_vm
timeout_duration = Explicit(300s)
vm = migration_from_base_and_back
vm_id = 82b56887-95bb-4390-8b00-a282d3eb2b6b
|
| 309 | 2026-10-02T23:37:43.301Z | INFO | phd-runner: [WAIT_FOR_SERIAL_OUTPUT - END]
elapsed_milliseconds = 33
file = phd-tests/framework/src/test_vm/mod.rs
line = 913
path = phd_tests::migrate::from_base::migration_from_base_and_back
target = phd_framework::test_vm
vm = migration_from_base_and_back
vm_id = 82b56887-95bb-4390-8b00-a282d3eb2b6b
|
| 310 | 2026-10-02T23:37:43.301Z | INFO | phd-runner: [WAIT_FOR_SERIAL_OUTPUT - START]
file = phd-tests/framework/src/test_vm/mod.rs
line = 913
path = phd_tests::migrate::from_base::migration_from_base_and_back
target = phd_framework::test_vm
vm = migration_from_base_and_back
vm_id = 82b56887-95bb-4390-8b00-a282d3eb2b6b
|
| 311 | 2026-10-02T23:37:43.301Z | INFO | phd-runner: [WAIT_FOR_SERIAL_OUTPUT - EVENT] Waiting for output on serial console
file = phd-tests/framework/src/test_vm/mod.rs
line = 920
path = phd_tests::migrate::from_base::migration_from_base_and_back
target = phd_framework::test_vm
timeout_duration = Explicit(15s)
vm = migration_from_base_and_back
vm_id = 82b56887-95bb-4390-8b00-a282d3eb2b6b
|
| 312 | 2026-10-02T23:37:43.311Z | INFO | phd-runner: [WAIT_FOR_SERIAL_OUTPUT - END]
elapsed_milliseconds = 10
file = phd-tests/framework/src/test_vm/mod.rs
line = 913
path = phd_tests::migrate::from_base::migration_from_base_and_back
target = phd_framework::test_vm
vm = migration_from_base_and_back
vm_id = 82b56887-95bb-4390-8b00-a282d3eb2b6b
|
| 313 | 2026-10-02T23:37:43.311Z | INFO | phd-runner: [WAIT_FOR_SERIAL_OUTPUT - START]
file = phd-tests/framework/src/test_vm/mod.rs
line = 913
path = phd_tests::migrate::from_base::migration_from_base_and_back
target = phd_framework::test_vm
vm = migration_from_base_and_back
vm_id = 82b56887-95bb-4390-8b00-a282d3eb2b6b
|
| 314 | 2026-10-02T23:37:43.311Z | INFO | phd-runner: [WAIT_FOR_SERIAL_OUTPUT - EVENT] Waiting for output on serial console
file = phd-tests/framework/src/test_vm/mod.rs
line = 920
path = phd_tests::migrate::from_base::migration_from_base_and_back
target = phd_framework::test_vm
timeout_duration = Explicit(300s)
vm = migration_from_base_and_back
vm_id = 82b56887-95bb-4390-8b00-a282d3eb2b6b
|
| 315 | 2026-10-02T23:37:43.344Z | INFO | phd-runner: [WAIT_FOR_SERIAL_OUTPUT - END]
elapsed_milliseconds = 32
file = phd-tests/framework/src/test_vm/mod.rs
line = 913
path = phd_tests::migrate::from_base::migration_from_base_and_back
target = phd_framework::test_vm
vm = migration_from_base_and_back
vm_id = 82b56887-95bb-4390-8b00-a282d3eb2b6b
|
| 316 | 2026-10-02T23:37:43.344Z | INFO | phd-runner: [TEST - EVENT] migrating to new Propolis artifact for lifecycle test
file = phd-tests/framework/src/lifecycle.rs
line = 73
path = phd_tests::migrate::from_base::migration_from_base_and_back
propolis_artifact = __DEFAULT_PROPOLIS
target = phd_framework::lifecycle
vm_name = migration_from_base_and_back
|
| 317 | 2026-10-02T23:37:43.344Z | INFO | phd-runner: [NEW - START]
file = phd-tests/framework/src/test_vm/mod.rs
line = 300
path = phd_tests::migrate::from_base::migration_from_base_and_back
target = phd_framework::test_vm
|
| 318 | 2026-10-02T23:37:43.344Z | INFO | phd-runner: [NEW - EVENT] phd_framework::test_vm
environment = EnvironmentSpec { location: Local, propolis_artifact: "__DEFAULT_PROPOLIS", metrics: None }
file = phd-tests/framework/src/test_vm/mod.rs
guest_os_kind = Alpine
line = 318
path = phd_tests::migrate::from_base::migration_from_base_and_back
target = phd_framework::test_vm
vm_name = migration_from_base_and_back_lifecycle_0
|
| 319 | 2026-10-02T23:37:43.344Z | DEBG | phd-runner: [NEW - EVENT] Verified artifact already exists
file = phd-tests/framework/src/artifacts/store.rs
line = 45
path = /work/phd-test/propolis-server
target = phd_framework::artifacts::store
|
| 320 | 2026-10-02T23:37:43.345Z | INFO | phd-runner: [NEW - EVENT] Launching Propolis server
bootrom_path = "/phd-artifacts/740187046a7267d0de72d3455070333547dbc0ea023531471fb2b2a61effa448/OVMF_CODE.fd"
file = phd-tests/framework/src/test_vm/server.rs
line = 66
path = phd_tests::migrate::from_base::migration_from_base_and_back
server_addr = 127.0.0.1:9002
server_path = "/work/phd-test/propolis-server"
target = phd_framework::test_vm::server
|
| 321 | 2026-10-02T23:37:43.345Z | INFO | phd-runner: [NEW - EVENT] Opening server log files
file = phd-tests/framework/src/log_config.rs
line = 84
path = phd_tests::migrate::from_base::migration_from_base_and_back
stderr_path = "/tmp/propolis-phd/phd_tests::migrate::from_base::migration_from_base_and_back/migration_from_base_and_back_lifecycle_0.stderr.log"
stdout_path = "/tmp/propolis-phd/phd_tests::migrate::from_base::migration_from_base_and_back/migration_from_base_and_back_lifecycle_0.stdout.log"
target = phd_framework::log_config
|
| 322 | 2026-10-02T23:37:43.383Z | INFO | phd-runner: [NEW - EVENT] Launched server with pid 938
file = phd-tests/framework/src/test_vm/server.rs
line = 127
path = phd_tests::migrate::from_base::migration_from_base_and_back
target = phd_framework::test_vm::server
|
| 323 | 2026-10-02T23:37:43.397Z | INFO | phd-runner: [NEW - END]
elapsed_milliseconds = 52
file = phd-tests/framework/src/test_vm/mod.rs
line = 300
path = phd_tests::migrate::from_base::migration_from_base_and_back
target = phd_framework::test_vm
|
| 324 | 2026-10-02T23:37:43.397Z | INFO | phd-runner: [MIGRATE_FROM - START]
file = phd-tests/framework/src/test_vm/mod.rs
line = 609
path = phd_tests::migrate::from_base::migration_from_base_and_back
source = migration_from_base_and_back
source_id = 82b56887-95bb-4390-8b00-a282d3eb2b6b
target = phd_framework::test_vm
target_id = b4bb0297-4ad6-43b3-a6b1-63fa9a409b24
|
| 325 | 2026-10-02T23:37:43.397Z | INFO | phd-runner: [MIGRATE_FROM - EVENT] Migrating from source at address 127.0.0.1:9000
file = phd-tests/framework/src/test_vm/mod.rs
line = 642
migration_id = 00108401-057f-413e-bef1-c4014977c40c
path = phd_tests::migrate::from_base::migration_from_base_and_back
source = migration_from_base_and_back
source_id = 82b56887-95bb-4390-8b00-a282d3eb2b6b
target = phd_framework::test_vm
target_id = b4bb0297-4ad6-43b3-a6b1-63fa9a409b24
timeout_duration = 45s
|
| 326 | 2026-10-02T23:37:43.397Z | INFO | phd-runner: [INSTANCE_ENSURE_INTERNAL - START]
file = phd-tests/framework/src/test_vm/mod.rs
line = 412
path = phd_tests::migrate::from_base::migration_from_base_and_back
source = migration_from_base_and_back
source_id = 82b56887-95bb-4390-8b00-a282d3eb2b6b
target = phd_framework::test_vm
target_id = b4bb0297-4ad6-43b3-a6b1-63fa9a409b24
vm = migration_from_base_and_back_lifecycle_0
vm_id = b4bb0297-4ad6-43b3-a6b1-63fa9a409b24
|
| 327 | 2026-10-02T23:37:43.397Z | INFO | phd-runner: [INSTANCE_ENSURE_INTERNAL - EVENT] retriable error from instance_spec_ensure
e = Communication Error: error sending request for url (http://127.0.0.1:9002/instance)
file = phd-tests/framework/src/test_vm/mod.rs
line = 455
path = phd_tests::migrate::from_base::migration_from_base_and_back
source = migration_from_base_and_back
source_id = 82b56887-95bb-4390-8b00-a282d3eb2b6b
target = phd_framework::test_vm
target_id = b4bb0297-4ad6-43b3-a6b1-63fa9a409b24
vm = migration_from_base_and_back_lifecycle_0
vm_id = b4bb0297-4ad6-43b3-a6b1-63fa9a409b24
|
| 328 | 2026-10-02T23:37:44.211Z | INFO | phd-runner: [INSTANCE_ENSURE_INTERNAL - EVENT] Started instance
file = phd-tests/framework/src/test_vm/mod.rs
instance_description.instance = Instance { properties: InstanceProperties { id: b4bb0297-4ad6-43b3-a6b1-63fa9a409b24, name: "phd-vm-b4bb0297-4ad6-43b3-a6b1-63fa9a409b24", description: "Pheidippides-managed VM", metadata: InstanceMetadata { silo_id: 96622ddd-a800-449d-afaa-3143ec6e2aba, project_id: e7625039-4930-41b1-80e2-cb7498503058, sled_id: f709ffef-1c99-4cd3-9d51-1146600528a2, sled_serial: "f709ffef-1c99-4cd3-9d51-1146600528a2", sled_revision: 1, sled_model: "pheidippes" } }, state: Migrating }
line = 514
path = phd_tests::migrate::from_base::migration_from_base_and_back
source = migration_from_base_and_back
source_id = 82b56887-95bb-4390-8b00-a282d3eb2b6b
target = phd_framework::test_vm
target_id = b4bb0297-4ad6-43b3-a6b1-63fa9a409b24
vm = migration_from_base_and_back_lifecycle_0
vm_id = b4bb0297-4ad6-43b3-a6b1-63fa9a409b24
|
| 329 | 2026-10-02T23:37:44.211Z | INFO | phd-runner: [MIGRATE - START]
file = phd-tests/framework/src/test_vm/mod.rs
line = 663
migration_id = 00108401-057f-413e-bef1-c4014977c40c
path = phd_tests::migrate::from_base::migration_from_base_and_back
source = migration_from_base_and_back
source_id = 82b56887-95bb-4390-8b00-a282d3eb2b6b
target = phd_framework::test_vm
target_id = b4bb0297-4ad6-43b3-a6b1-63fa9a409b24
|
| 330 | 2026-10-02T23:37:46.760Z | INFO | phd-runner: [SERIAL CONSOLE TASK - EVENT] serial socket control message
file = phd-tests/framework/src/serial/mod.rs
line = 275
s = {"Migrating":{"destination":"127.0.0.1:9002","from_start":7847}}
target = phd_framework::serial
|
| 331 | 2026-10-02T23:37:47.414Z | INFO | phd-runner: [MIGRATE_FROM - EVENT] Migration completed successfully
file = phd-tests/framework/src/test_vm/mod.rs
line = 676
path = phd_tests::migrate::from_base::migration_from_base_and_back
source = migration_from_base_and_back
source_id = 82b56887-95bb-4390-8b00-a282d3eb2b6b
target = phd_framework::test_vm
target_id = b4bb0297-4ad6-43b3-a6b1-63fa9a409b24
|
| 332 | 2026-10-02T23:37:47.414Z | INFO | phd-runner: [MIGRATE - END]
elapsed_milliseconds = 3202
file = phd-tests/framework/src/test_vm/mod.rs
line = 663
migration_id = 00108401-057f-413e-bef1-c4014977c40c
path = phd_tests::migrate::from_base::migration_from_base_and_back
source = migration_from_base_and_back
source_id = 82b56887-95bb-4390-8b00-a282d3eb2b6b
target = phd_framework::test_vm
target_id = b4bb0297-4ad6-43b3-a6b1-63fa9a409b24
|
| 333 | 2026-10-02T23:37:47.416Z | INFO | phd-runner: [VM CLEANUP - START]
file = phd-tests/framework/src/test_vm/mod.rs
line = 1172
path = phd_tests::migrate::from_base::migration_from_base_and_back
target = phd_framework::test_vm
vm = migration_from_base_and_back
vm_id = 82b56887-95bb-4390-8b00-a282d3eb2b6b
|
| 334 | 2026-10-02T23:37:47.416Z | INFO | phd-runner: [WAIT_FOR_SERIAL_OUTPUT - START]
file = phd-tests/framework/src/test_vm/mod.rs
line = 913
path = phd_tests::migrate::from_base::migration_from_base_and_back
target = phd_framework::test_vm
vm = migration_from_base_and_back_lifecycle_0
vm_id = b4bb0297-4ad6-43b3-a6b1-63fa9a409b24
|
| 335 | 2026-10-02T23:37:47.416Z | INFO | phd-runner: [WAIT_FOR_SERIAL_OUTPUT - EVENT] Waiting for output on serial console
file = phd-tests/framework/src/test_vm/mod.rs
line = 920
path = phd_tests::migrate::from_base::migration_from_base_and_back
target = phd_framework::test_vm
timeout_duration = Explicit(15s)
vm = migration_from_base_and_back_lifecycle_0
vm_id = b4bb0297-4ad6-43b3-a6b1-63fa9a409b24
|
| 336 | 2026-10-02T23:37:47.417Z | DEBG | phd-runner: [VM CLEANUP - EVENT] Killing Propolis server process
file = phd-tests/framework/src/test_vm/server.rs
line = 177
path = phd_tests::migrate::from_base::migration_from_base_and_back
self.address = 127.0.0.1:9000
target = phd_framework::test_vm::server
vm = migration_from_base_and_back
vm_id = 82b56887-95bb-4390-8b00-a282d3eb2b6b
|
| 337 | 2026-10-02T23:37:47.496Z | INFO | phd-runner: [VM CLEANUP - END]
elapsed_milliseconds = 79
file = phd-tests/framework/src/test_vm/mod.rs
line = 1172
path = phd_tests::migrate::from_base::migration_from_base_and_back
target = phd_framework::test_vm
vm = migration_from_base_and_back
vm_id = 82b56887-95bb-4390-8b00-a282d3eb2b6b
|
| 338 | 2026-10-02T23:37:47.496Z | INFO | phd-runner: [INSTANCE_ENSURE_INTERNAL - END]
elapsed_milliseconds = 9861
file = phd-tests/framework/src/test_vm/mod.rs
line = 412
path = phd_tests::migrate::from_base::migration_from_base_and_back
target = phd_framework::test_vm
vm = migration_from_base_and_back
vm_id = 82b56887-95bb-4390-8b00-a282d3eb2b6b
|
| 339 | 2026-10-02T23:37:49.271Z | INFO | phd-runner: [WAIT_FOR_SERIAL_OUTPUT - END]
elapsed_milliseconds = 1854
file = phd-tests/framework/src/test_vm/mod.rs
line = 913
path = phd_tests::migrate::from_base::migration_from_base_and_back
target = phd_framework::test_vm
vm = migration_from_base_and_back_lifecycle_0
vm_id = b4bb0297-4ad6-43b3-a6b1-63fa9a409b24
|
| 340 | 2026-10-02T23:37:49.271Z | INFO | phd-runner: [WAIT_FOR_SERIAL_OUTPUT - START]
file = phd-tests/framework/src/test_vm/mod.rs
line = 913
path = phd_tests::migrate::from_base::migration_from_base_and_back
target = phd_framework::test_vm
vm = migration_from_base_and_back_lifecycle_0
vm_id = b4bb0297-4ad6-43b3-a6b1-63fa9a409b24
|
| 341 | 2026-10-02T23:37:49.271Z | INFO | phd-runner: [WAIT_FOR_SERIAL_OUTPUT - EVENT] Waiting for output on serial console
file = phd-tests/framework/src/test_vm/mod.rs
line = 920
path = phd_tests::migrate::from_base::migration_from_base_and_back
target = phd_framework::test_vm
timeout_duration = Explicit(300s)
vm = migration_from_base_and_back_lifecycle_0
vm_id = b4bb0297-4ad6-43b3-a6b1-63fa9a409b24
|
| 342 | 2026-10-02T23:37:49.304Z | INFO | phd-runner: [WAIT_FOR_SERIAL_OUTPUT - END]
elapsed_milliseconds = 32
file = phd-tests/framework/src/test_vm/mod.rs
line = 913
path = phd_tests::migrate::from_base::migration_from_base_and_back
target = phd_framework::test_vm
vm = migration_from_base_and_back_lifecycle_0
vm_id = b4bb0297-4ad6-43b3-a6b1-63fa9a409b24
|
| 343 | 2026-10-02T23:37:49.304Z | INFO | phd-runner: [TEST - EVENT] migrating to new Propolis artifact for lifecycle test
file = phd-tests/framework/src/lifecycle.rs
line = 73
path = phd_tests::migrate::from_base::migration_from_base_and_back
propolis_artifact = __BASE_PROPOLIS
target = phd_framework::lifecycle
vm_name = migration_from_base_and_back
|
| 344 | 2026-10-02T23:37:49.304Z | INFO | phd-runner: [NEW - START]
file = phd-tests/framework/src/test_vm/mod.rs
line = 300
path = phd_tests::migrate::from_base::migration_from_base_and_back
target = phd_framework::test_vm
|
| 345 | 2026-10-02T23:37:49.304Z | INFO | phd-runner: [NEW - EVENT] phd_framework::test_vm
environment = EnvironmentSpec { location: Local, propolis_artifact: "__BASE_PROPOLIS", metrics: None }
file = phd-tests/framework/src/test_vm/mod.rs
guest_os_kind = Alpine
line = 318
path = phd_tests::migrate::from_base::migration_from_base_and_back
target = phd_framework::test_vm
vm_name = migration_from_base_and_back_lifecycle_1
|
| 346 | 2026-10-02T23:37:49.304Z | DEBG | phd-runner: [NEW - EVENT] Verified artifact already exists
file = phd-tests/framework/src/artifacts/store.rs
line = 45
path = /phd-artifacts/c39ee71b9b334e87523f19fd9694492a794ad7a287ed999d3aaee7dc836e0a17/propolis-server
target = phd_framework::artifacts::store
|
| 347 | 2026-10-02T23:37:49.304Z | INFO | phd-runner: [NEW - EVENT] Launching Propolis server
bootrom_path = "/phd-artifacts/740187046a7267d0de72d3455070333547dbc0ea023531471fb2b2a61effa448/OVMF_CODE.fd"
file = phd-tests/framework/src/test_vm/server.rs
line = 66
path = phd_tests::migrate::from_base::migration_from_base_and_back
server_addr = 127.0.0.1:9004
server_path = "/phd-artifacts/c39ee71b9b334e87523f19fd9694492a794ad7a287ed999d3aaee7dc836e0a17/propolis-server"
target = phd_framework::test_vm::server
|
| 348 | 2026-10-02T23:37:49.304Z | INFO | phd-runner: [NEW - EVENT] Opening server log files
file = phd-tests/framework/src/log_config.rs
line = 84
path = phd_tests::migrate::from_base::migration_from_base_and_back
stderr_path = "/tmp/propolis-phd/phd_tests::migrate::from_base::migration_from_base_and_back/migration_from_base_and_back_lifecycle_1.stderr.log"
stdout_path = "/tmp/propolis-phd/phd_tests::migrate::from_base::migration_from_base_and_back/migration_from_base_and_back_lifecycle_1.stdout.log"
target = phd_framework::log_config
|
| 349 | 2026-10-02T23:37:49.341Z | INFO | phd-runner: [NEW - EVENT] Launched server with pid 940
file = phd-tests/framework/src/test_vm/server.rs
line = 127
path = phd_tests::migrate::from_base::migration_from_base_and_back
target = phd_framework::test_vm::server
|
| 350 | 2026-10-02T23:37:49.355Z | INFO | phd-runner: [NEW - END]
elapsed_milliseconds = 50
file = phd-tests/framework/src/test_vm/mod.rs
line = 300
path = phd_tests::migrate::from_base::migration_from_base_and_back
target = phd_framework::test_vm
|
| 351 | 2026-10-02T23:37:49.355Z | INFO | phd-runner: [MIGRATE_FROM - START]
file = phd-tests/framework/src/test_vm/mod.rs
line = 609
path = phd_tests::migrate::from_base::migration_from_base_and_back
source = migration_from_base_and_back_lifecycle_0
source_id = b4bb0297-4ad6-43b3-a6b1-63fa9a409b24
target = phd_framework::test_vm
target_id = a963773b-adab-4653-b51b-b39c2283d57e
|
| 352 | 2026-10-02T23:37:49.355Z | INFO | phd-runner: [MIGRATE_FROM - EVENT] Migrating from source at address 127.0.0.1:9002
file = phd-tests/framework/src/test_vm/mod.rs
line = 642
migration_id = 018bdc0f-cf7a-43fe-8e8d-995df217493e
path = phd_tests::migrate::from_base::migration_from_base_and_back
source = migration_from_base_and_back_lifecycle_0
source_id = b4bb0297-4ad6-43b3-a6b1-63fa9a409b24
target = phd_framework::test_vm
target_id = a963773b-adab-4653-b51b-b39c2283d57e
timeout_duration = 45s
|
| 353 | 2026-10-02T23:37:49.355Z | INFO | phd-runner: [INSTANCE_ENSURE_INTERNAL - START]
file = phd-tests/framework/src/test_vm/mod.rs
line = 412
path = phd_tests::migrate::from_base::migration_from_base_and_back
source = migration_from_base_and_back_lifecycle_0
source_id = b4bb0297-4ad6-43b3-a6b1-63fa9a409b24
target = phd_framework::test_vm
target_id = a963773b-adab-4653-b51b-b39c2283d57e
vm = migration_from_base_and_back_lifecycle_1
vm_id = a963773b-adab-4653-b51b-b39c2283d57e
|
| 354 | 2026-10-02T23:37:49.355Z | INFO | phd-runner: [INSTANCE_ENSURE_INTERNAL - EVENT] retriable error from instance_spec_ensure
e = Communication Error: error sending request for url (http://127.0.0.1:9004/instance)
file = phd-tests/framework/src/test_vm/mod.rs
line = 455
path = phd_tests::migrate::from_base::migration_from_base_and_back
source = migration_from_base_and_back_lifecycle_0
source_id = b4bb0297-4ad6-43b3-a6b1-63fa9a409b24
target = phd_framework::test_vm
target_id = a963773b-adab-4653-b51b-b39c2283d57e
vm = migration_from_base_and_back_lifecycle_1
vm_id = a963773b-adab-4653-b51b-b39c2283d57e
|
| 355 | 2026-10-02T23:37:50.179Z | INFO | phd-runner: [INSTANCE_ENSURE_INTERNAL - EVENT] Started instance
file = phd-tests/framework/src/test_vm/mod.rs
instance_description.instance = Instance { properties: InstanceProperties { id: a963773b-adab-4653-b51b-b39c2283d57e, name: "phd-vm-a963773b-adab-4653-b51b-b39c2283d57e", description: "Pheidippides-managed VM", metadata: InstanceMetadata { silo_id: 96622ddd-a800-449d-afaa-3143ec6e2aba, project_id: e7625039-4930-41b1-80e2-cb7498503058, sled_id: 68680a7b-2eb7-4422-94ae-6f3eecc28b92, sled_serial: "68680a7b-2eb7-4422-94ae-6f3eecc28b92", sled_revision: 1, sled_model: "pheidippes" } }, state: Migrating }
line = 514
path = phd_tests::migrate::from_base::migration_from_base_and_back
source = migration_from_base_and_back_lifecycle_0
source_id = b4bb0297-4ad6-43b3-a6b1-63fa9a409b24
target = phd_framework::test_vm
target_id = a963773b-adab-4653-b51b-b39c2283d57e
vm = migration_from_base_and_back_lifecycle_1
vm_id = a963773b-adab-4653-b51b-b39c2283d57e
|
| 356 | 2026-10-02T23:37:50.179Z | INFO | phd-runner: [MIGRATE - START]
file = phd-tests/framework/src/test_vm/mod.rs
line = 663
migration_id = 018bdc0f-cf7a-43fe-8e8d-995df217493e
path = phd_tests::migrate::from_base::migration_from_base_and_back
source = migration_from_base_and_back_lifecycle_0
source_id = b4bb0297-4ad6-43b3-a6b1-63fa9a409b24
target = phd_framework::test_vm
target_id = a963773b-adab-4653-b51b-b39c2283d57e
|
| 357 | 2026-10-02T23:37:52.749Z | INFO | phd-runner: [SERIAL CONSOLE TASK - EVENT] serial socket control message
file = phd-tests/framework/src/serial/mod.rs
line = 275
s = {"Migrating":{"destination":"127.0.0.1:9004","from_start":7894}}
target = phd_framework::serial
|
| 358 | 2026-10-02T23:37:54.256Z | INFO | phd-runner: [MIGRATE_FROM - EVENT] Migration completed successfully
file = phd-tests/framework/src/test_vm/mod.rs
line = 676
path = phd_tests::migrate::from_base::migration_from_base_and_back
source = migration_from_base_and_back_lifecycle_0
source_id = b4bb0297-4ad6-43b3-a6b1-63fa9a409b24
target = phd_framework::test_vm
target_id = a963773b-adab-4653-b51b-b39c2283d57e
|
| 359 | 2026-10-02T23:37:54.256Z | INFO | phd-runner: [MIGRATE - END]
elapsed_milliseconds = 4076
file = phd-tests/framework/src/test_vm/mod.rs
line = 663
migration_id = 018bdc0f-cf7a-43fe-8e8d-995df217493e
path = phd_tests::migrate::from_base::migration_from_base_and_back
source = migration_from_base_and_back_lifecycle_0
source_id = b4bb0297-4ad6-43b3-a6b1-63fa9a409b24
target = phd_framework::test_vm
target_id = a963773b-adab-4653-b51b-b39c2283d57e
|
| 360 | 2026-10-02T23:37:54.259Z | INFO | phd-runner: [VM CLEANUP - START]
file = phd-tests/framework/src/test_vm/mod.rs
line = 1172
path = phd_tests::migrate::from_base::migration_from_base_and_back
target = phd_framework::test_vm
vm = migration_from_base_and_back_lifecycle_0
vm_id = b4bb0297-4ad6-43b3-a6b1-63fa9a409b24
|
| 361 | 2026-10-02T23:37:54.259Z | INFO | phd-runner: [WAIT_FOR_SERIAL_OUTPUT - START]
file = phd-tests/framework/src/test_vm/mod.rs
line = 913
path = phd_tests::migrate::from_base::migration_from_base_and_back
target = phd_framework::test_vm
vm = migration_from_base_and_back_lifecycle_1
vm_id = a963773b-adab-4653-b51b-b39c2283d57e
|
| 362 | 2026-10-02T23:37:54.259Z | INFO | phd-runner: [WAIT_FOR_SERIAL_OUTPUT - EVENT] Waiting for output on serial console
file = phd-tests/framework/src/test_vm/mod.rs
line = 920
path = phd_tests::migrate::from_base::migration_from_base_and_back
target = phd_framework::test_vm
timeout_duration = Explicit(15s)
vm = migration_from_base_and_back_lifecycle_1
vm_id = a963773b-adab-4653-b51b-b39c2283d57e
|
| 363 | 2026-10-02T23:37:54.261Z | DEBG | phd-runner: [VM CLEANUP - EVENT] Killing Propolis server process
file = phd-tests/framework/src/test_vm/server.rs
line = 177
path = phd_tests::migrate::from_base::migration_from_base_and_back
self.address = 127.0.0.1:9002
target = phd_framework::test_vm::server
vm = migration_from_base_and_back_lifecycle_0
vm_id = b4bb0297-4ad6-43b3-a6b1-63fa9a409b24
|
| 364 | 2026-10-02T23:37:54.348Z | INFO | phd-runner: [VM CLEANUP - END]
elapsed_milliseconds = 89
file = phd-tests/framework/src/test_vm/mod.rs
line = 1172
path = phd_tests::migrate::from_base::migration_from_base_and_back
target = phd_framework::test_vm
vm = migration_from_base_and_back_lifecycle_0
vm_id = b4bb0297-4ad6-43b3-a6b1-63fa9a409b24
|
| 365 | 2026-10-02T23:37:54.348Z | INFO | phd-runner: [INSTANCE_ENSURE_INTERNAL - END]
elapsed_milliseconds = 10951
file = phd-tests/framework/src/test_vm/mod.rs
line = 412
path = phd_tests::migrate::from_base::migration_from_base_and_back
source = migration_from_base_and_back
source_id = 82b56887-95bb-4390-8b00-a282d3eb2b6b
target = phd_framework::test_vm
target_id = b4bb0297-4ad6-43b3-a6b1-63fa9a409b24
vm = migration_from_base_and_back_lifecycle_0
vm_id = b4bb0297-4ad6-43b3-a6b1-63fa9a409b24
|
| 366 | 2026-10-02T23:37:54.349Z | INFO | phd-runner: [MIGRATE_FROM - END]
elapsed_milliseconds = 10951
file = phd-tests/framework/src/test_vm/mod.rs
line = 609
path = phd_tests::migrate::from_base::migration_from_base_and_back
source = migration_from_base_and_back
source_id = 82b56887-95bb-4390-8b00-a282d3eb2b6b
target = phd_framework::test_vm
target_id = b4bb0297-4ad6-43b3-a6b1-63fa9a409b24
|
| 367 | 2026-10-02T23:37:54.349Z | INFO | phd-runner: [WAIT_FOR_SERIAL_OUTPUT - END]
elapsed_milliseconds = 89
file = phd-tests/framework/src/test_vm/mod.rs
line = 913
path = phd_tests::migrate::from_base::migration_from_base_and_back
target = phd_framework::test_vm
vm = migration_from_base_and_back_lifecycle_1
vm_id = a963773b-adab-4653-b51b-b39c2283d57e
|
| 368 | 2026-10-02T23:37:54.349Z | INFO | phd-runner: [WAIT_FOR_SERIAL_OUTPUT - START]
file = phd-tests/framework/src/test_vm/mod.rs
line = 913
path = phd_tests::migrate::from_base::migration_from_base_and_back
target = phd_framework::test_vm
vm = migration_from_base_and_back_lifecycle_1
vm_id = a963773b-adab-4653-b51b-b39c2283d57e
|
| 369 | 2026-10-02T23:37:54.349Z | INFO | phd-runner: [WAIT_FOR_SERIAL_OUTPUT - EVENT] Waiting for output on serial console
file = phd-tests/framework/src/test_vm/mod.rs
line = 920
path = phd_tests::migrate::from_base::migration_from_base_and_back
target = phd_framework::test_vm
timeout_duration = Explicit(300s)
vm = migration_from_base_and_back_lifecycle_1
vm_id = a963773b-adab-4653-b51b-b39c2283d57e
|
| 370 | 2026-10-02T23:37:54.382Z | INFO | phd-runner: [WAIT_FOR_SERIAL_OUTPUT - END]
elapsed_milliseconds = 33
file = phd-tests/framework/src/test_vm/mod.rs
line = 913
path = phd_tests::migrate::from_base::migration_from_base_and_back
target = phd_framework::test_vm
vm = migration_from_base_and_back_lifecycle_1
vm_id = a963773b-adab-4653-b51b-b39c2283d57e
|
| 371 | 2026-10-02T23:37:54.382Z | INFO | phd-runner: [TEST - EVENT] migrating to new Propolis artifact for lifecycle test
file = phd-tests/framework/src/lifecycle.rs
line = 73
path = phd_tests::migrate::from_base::migration_from_base_and_back
propolis_artifact = __DEFAULT_PROPOLIS
target = phd_framework::lifecycle
vm_name = migration_from_base_and_back
|
| 372 | 2026-10-02T23:37:54.382Z | INFO | phd-runner: [NEW - START]
file = phd-tests/framework/src/test_vm/mod.rs
line = 300
path = phd_tests::migrate::from_base::migration_from_base_and_back
target = phd_framework::test_vm
|
| 373 | 2026-10-02T23:37:54.383Z | INFO | phd-runner: [NEW - EVENT] phd_framework::test_vm
environment = EnvironmentSpec { location: Local, propolis_artifact: "__DEFAULT_PROPOLIS", metrics: None }
file = phd-tests/framework/src/test_vm/mod.rs
guest_os_kind = Alpine
line = 318
path = phd_tests::migrate::from_base::migration_from_base_and_back
target = phd_framework::test_vm
vm_name = migration_from_base_and_back_lifecycle_2
|
| 374 | 2026-10-02T23:37:54.383Z | DEBG | phd-runner: [NEW - EVENT] Verified artifact already exists
file = phd-tests/framework/src/artifacts/store.rs
line = 45
path = /work/phd-test/propolis-server
target = phd_framework::artifacts::store
|
| 375 | 2026-10-02T23:37:54.383Z | INFO | phd-runner: [NEW - EVENT] Launching Propolis server
bootrom_path = "/phd-artifacts/740187046a7267d0de72d3455070333547dbc0ea023531471fb2b2a61effa448/OVMF_CODE.fd"
file = phd-tests/framework/src/test_vm/server.rs
line = 66
path = phd_tests::migrate::from_base::migration_from_base_and_back
server_addr = 127.0.0.1:9006
server_path = "/work/phd-test/propolis-server"
target = phd_framework::test_vm::server
|
| 376 | 2026-10-02T23:37:54.383Z | INFO | phd-runner: [NEW - EVENT] Opening server log files
file = phd-tests/framework/src/log_config.rs
line = 84
path = phd_tests::migrate::from_base::migration_from_base_and_back
stderr_path = "/tmp/propolis-phd/phd_tests::migrate::from_base::migration_from_base_and_back/migration_from_base_and_back_lifecycle_2.stderr.log"
stdout_path = "/tmp/propolis-phd/phd_tests::migrate::from_base::migration_from_base_and_back/migration_from_base_and_back_lifecycle_2.stdout.log"
target = phd_framework::log_config
|
| 377 | 2026-10-02T23:37:54.423Z | INFO | phd-runner: [NEW - EVENT] Launched server with pid 942
file = phd-tests/framework/src/test_vm/server.rs
line = 127
path = phd_tests::migrate::from_base::migration_from_base_and_back
target = phd_framework::test_vm::server
|
| 378 | 2026-10-02T23:37:54.437Z | INFO | phd-runner: [NEW - END]
elapsed_milliseconds = 54
file = phd-tests/framework/src/test_vm/mod.rs
line = 300
path = phd_tests::migrate::from_base::migration_from_base_and_back
target = phd_framework::test_vm
|
| 379 | 2026-10-02T23:37:54.437Z | INFO | phd-runner: [MIGRATE_FROM - START]
file = phd-tests/framework/src/test_vm/mod.rs
line = 609
path = phd_tests::migrate::from_base::migration_from_base_and_back
source = migration_from_base_and_back_lifecycle_1
source_id = a963773b-adab-4653-b51b-b39c2283d57e
target = phd_framework::test_vm
target_id = 311dc8e9-0c2e-44ad-87df-b47b1f70a89e
|
| 380 | 2026-10-02T23:37:54.437Z | INFO | phd-runner: [MIGRATE_FROM - EVENT] Migrating from source at address 127.0.0.1:9004
file = phd-tests/framework/src/test_vm/mod.rs
line = 642
migration_id = 9dc20a2c-c59a-4d39-9e72-4ba2ea6f18eb
path = phd_tests::migrate::from_base::migration_from_base_and_back
source = migration_from_base_and_back_lifecycle_1
source_id = a963773b-adab-4653-b51b-b39c2283d57e
target = phd_framework::test_vm
target_id = 311dc8e9-0c2e-44ad-87df-b47b1f70a89e
timeout_duration = 45s
|
| 381 | 2026-10-02T23:37:54.437Z | INFO | phd-runner: [INSTANCE_ENSURE_INTERNAL - START]
file = phd-tests/framework/src/test_vm/mod.rs
line = 412
path = phd_tests::migrate::from_base::migration_from_base_and_back
source = migration_from_base_and_back_lifecycle_1
source_id = a963773b-adab-4653-b51b-b39c2283d57e
target = phd_framework::test_vm
target_id = 311dc8e9-0c2e-44ad-87df-b47b1f70a89e
vm = migration_from_base_and_back_lifecycle_2
vm_id = 311dc8e9-0c2e-44ad-87df-b47b1f70a89e
|
| 382 | 2026-10-02T23:37:54.438Z | INFO | phd-runner: [INSTANCE_ENSURE_INTERNAL - EVENT] retriable error from instance_spec_ensure
e = Communication Error: error sending request for url (http://127.0.0.1:9006/instance)
file = phd-tests/framework/src/test_vm/mod.rs
line = 455
path = phd_tests::migrate::from_base::migration_from_base_and_back
source = migration_from_base_and_back_lifecycle_1
source_id = a963773b-adab-4653-b51b-b39c2283d57e
target = phd_framework::test_vm
target_id = 311dc8e9-0c2e-44ad-87df-b47b1f70a89e
vm = migration_from_base_and_back_lifecycle_2
vm_id = 311dc8e9-0c2e-44ad-87df-b47b1f70a89e
|
| 383 | 2026-10-02T23:37:55.189Z | INFO | phd-runner: [INSTANCE_ENSURE_INTERNAL - EVENT] Started instance
file = phd-tests/framework/src/test_vm/mod.rs
instance_description.instance = Instance { properties: InstanceProperties { id: 311dc8e9-0c2e-44ad-87df-b47b1f70a89e, name: "phd-vm-311dc8e9-0c2e-44ad-87df-b47b1f70a89e", description: "Pheidippides-managed VM", metadata: InstanceMetadata { silo_id: 96622ddd-a800-449d-afaa-3143ec6e2aba, project_id: e7625039-4930-41b1-80e2-cb7498503058, sled_id: 00101238-71b5-44ce-ae5c-81a4854cf7f0, sled_serial: "00101238-71b5-44ce-ae5c-81a4854cf7f0", sled_revision: 1, sled_model: "pheidippes" } }, state: Migrating }
line = 514
path = phd_tests::migrate::from_base::migration_from_base_and_back
source = migration_from_base_and_back_lifecycle_1
source_id = a963773b-adab-4653-b51b-b39c2283d57e
target = phd_framework::test_vm
target_id = 311dc8e9-0c2e-44ad-87df-b47b1f70a89e
vm = migration_from_base_and_back_lifecycle_2
vm_id = 311dc8e9-0c2e-44ad-87df-b47b1f70a89e
|
| 384 | 2026-10-02T23:37:55.189Z | INFO | phd-runner: [MIGRATE - START]
file = phd-tests/framework/src/test_vm/mod.rs
line = 663
migration_id = 9dc20a2c-c59a-4d39-9e72-4ba2ea6f18eb
path = phd_tests::migrate::from_base::migration_from_base_and_back
source = migration_from_base_and_back_lifecycle_1
source_id = a963773b-adab-4653-b51b-b39c2283d57e
target = phd_framework::test_vm
target_id = 311dc8e9-0c2e-44ad-87df-b47b1f70a89e
|
| 385 | 2026-10-02T23:37:57.723Z | INFO | phd-runner: [SERIAL CONSOLE TASK - EVENT] serial socket control message
file = phd-tests/framework/src/serial/mod.rs
line = 275
s = {"Migrating":{"destination":"127.0.0.1:9006","from_start":7941}}
target = phd_framework::serial
|
| 386 | 2026-10-02T23:37:58.729Z | INFO | phd-runner: [MIGRATE_FROM - EVENT] Migration completed successfully
file = phd-tests/framework/src/test_vm/mod.rs
line = 676
path = phd_tests::migrate::from_base::migration_from_base_and_back
source = migration_from_base_and_back_lifecycle_1
source_id = a963773b-adab-4653-b51b-b39c2283d57e
target = phd_framework::test_vm
target_id = 311dc8e9-0c2e-44ad-87df-b47b1f70a89e
|
| 387 | 2026-10-02T23:37:58.729Z | INFO | phd-runner: [MIGRATE - END]
elapsed_milliseconds = 3539
file = phd-tests/framework/src/test_vm/mod.rs
line = 663
migration_id = 9dc20a2c-c59a-4d39-9e72-4ba2ea6f18eb
path = phd_tests::migrate::from_base::migration_from_base_and_back
source = migration_from_base_and_back_lifecycle_1
source_id = a963773b-adab-4653-b51b-b39c2283d57e
target = phd_framework::test_vm
target_id = 311dc8e9-0c2e-44ad-87df-b47b1f70a89e
|
| 388 | 2026-10-02T23:37:58.731Z | INFO | phd-runner: [VM CLEANUP - START]
file = phd-tests/framework/src/test_vm/mod.rs
line = 1172
path = phd_tests::migrate::from_base::migration_from_base_and_back
target = phd_framework::test_vm
vm = migration_from_base_and_back_lifecycle_1
vm_id = a963773b-adab-4653-b51b-b39c2283d57e
|
| 389 | 2026-10-02T23:37:58.731Z | INFO | phd-runner: [WAIT_FOR_SERIAL_OUTPUT - START]
file = phd-tests/framework/src/test_vm/mod.rs
line = 913
path = phd_tests::migrate::from_base::migration_from_base_and_back
target = phd_framework::test_vm
vm = migration_from_base_and_back_lifecycle_2
vm_id = 311dc8e9-0c2e-44ad-87df-b47b1f70a89e
|
| 390 | 2026-10-02T23:37:58.731Z | INFO | phd-runner: [WAIT_FOR_SERIAL_OUTPUT - EVENT] Waiting for output on serial console
file = phd-tests/framework/src/test_vm/mod.rs
line = 920
path = phd_tests::migrate::from_base::migration_from_base_and_back
target = phd_framework::test_vm
timeout_duration = Explicit(15s)
vm = migration_from_base_and_back_lifecycle_2
vm_id = 311dc8e9-0c2e-44ad-87df-b47b1f70a89e
|
| 391 | 2026-10-02T23:37:58.732Z | DEBG | phd-runner: [VM CLEANUP - EVENT] Killing Propolis server process
file = phd-tests/framework/src/test_vm/server.rs
line = 177
path = phd_tests::migrate::from_base::migration_from_base_and_back
self.address = 127.0.0.1:9004
target = phd_framework::test_vm::server
vm = migration_from_base_and_back_lifecycle_1
vm_id = a963773b-adab-4653-b51b-b39c2283d57e
|
| 392 | 2026-10-02T23:37:58.815Z | INFO | phd-runner: [VM CLEANUP - END]
elapsed_milliseconds = 84
file = phd-tests/framework/src/test_vm/mod.rs
line = 1172
path = phd_tests::migrate::from_base::migration_from_base_and_back
target = phd_framework::test_vm
vm = migration_from_base_and_back_lifecycle_1
vm_id = a963773b-adab-4653-b51b-b39c2283d57e
|
| 393 | 2026-10-02T23:37:58.816Z | INFO | phd-runner: [INSTANCE_ENSURE_INTERNAL - END]
elapsed_milliseconds = 9460
file = phd-tests/framework/src/test_vm/mod.rs
line = 412
path = phd_tests::migrate::from_base::migration_from_base_and_back
source = migration_from_base_and_back_lifecycle_0
source_id = b4bb0297-4ad6-43b3-a6b1-63fa9a409b24
target = phd_framework::test_vm
target_id = a963773b-adab-4653-b51b-b39c2283d57e
vm = migration_from_base_and_back_lifecycle_1
vm_id = a963773b-adab-4653-b51b-b39c2283d57e
|
| 394 | 2026-10-02T23:37:58.816Z | INFO | phd-runner: [WAIT_FOR_SERIAL_OUTPUT - END]
elapsed_milliseconds = 84
file = phd-tests/framework/src/test_vm/mod.rs
line = 913
path = phd_tests::migrate::from_base::migration_from_base_and_back
target = phd_framework::test_vm
vm = migration_from_base_and_back_lifecycle_2
vm_id = 311dc8e9-0c2e-44ad-87df-b47b1f70a89e
|
| 395 | 2026-10-02T23:37:58.816Z | INFO | phd-runner: [MIGRATE_FROM - END]
elapsed_milliseconds = 9460
file = phd-tests/framework/src/test_vm/mod.rs
line = 609
path = phd_tests::migrate::from_base::migration_from_base_and_back
source = migration_from_base_and_back_lifecycle_0
source_id = b4bb0297-4ad6-43b3-a6b1-63fa9a409b24
target = phd_framework::test_vm
target_id = a963773b-adab-4653-b51b-b39c2283d57e
|
| 396 | 2026-10-02T23:37:58.816Z | INFO | phd-runner: [WAIT_FOR_SERIAL_OUTPUT - START]
file = phd-tests/framework/src/test_vm/mod.rs
line = 913
path = phd_tests::migrate::from_base::migration_from_base_and_back
target = phd_framework::test_vm
vm = migration_from_base_and_back_lifecycle_2
vm_id = 311dc8e9-0c2e-44ad-87df-b47b1f70a89e
|
| 397 | 2026-10-02T23:37:58.816Z | INFO | phd-runner: [WAIT_FOR_SERIAL_OUTPUT - EVENT] Waiting for output on serial console
file = phd-tests/framework/src/test_vm/mod.rs
line = 920
path = phd_tests::migrate::from_base::migration_from_base_and_back
target = phd_framework::test_vm
timeout_duration = Explicit(300s)
vm = migration_from_base_and_back_lifecycle_2
vm_id = 311dc8e9-0c2e-44ad-87df-b47b1f70a89e
|
| 398 | 2026-10-02T23:37:58.843Z | INFO | phd-runner: [WAIT_FOR_SERIAL_OUTPUT - END]
elapsed_milliseconds = 27
file = phd-tests/framework/src/test_vm/mod.rs
line = 913
path = phd_tests::migrate::from_base::migration_from_base_and_back
target = phd_framework::test_vm
vm = migration_from_base_and_back_lifecycle_2
vm_id = 311dc8e9-0c2e-44ad-87df-b47b1f70a89e
|
| 399 | 2026-10-02T23:37:58.843Z | INFO | phd-runner: [VM CLEANUP - START]
file = phd-tests/framework/src/test_vm/mod.rs
line = 1172
path = phd_tests::migrate::from_base::migration_from_base_and_back
target = phd_framework::test_vm
vm = migration_from_base_and_back_lifecycle_2
vm_id = 311dc8e9-0c2e-44ad-87df-b47b1f70a89e
|
| 400 | 2026-10-02T23:37:58.844Z | DEBG | phd-runner: [SERIAL CONSOLE TASK - EVENT] serial console command channel was closed
file = phd-tests/framework/src/serial/mod.rs
line = 213
target = phd_framework::serial
|
| 401 | 2026-10-02T23:37:58.844Z | INFO | phd-runner: test phd_tests::migrate::from_base::migration_from_base_and_back ... ok
file = phd-tests/runner/src/execute.rs
line = 141
target = phd_runner::execute
|
| 402 | 2026-10-02T23:37:58.844Z | INFO | phd-runner: [SERIAL CONSOLE TASK - END]
elapsed_milliseconds = 20485
file = phd-tests/framework/src/serial/mod.rs
line = 200
target = phd_framework::serial
|
| 403 | 2026-10-02T23:37:58.844Z | INFO | phd-runner: [TEST_CLEANUP - START]
file = phd-tests/runner/src/fixtures.rs
line = 51
target = phd_runner::fixtures
|
| 404 | 2026-10-02T23:37:58.845Z | DEBG | phd-runner: [VM CLEANUP - EVENT] trying to ensure Propolis server VM is destroyed
file = phd-tests/framework/src/test_vm/mod.rs
line = 1195
path = phd_tests::migrate::from_base::migration_from_base_and_back
target = phd_framework::test_vm
vm = migration_from_base_and_back_lifecycle_2
vm_id = 311dc8e9-0c2e-44ad-87df-b47b1f70a89e
|
| 405 | 2026-10-02T23:37:59.386Z | DEBG | phd-runner: [VM CLEANUP - EVENT] Killing Propolis server process
file = phd-tests/framework/src/test_vm/server.rs
line = 177
path = phd_tests::migrate::from_base::migration_from_base_and_back
self.address = 127.0.0.1:9006
target = phd_framework::test_vm::server
vm = migration_from_base_and_back_lifecycle_2
vm_id = 311dc8e9-0c2e-44ad-87df-b47b1f70a89e
|
| 406 | 2026-10-02T23:37:59.469Z | DEBG | phd-runner: [VM CLEANUP - EVENT] zfs clone dropped
file = phd-tests/framework/src/zfs.rs
line = 83
path = phd_tests::migrate::from_base::migration_from_base_and_back
target = phd_framework::zfs
vm = migration_from_base_and_back_lifecycle_2
vm_id = 311dc8e9-0c2e-44ad-87df-b47b1f70a89e
|
| 407 | 2026-10-02T23:37:59.469Z | DEBG | phd-runner: [VM CLEANUP - EVENT] executing ZFS command
args = ["phd-artifacts/phd-clone-007277c0-1dcd-441a-8471-dc96fd923009"]
file = phd-tests/framework/src/zfs.rs
line = 304
path = phd_tests::migrate::from_base::migration_from_base_and_back
target = phd_framework::zfs
verb = destroy
vm = migration_from_base_and_back_lifecycle_2
vm_id = 311dc8e9-0c2e-44ad-87df-b47b1f70a89e
|
| 408 | 2026-10-02T23:37:59.496Z | DEBG | phd-runner: [VM CLEANUP - EVENT] zfs snapshot dropped
file = phd-tests/framework/src/zfs.rs
line = 57
path = phd_tests::migrate::from_base::migration_from_base_and_back
target = phd_framework::zfs
vm = migration_from_base_and_back_lifecycle_2
vm_id = 311dc8e9-0c2e-44ad-87df-b47b1f70a89e
|
| 409 | 2026-10-02T23:37:59.496Z | DEBG | phd-runner: [VM CLEANUP - EVENT] executing ZFS command
args = ["phd-artifacts@phd-7ebef259-cca3-47d6-a895-5208372c3144"]
file = phd-tests/framework/src/zfs.rs
line = 304
path = phd_tests::migrate::from_base::migration_from_base_and_back
target = phd_framework::zfs
verb = destroy
vm = migration_from_base_and_back_lifecycle_2
vm_id = 311dc8e9-0c2e-44ad-87df-b47b1f70a89e
|
| 410 | 2026-10-02T23:37:59.513Z | INFO | phd-runner: [VM CLEANUP - END]
elapsed_milliseconds = 669
file = phd-tests/framework/src/test_vm/mod.rs
line = 1172
path = phd_tests::migrate::from_base::migration_from_base_and_back
target = phd_framework::test_vm
vm = migration_from_base_and_back_lifecycle_2
vm_id = 311dc8e9-0c2e-44ad-87df-b47b1f70a89e
|
| 411 | 2026-10-02T23:37:59.513Z | INFO | phd-runner: [TEST_CLEANUP - END]
elapsed_milliseconds = 669
file = phd-tests/runner/src/fixtures.rs
line = 51
target = phd_runner::fixtures
|
| 412 | 2026-10-02T23:37:59.513Z | INFO | phd-runner: [INSTANCE_ENSURE_INTERNAL - END]
elapsed_milliseconds = 5075
file = phd-tests/framework/src/test_vm/mod.rs
line = 412
path = phd_tests::migrate::from_base::migration_from_base_and_back
source = migration_from_base_and_back_lifecycle_1
source_id = a963773b-adab-4653-b51b-b39c2283d57e
target = phd_framework::test_vm
target_id = 311dc8e9-0c2e-44ad-87df-b47b1f70a89e
vm = migration_from_base_and_back_lifecycle_2
vm_id = 311dc8e9-0c2e-44ad-87df-b47b1f70a89e
|
| 413 | 2026-10-02T23:37:59.513Z | INFO | phd-runner: [EXECUTION_CLEANUP - START]
file = phd-tests/runner/src/fixtures.rs
line = 35
target = phd_runner::fixtures
|
| 414 | 2026-10-02T23:37:59.513Z | INFO | phd-runner: [MIGRATE_FROM - END]
elapsed_milliseconds = 5076
file = phd-tests/framework/src/test_vm/mod.rs
line = 609
path = phd_tests::migrate::from_base::migration_from_base_and_back
source = migration_from_base_and_back_lifecycle_1
source_id = a963773b-adab-4653-b51b-b39c2283d57e
target = phd_framework::test_vm
target_id = 311dc8e9-0c2e-44ad-87df-b47b1f70a89e
|
| 415 | 2026-10-02T23:37:59.513Z | INFO | phd-runner: [TEST - END]
elapsed_milliseconds = 21987
file = phd-tests/tests/src/migrate.rs
line = 52
path = phd_tests::migrate::from_base::migration_from_base_and_back
target = phd_tests::migrate::from_base
|
| 416 | 2026-10-02T23:37:59.513Z | INFO | phd-runner: [EXECUTION_CLEANUP - END]
elapsed_milliseconds = 0
file = phd-tests/runner/src/fixtures.rs
line = 35
target = phd_runner::fixtures
|
| 417 | | test result: ok. 3 passed; 0 failed; 0 skipped; 0 not run; finished in 91.11s |
| 418 | | |
| 419 | 2026-10-02T23:37:59.516Z | DEBG | phd-runner: phd_runner
exit_code = 0
file = phd-tests/runner/src/main.rs
line = 41
target = phd_runner
|