| 1 | 2026-10-03T05:49:50.938Z | INFO | phd-runner: phd_runner
file = phd-tests/runner/src/main.rs
line = 36
runner_args = ProcessArgs { command: Run(RunOptions { propolis_server_cmd: "/work/phd-test/propolis-server", base_propolis_branch: Some("master"), base_propolis_commit: None, base_propolis_cmd: None, crucible_downstairs_cmd: None, crucible_downstairs_commit: Some(Auto), tmp_directory: "/tmp/propolis-phd", artifact_directory: Some("/phd-artifacts"), output_mode: TmpFile, default_guest_cpus: 2, default_guest_memory_mib: 512, artifact_toml_path: "/work/phd-test/artifacts.toml", default_guest_artifact: "alpine", default_bootrom_artifact: "ovmf", include_filter: ["phd_tests::migrate::from_base"], exclude_filter: [], max_buildomat_wait_secs: 1200, manual_stop_on_failure: false }), disable_ansi: false, emit_bunyan: true }
target = phd_runner
|
| 2 | 2026-10-03T05:49:50.966Z | DEBG | phd-runner: Created new artifact store from manifest
file = phd-tests/framework/src/artifacts/store.rs
line = 219
store = Store { local_dir: "/phd-artifacts", artifacts: {"alpine": Mutex { data: StoredArtifact { description: Artifact { filename: "alpine.iso", kind: GuestOs(Alpine), source: RemoteServer { sha256: "ba8007f74f9b54fbae3b2520da577831b4834778a498d732f091260c61aa7ca1" }, untar: None }, cached_path: None } }, "ovmf": Mutex { data: StoredArtifact { description: Artifact { filename: "OVMF_CODE.fd", kind: Bootrom, source: Buildomat(BuildomatArtifact { repo: Repo("oxidecomputer/edk2"), series: Series("image_debug"), commit: Commit("bf64f45b1a58e69d126a3c6ca1e4512c88668132"), sha256: "740187046a7267d0de72d3455070333547dbc0ea023531471fb2b2a61effa448" }), untar: None }, cached_path: None } }}, downloader: DownloadConfig { timeout: 600s, buildomat_backoff: ExponentialBackoff { current_interval: 1s, initial_interval: 1s, randomization_factor: 0.5, multiplier: 1.5, max_interval: 60s, start_time: Instant { tv_sec: 254, tv_nsec: 898525394 }, max_elapsed_time: Some(1200s), clock: SystemClock }, remote_server_uris: ["https://oxide-omicron-build.s3.amazonaws.com"] } }
target = phd_framework::artifacts::store
|
| 3 | 2026-10-03T05:49:50.966Z | INFO | phd-runner: Adding Propolis server from local command
file = phd-tests/framework/src/artifacts/store.rs
line = 227
propolis_server_cmd = /work/phd-test/propolis-server
target = phd_framework::artifacts::store
|
| 4 | 2026-10-03T05:49:50.968Z | INFO | phd-runner: Adding crucible-downstairs from Buildomat Git revision
commit = ad8a31742adc45e925e63443a5b43c8e30604022
file = phd-tests/framework/src/artifacts/store.rs
line = 311
target = phd_framework::artifacts::store
|
| 5 | 2026-10-03T05:49:50.973Z | DEBG | phd-runner: Downloading file from Buildomat...
file = phd-tests/framework/src/artifacts/buildomat.rs
line = 215
target = phd_framework::artifacts::buildomat
timeout = 600s
uri = https://buildomat.eng.oxide.computer/public/file/oxidecomputer/crucible/nightly-image/ad8a31742adc45e925e63443a5b43c8e30604022/crucible-nightly.sha256.txt
|
| 6 | 2026-10-03T05:49:53.201Z | INFO | phd-runner: Adding 'current' Propolis server from Buildomat Git branch 'master'
file = phd-tests/framework/src/artifacts/store.rs
line = 248
target = phd_framework::artifacts::store
|
| 7 | 2026-10-03T05:49:53.801Z | DEBG | phd-runner: Downloading file from Buildomat...
file = phd-tests/framework/src/artifacts/buildomat.rs
line = 215
target = phd_framework::artifacts::buildomat
timeout = 600s
uri = https://buildomat.eng.oxide.computer/public/file/oxidecomputer/propolis/phd_build/cef309aad286c420de79cef93b734d7e73b341f0/propolis-server.sha256.txt
|
| 8 | 2026-10-03T05:49:53.960Z | INFO | phd-runner: [EXECUTION_SETUP - START]
file = phd-tests/runner/src/fixtures.rs
line = 25
target = phd_runner::fixtures
|
| 9 | 2026-10-03T05:49:53.961Z | INFO | phd-runner: [EXECUTION_SETUP - END]
elapsed_milliseconds = 0
file = phd-tests/runner/src/fixtures.rs
line = 25
target = phd_runner::fixtures
|
| 10 | 2026-10-03T05:49:53.963Z | INFO | phd-runner: Running 3 test(s)
file = phd-tests/runner/src/execute.rs
line = 83
target = phd_runner::execute
|
| 11 | 2026-10-03T05:49:53.964Z | INFO | phd-runner: Starting test phd_tests::migrate::from_base::serial_history
file = phd-tests/runner/src/execute.rs
line = 91
target = phd_runner::execute
|
| 12 | 2026-10-03T05:49:53.964Z | INFO | phd-runner: [TEST_SETUP - START]
file = phd-tests/runner/src/fixtures.rs
line = 41
target = phd_runner::fixtures
|
| 13 | 2026-10-03T05:49:53.964Z | INFO | phd-runner: [TEST_SETUP - END]
elapsed_milliseconds = 0
file = phd-tests/runner/src/fixtures.rs
line = 41
target = phd_runner::fixtures
|
| 14 | 2026-10-03T05:49:53.965Z | INFO | phd-runner: [TEST - START]
file = phd-tests/tests/src/migrate.rs
line = 40
path = phd_tests::migrate::from_base::serial_history
target = phd_tests::migrate::from_base
|
| 15 | 2026-10-03T05:49:53.966Z | DEBG | phd-runner: [TEST - EVENT] checking for existing copy of artifact
file = phd-tests/framework/src/artifacts/store.rs
line = 89
maybe_path = /phd-artifacts/740187046a7267d0de72d3455070333547dbc0ea023531471fb2b2a61effa448/OVMF_CODE.fd
path = phd_tests::migrate::from_base::serial_history
target = phd_framework::artifacts::store
|
| 16 | 2026-10-03T05:49:53.968Z | DEBG | phd-runner: [TEST - EVENT] Downloading file from Buildomat...
file = phd-tests/framework/src/artifacts/buildomat.rs
line = 215
path = phd_tests::migrate::from_base::serial_history
target = phd_framework::artifacts::buildomat
timeout = 600s
uri = https://buildomat.eng.oxide.computer/public/file/oxidecomputer/edk2/image_debug/bf64f45b1a58e69d126a3c6ca1e4512c88668132/OVMF_CODE.fd
|
| 17 | 2026-10-03T05:49:54.452Z | DEBG | phd-runner: [TEST - EVENT] checking for existing copy of artifact
file = phd-tests/framework/src/artifacts/store.rs
line = 89
maybe_path = /phd-artifacts/ba8007f74f9b54fbae3b2520da577831b4834778a498d732f091260c61aa7ca1/alpine.iso
path = phd_tests::migrate::from_base::serial_history
target = phd_framework::artifacts::store
|
| 18 | 2026-10-03T05:49:54.466Z | DEBG | phd-runner: [TEST - EVENT] Downloading alpine.iso from https://oxide-omicron-build.s3.amazonaws.com/alpine.iso
file = phd-tests/framework/src/artifacts/store.rs
line = 614
path = phd_tests::migrate::from_base::serial_history
target = phd_framework::artifacts::store
timeout = 600s
|
| 19 | 2026-10-03T05:50:01.146Z | DEBG | phd-runner: [TEST - EVENT] Verified artifact already exists
file = phd-tests/framework/src/artifacts/store.rs
line = 45
path = /phd-artifacts/ba8007f74f9b54fbae3b2520da577831b4834778a498d732f091260c61aa7ca1/alpine.iso
target = phd_framework::artifacts::store
|
| 20 | 2026-10-03T05:50:01.146Z | DEBG | phd-runner: [TEST - EVENT] executing ZFS command
args = ["/phd-artifacts/ba8007f74f9b54fbae3b2520da577831b4834778a498d732f091260c61aa7ca1/alpine.iso"]
file = phd-tests/framework/src/zfs.rs
line = 304
path = phd_tests::migrate::from_base::serial_history
target = phd_framework::zfs
verb = list
|
| 21 | 2026-10-03T05:50:01.162Z | DEBG | phd-runner: [TEST - EVENT] parsing zfs list output
file = phd-tests/framework/src/zfs.rs
line = 238
path = phd_tests::migrate::from_base::serial_history
stdout = NAME USED AVAIL REFER MOUNTPOINT\nphd-artifacts 3.52M 25.3T 2M /phd-artifacts\n
target = phd_framework::zfs
|
| 22 | 2026-10-03T05:50:01.164Z | DEBG | phd-runner: [TEST - EVENT] executing ZFS command
args = ["phd-artifacts@phd-c578fed4-f802-4444-8fae-adb2e1d58a75"]
file = phd-tests/framework/src/zfs.rs
line = 304
path = phd_tests::migrate::from_base::serial_history
target = phd_framework::zfs
verb = snapshot
|
| 23 | 2026-10-03T05:50:01.187Z | DEBG | phd-runner: [TEST - EVENT] executing ZFS command
args = ["phd-artifacts@phd-c578fed4-f802-4444-8fae-adb2e1d58a75", "phd-artifacts/phd-clone-f18a6245-9d12-4228-84c6-c41f547d04ac"]
file = phd-tests/framework/src/zfs.rs
line = 304
path = phd_tests::migrate::from_base::serial_history
target = phd_framework::zfs
verb = clone
|
| 24 | 2026-10-03T05:50:01.204Z | DEBG | phd-runner: [TEST - EVENT] executing ZFS command
args = ["phd-artifacts/phd-clone-f18a6245-9d12-4228-84c6-c41f547d04ac"]
file = phd-tests/framework/src/zfs.rs
line = 304
path = phd_tests::migrate::from_base::serial_history
target = phd_framework::zfs
verb = list
|
| 25 | 2026-10-03T05:50:01.214Z | DEBG | phd-runner: [TEST - EVENT] parsing zfs list output
file = phd-tests/framework/src/zfs.rs
line = 238
path = phd_tests::migrate::from_base::serial_history
stdout = NAME USED AVAIL REFER MOUNTPOINT\nphd-artifacts/phd-clone-f18a6245-9d12-4228-84c6-c41f547d04ac 0B 25.3T 49.0M /phd-artifacts/phd-clone-f18a6245-9d12-4228-84c6-c41f547d04ac\n
target = phd_framework::zfs
|
| 26 | 2026-10-03T05:50:01.218Z | INFO | phd-runner: [NEW - START]
file = phd-tests/framework/src/test_vm/mod.rs
line = 300
path = phd_tests::migrate::from_base::serial_history
target = phd_framework::test_vm
|
| 27 | 2026-10-03T05:50:01.219Z | INFO | phd-runner: [NEW - EVENT] phd_framework::test_vm
environment = EnvironmentSpec { location: Local, propolis_artifact: "__BASE_PROPOLIS", metrics: None }
file = phd-tests/framework/src/test_vm/mod.rs
guest_os_kind = Alpine
line = 318
path = phd_tests::migrate::from_base::serial_history
target = phd_framework::test_vm
vm_name = migration_serial_history_base
|
| 28 | 2026-10-03T05:50:01.219Z | DEBG | phd-runner: [NEW - EVENT] checking for existing copy of artifact
file = phd-tests/framework/src/artifacts/store.rs
line = 89
maybe_path = /phd-artifacts/307d7cf409a11795bd2f449aff90849e1cd9fd6e26ea2c6267e3110786362da9/propolis-server.tar.gz
path = phd_tests::migrate::from_base::serial_history
target = phd_framework::artifacts::store
|
| 29 | 2026-10-03T05:50:01.219Z | DEBG | phd-runner: [NEW - EVENT] Downloading file from Buildomat...
file = phd-tests/framework/src/artifacts/buildomat.rs
line = 215
path = phd_tests::migrate::from_base::serial_history
target = phd_framework::artifacts::buildomat
timeout = 600s
uri = https://buildomat.eng.oxide.computer/public/file/oxidecomputer/propolis/phd_build/cef309aad286c420de79cef93b734d7e73b341f0/propolis-server.tar.gz
|
| 30 | 2026-10-03T05:50:17.082Z | DEBG | phd-runner: [NEW - EVENT] Extracting artifact from tarball
extracted_path = /phd-artifacts/307d7cf409a11795bd2f449aff90849e1cd9fd6e26ea2c6267e3110786362da9/propolis-server
file = phd-tests/framework/src/artifacts/store.rs
line = 160
path = phd_tests::migrate::from_base::serial_history
target = phd_framework::artifacts::store
untar_path = propolis-server
|
| 31 | 2026-10-03T05:50:17.082Z | DEBG | phd-runner: [NEW - EVENT] Extracting gzipped tarball...
file = phd-tests/framework/src/artifacts/store.rs
line = 514
path = phd_tests::migrate::from_base::serial_history
target = phd_framework::artifacts::store
|
| 32 | 2026-10-03T05:50:41.875Z | INFO | phd-runner: [NEW - EVENT] Launching Propolis server
bootrom_path = "/phd-artifacts/740187046a7267d0de72d3455070333547dbc0ea023531471fb2b2a61effa448/OVMF_CODE.fd"
file = phd-tests/framework/src/test_vm/server.rs
line = 66
path = phd_tests::migrate::from_base::serial_history
server_addr = 127.0.0.1:9000
server_path = "/phd-artifacts/307d7cf409a11795bd2f449aff90849e1cd9fd6e26ea2c6267e3110786362da9/propolis-server"
target = phd_framework::test_vm::server
|
| 33 | 2026-10-03T05:50:41.875Z | INFO | phd-runner: [NEW - EVENT] Opening server log files
file = phd-tests/framework/src/log_config.rs
line = 84
path = phd_tests::migrate::from_base::serial_history
stderr_path = "/tmp/propolis-phd/phd_tests::migrate::from_base::serial_history/migration_serial_history_base.stderr.log"
stdout_path = "/tmp/propolis-phd/phd_tests::migrate::from_base::serial_history/migration_serial_history_base.stdout.log"
target = phd_framework::log_config
|
| 34 | 2026-10-03T05:50:41.992Z | INFO | phd-runner: [NEW - EVENT] Launched server with pid 917
file = phd-tests/framework/src/test_vm/server.rs
line = 127
path = phd_tests::migrate::from_base::serial_history
target = phd_framework::test_vm::server
|
| 35 | 2026-10-03T05:50:42.008Z | INFO | phd-runner: [INSTANCE_ENSURE_INTERNAL - START]
file = phd-tests/framework/src/test_vm/mod.rs
line = 412
path = phd_tests::migrate::from_base::serial_history
target = phd_framework::test_vm
vm = migration_serial_history_base
vm_id = 713e6e50-517b-4c19-810d-53a9972e98a9
|
| 36 | 2026-10-03T05:50:42.020Z | INFO | phd-runner: [INSTANCE_ENSURE_INTERNAL - EVENT] retriable error from instance_spec_ensure
e = Communication Error: error sending request for url (http://127.0.0.1:9000/instance)
file = phd-tests/framework/src/test_vm/mod.rs
line = 455
path = phd_tests::migrate::from_base::serial_history
target = phd_framework::test_vm
vm = migration_serial_history_base
vm_id = 713e6e50-517b-4c19-810d-53a9972e98a9
|
| 37 | 2026-10-03T05:50:42.024Z | INFO | phd-runner: [NEW - END]
elapsed_milliseconds = 40805
file = phd-tests/framework/src/test_vm/mod.rs
line = 300
path = phd_tests::migrate::from_base::serial_history
target = phd_framework::test_vm
|
| 38 | 2026-10-03T05:50:42.518Z | INFO | phd-runner: [SERIAL CONSOLE TASK - START]
file = phd-tests/framework/src/serial/mod.rs
line = 200
target = phd_framework::serial
|
| 39 | 2026-10-03T05:50:42.525Z | INFO | phd-runner: [INSTANCE_ENSURE_INTERNAL - EVENT] Started instance
file = phd-tests/framework/src/test_vm/mod.rs
instance_description.instance = Instance { properties: InstanceProperties { id: 713e6e50-517b-4c19-810d-53a9972e98a9, name: "phd-vm-713e6e50-517b-4c19-810d-53a9972e98a9", description: "Pheidippides-managed VM", metadata: InstanceMetadata { silo_id: 1fef43db-a9ba-4f7e-ae4b-5d2eeef1e389, project_id: 5eedf955-1f10-4ae1-8a22-67de709fcccd, sled_id: 758bd4f8-9e24-4ed5-981c-3208c0ec2691, sled_serial: "758bd4f8-9e24-4ed5-981c-3208c0ec2691", sled_revision: 1, sled_model: "pheidippes" } }, state: Creating }
line = 514
path = phd_tests::migrate::from_base::serial_history
target = phd_framework::test_vm
vm = migration_serial_history_base
vm_id = 713e6e50-517b-4c19-810d-53a9972e98a9
|
| 40 | 2026-10-03T05:50:42.525Z | INFO | phd-runner: [PUT_INSTANCE_STATE - START]
file = phd-tests/framework/src/test_vm/mod.rs
line = 575
path = phd_tests::migrate::from_base::serial_history
target = phd_framework::test_vm
vm = migration_serial_history_base
vm_id = 713e6e50-517b-4c19-810d-53a9972e98a9
|
| 41 | 2026-10-03T05:50:42.525Z | INFO | phd-runner: [PUT_INSTANCE_STATE - EVENT] Requesting instance state change
file = phd-tests/framework/src/test_vm/mod.rs
line = 580
path = phd_tests::migrate::from_base::serial_history
state = Run
target = phd_framework::test_vm
vm = migration_serial_history_base
vm_id = 713e6e50-517b-4c19-810d-53a9972e98a9
|
| 42 | 2026-10-03T05:50:42.528Z | INFO | phd-runner: [PUT_INSTANCE_STATE - END]
elapsed_milliseconds = 2
file = phd-tests/framework/src/test_vm/mod.rs
line = 575
path = phd_tests::migrate::from_base::serial_history
target = phd_framework::test_vm
vm = migration_serial_history_base
vm_id = 713e6e50-517b-4c19-810d-53a9972e98a9
|
| 43 | 2026-10-03T05:50:42.528Z | INFO | phd-runner: [WAIT_TO_BOOT - START]
file = phd-tests/framework/src/test_vm/mod.rs
line = 890
path = phd_tests::migrate::from_base::serial_history
target = phd_framework::test_vm
|
| 44 | 2026-10-03T05:50:42.528Z | INFO | phd-runner: [WAIT_TO_BOOT - EVENT] waiting for guest to boot
file = phd-tests/framework/src/test_vm/mod.rs
line = 839
path = phd_tests::migrate::from_base::serial_history
target = phd_framework::test_vm
timeout_duration = 300s
vm = migration_serial_history_base
vm_id = 713e6e50-517b-4c19-810d-53a9972e98a9
|
| 45 | 2026-10-03T05:50:42.528Z | DEBG | phd-runner: [WAIT_TO_BOOT - EVENT] executing command in boot sequence
file = phd-tests/framework/src/test_vm/mod.rs
line = 847
path = phd_tests::migrate::from_base::serial_history
step = WaitFor("localhost login: ")
target = phd_framework::test_vm
|
| 46 | 2026-10-03T05:50:42.528Z | INFO | phd-runner: [WAIT_FOR_SERIAL_OUTPUT - START]
file = phd-tests/framework/src/test_vm/mod.rs
line = 913
path = phd_tests::migrate::from_base::serial_history
target = phd_framework::test_vm
vm = migration_serial_history_base
vm_id = 713e6e50-517b-4c19-810d-53a9972e98a9
|
| 47 | 2026-10-03T05:50:42.528Z | INFO | phd-runner: [WAIT_FOR_SERIAL_OUTPUT - EVENT] Waiting for output on serial console
file = phd-tests/framework/src/test_vm/mod.rs
line = 920
path = phd_tests::migrate::from_base::serial_history
target = phd_framework::test_vm
timeout_duration = CallerTimeout
vm = migration_serial_history_base
vm_id = 713e6e50-517b-4c19-810d-53a9972e98a9
|
| 48 | 2026-10-03T05:50:47.082Z | INFO | phd-runner: [WAIT_FOR_SERIAL_OUTPUT - END]
elapsed_milliseconds = 4553
file = phd-tests/framework/src/test_vm/mod.rs
line = 913
path = phd_tests::migrate::from_base::serial_history
target = phd_framework::test_vm
vm = migration_serial_history_base
vm_id = 713e6e50-517b-4c19-810d-53a9972e98a9
|
| 49 | 2026-10-03T05:50:47.082Z | DEBG | phd-runner: [WAIT_TO_BOOT - EVENT] executing command in boot sequence
file = phd-tests/framework/src/test_vm/mod.rs
line = 847
path = phd_tests::migrate::from_base::serial_history
step = WriteStr("root")
target = phd_framework::test_vm
|
| 50 | 2026-10-03T05:50:47.086Z | DEBG | phd-runner: [WAIT_TO_BOOT - EVENT] executing command in boot sequence
file = phd-tests/framework/src/test_vm/mod.rs
line = 847
path = phd_tests::migrate::from_base::serial_history
step = WaitFor("localhost:~#")
target = phd_framework::test_vm
|
| 51 | 2026-10-03T05:50:47.086Z | INFO | phd-runner: [WAIT_FOR_SERIAL_OUTPUT - START]
file = phd-tests/framework/src/test_vm/mod.rs
line = 913
path = phd_tests::migrate::from_base::serial_history
target = phd_framework::test_vm
vm = migration_serial_history_base
vm_id = 713e6e50-517b-4c19-810d-53a9972e98a9
|
| 52 | 2026-10-03T05:50:47.086Z | INFO | phd-runner: [WAIT_FOR_SERIAL_OUTPUT - EVENT] Waiting for output on serial console
file = phd-tests/framework/src/test_vm/mod.rs
line = 920
path = phd_tests::migrate::from_base::serial_history
target = phd_framework::test_vm
timeout_duration = CallerTimeout
vm = migration_serial_history_base
vm_id = 713e6e50-517b-4c19-810d-53a9972e98a9
|
| 53 | 2026-10-03T05:50:47.112Z | INFO | phd-runner: [WAIT_FOR_SERIAL_OUTPUT - END]
elapsed_milliseconds = 25
file = phd-tests/framework/src/test_vm/mod.rs
line = 913
path = phd_tests::migrate::from_base::serial_history
target = phd_framework::test_vm
vm = migration_serial_history_base
vm_id = 713e6e50-517b-4c19-810d-53a9972e98a9
|
| 54 | 2026-10-03T05:50:47.112Z | DEBG | phd-runner: [WAIT_TO_BOOT - EVENT] executing command in boot sequence
file = phd-tests/framework/src/test_vm/mod.rs
line = 847
path = phd_tests::migrate::from_base::serial_history
step = WriteStr("stty -F `tty` cols 9999")
target = phd_framework::test_vm
|
| 55 | 2026-10-03T05:50:47.112Z | DEBG | phd-runner: [WAIT_TO_BOOT - EVENT] executing command in boot sequence
file = phd-tests/framework/src/test_vm/mod.rs
line = 847
path = phd_tests::migrate::from_base::serial_history
step = WaitFor("localhost:~#")
target = phd_framework::test_vm
|
| 56 | 2026-10-03T05:50:47.112Z | INFO | phd-runner: [WAIT_FOR_SERIAL_OUTPUT - START]
file = phd-tests/framework/src/test_vm/mod.rs
line = 913
path = phd_tests::migrate::from_base::serial_history
target = phd_framework::test_vm
vm = migration_serial_history_base
vm_id = 713e6e50-517b-4c19-810d-53a9972e98a9
|
| 57 | 2026-10-03T05:50:47.112Z | INFO | phd-runner: [WAIT_FOR_SERIAL_OUTPUT - EVENT] Waiting for output on serial console
file = phd-tests/framework/src/test_vm/mod.rs
line = 920
path = phd_tests::migrate::from_base::serial_history
target = phd_framework::test_vm
timeout_duration = CallerTimeout
vm = migration_serial_history_base
vm_id = 713e6e50-517b-4c19-810d-53a9972e98a9
|
| 58 | 2026-10-03T05:50:47.145Z | INFO | phd-runner: [WAIT_FOR_SERIAL_OUTPUT - END]
elapsed_milliseconds = 32
file = phd-tests/framework/src/test_vm/mod.rs
line = 913
path = phd_tests::migrate::from_base::serial_history
target = phd_framework::test_vm
vm = migration_serial_history_base
vm_id = 713e6e50-517b-4c19-810d-53a9972e98a9
|
| 59 | 2026-10-03T05:50:47.145Z | INFO | phd-runner: [WAIT_TO_BOOT - EVENT] Guest has booted
file = phd-tests/framework/src/test_vm/mod.rs
line = 887
path = phd_tests::migrate::from_base::serial_history
target = phd_framework::test_vm
|
| 60 | 2026-10-03T05:50:47.145Z | INFO | phd-runner: [WAIT_TO_BOOT - END]
elapsed_milliseconds = 4617
file = phd-tests/framework/src/test_vm/mod.rs
line = 890
path = phd_tests::migrate::from_base::serial_history
target = phd_framework::test_vm
|
| 61 | 2026-10-03T05:50:47.146Z | INFO | phd-runner: [WAIT_FOR_SERIAL_OUTPUT - START]
file = phd-tests/framework/src/test_vm/mod.rs
line = 913
path = phd_tests::migrate::from_base::serial_history
target = phd_framework::test_vm
vm = migration_serial_history_base
vm_id = 713e6e50-517b-4c19-810d-53a9972e98a9
|
| 62 | 2026-10-03T05:50:47.146Z | INFO | phd-runner: [WAIT_FOR_SERIAL_OUTPUT - EVENT] Waiting for output on serial console
file = phd-tests/framework/src/test_vm/mod.rs
line = 920
path = phd_tests::migrate::from_base::serial_history
target = phd_framework::test_vm
timeout_duration = Explicit(15s)
vm = migration_serial_history_base
vm_id = 713e6e50-517b-4c19-810d-53a9972e98a9
|
| 63 | 2026-10-03T05:50:47.156Z | INFO | phd-runner: [WAIT_FOR_SERIAL_OUTPUT - END]
elapsed_milliseconds = 10
file = phd-tests/framework/src/test_vm/mod.rs
line = 913
path = phd_tests::migrate::from_base::serial_history
target = phd_framework::test_vm
vm = migration_serial_history_base
vm_id = 713e6e50-517b-4c19-810d-53a9972e98a9
|
| 64 | 2026-10-03T05:50:47.157Z | INFO | phd-runner: [WAIT_FOR_SERIAL_OUTPUT - START]
file = phd-tests/framework/src/test_vm/mod.rs
line = 913
path = phd_tests::migrate::from_base::serial_history
target = phd_framework::test_vm
vm = migration_serial_history_base
vm_id = 713e6e50-517b-4c19-810d-53a9972e98a9
|
| 65 | 2026-10-03T05:50:47.157Z | INFO | phd-runner: [WAIT_FOR_SERIAL_OUTPUT - EVENT] Waiting for output on serial console
file = phd-tests/framework/src/test_vm/mod.rs
line = 920
path = phd_tests::migrate::from_base::serial_history
target = phd_framework::test_vm
timeout_duration = Explicit(300s)
vm = migration_serial_history_base
vm_id = 713e6e50-517b-4c19-810d-53a9972e98a9
|
| 66 | 2026-10-03T05:50:47.190Z | INFO | phd-runner: [WAIT_FOR_SERIAL_OUTPUT - END]
elapsed_milliseconds = 33
file = phd-tests/framework/src/test_vm/mod.rs
line = 913
path = phd_tests::migrate::from_base::serial_history
target = phd_framework::test_vm
vm = migration_serial_history_base
vm_id = 713e6e50-517b-4c19-810d-53a9972e98a9
|
| 67 | 2026-10-03T05:50:47.190Z | INFO | phd-runner: [WAIT_FOR_SERIAL_OUTPUT - START]
file = phd-tests/framework/src/test_vm/mod.rs
line = 913
path = phd_tests::migrate::from_base::serial_history
target = phd_framework::test_vm
vm = migration_serial_history_base
vm_id = 713e6e50-517b-4c19-810d-53a9972e98a9
|
| 68 | 2026-10-03T05:50:47.190Z | INFO | phd-runner: [WAIT_FOR_SERIAL_OUTPUT - EVENT] Waiting for output on serial console
file = phd-tests/framework/src/test_vm/mod.rs
line = 920
path = phd_tests::migrate::from_base::serial_history
target = phd_framework::test_vm
timeout_duration = Explicit(15s)
vm = migration_serial_history_base
vm_id = 713e6e50-517b-4c19-810d-53a9972e98a9
|
| 69 | 2026-10-03T05:50:47.201Z | INFO | phd-runner: [WAIT_FOR_SERIAL_OUTPUT - END]
elapsed_milliseconds = 10
file = phd-tests/framework/src/test_vm/mod.rs
line = 913
path = phd_tests::migrate::from_base::serial_history
target = phd_framework::test_vm
vm = migration_serial_history_base
vm_id = 713e6e50-517b-4c19-810d-53a9972e98a9
|
| 70 | 2026-10-03T05:50:47.201Z | INFO | phd-runner: [WAIT_FOR_SERIAL_OUTPUT - START]
file = phd-tests/framework/src/test_vm/mod.rs
line = 913
path = phd_tests::migrate::from_base::serial_history
target = phd_framework::test_vm
vm = migration_serial_history_base
vm_id = 713e6e50-517b-4c19-810d-53a9972e98a9
|
| 71 | 2026-10-03T05:50:47.201Z | INFO | phd-runner: [WAIT_FOR_SERIAL_OUTPUT - EVENT] Waiting for output on serial console
file = phd-tests/framework/src/test_vm/mod.rs
line = 920
path = phd_tests::migrate::from_base::serial_history
target = phd_framework::test_vm
timeout_duration = Explicit(300s)
vm = migration_serial_history_base
vm_id = 713e6e50-517b-4c19-810d-53a9972e98a9
|
| 72 | 2026-10-03T05:50:47.234Z | INFO | phd-runner: [WAIT_FOR_SERIAL_OUTPUT - END]
elapsed_milliseconds = 32
file = phd-tests/framework/src/test_vm/mod.rs
line = 913
path = phd_tests::migrate::from_base::serial_history
target = phd_framework::test_vm
vm = migration_serial_history_base
vm_id = 713e6e50-517b-4c19-810d-53a9972e98a9
|
| 73 | 2026-10-03T05:50:47.244Z | INFO | phd-runner: [TEST - EVENT] migrating to new Propolis artifact for lifecycle test
file = phd-tests/framework/src/lifecycle.rs
line = 73
path = phd_tests::migrate::from_base::serial_history
propolis_artifact = __DEFAULT_PROPOLIS
target = phd_framework::lifecycle
vm_name = migration_serial_history_base
|
| 74 | 2026-10-03T05:50:47.245Z | INFO | phd-runner: [NEW - START]
file = phd-tests/framework/src/test_vm/mod.rs
line = 300
path = phd_tests::migrate::from_base::serial_history
target = phd_framework::test_vm
|
| 75 | 2026-10-03T05:50:47.245Z | INFO | phd-runner: [NEW - EVENT] phd_framework::test_vm
environment = EnvironmentSpec { location: Local, propolis_artifact: "__DEFAULT_PROPOLIS", metrics: None }
file = phd-tests/framework/src/test_vm/mod.rs
guest_os_kind = Alpine
line = 318
path = phd_tests::migrate::from_base::serial_history
target = phd_framework::test_vm
vm_name = migration_serial_history_base_lifecycle_0
|
| 76 | 2026-10-03T05:50:47.245Z | DEBG | phd-runner: [NEW - EVENT] Examining locally-sourced artifact
file = phd-tests/framework/src/artifacts/store.rs
line = 56
path = /work/phd-test/propolis-server
sha256 = None
target = phd_framework::artifacts::store
|
| 77 | 2026-10-03T05:50:47.245Z | DEBG | phd-runner: [NEW - EVENT] Locally-sourced artifact is valid, caching its path
file = phd-tests/framework/src/artifacts/store.rs
line = 69
path = /work/phd-test/propolis-server
target = phd_framework::artifacts::store
|
| 78 | 2026-10-03T05:50:47.245Z | INFO | phd-runner: [NEW - EVENT] Launching Propolis server
bootrom_path = "/phd-artifacts/740187046a7267d0de72d3455070333547dbc0ea023531471fb2b2a61effa448/OVMF_CODE.fd"
file = phd-tests/framework/src/test_vm/server.rs
line = 66
path = phd_tests::migrate::from_base::serial_history
server_addr = 127.0.0.1:9002
server_path = "/work/phd-test/propolis-server"
target = phd_framework::test_vm::server
|
| 79 | 2026-10-03T05:50:47.245Z | INFO | phd-runner: [NEW - EVENT] Opening server log files
file = phd-tests/framework/src/log_config.rs
line = 84
path = phd_tests::migrate::from_base::serial_history
stderr_path = "/tmp/propolis-phd/phd_tests::migrate::from_base::serial_history/migration_serial_history_base_lifecycle_0.stderr.log"
stdout_path = "/tmp/propolis-phd/phd_tests::migrate::from_base::serial_history/migration_serial_history_base_lifecycle_0.stdout.log"
target = phd_framework::log_config
|
| 80 | 2026-10-03T05:50:47.290Z | INFO | phd-runner: [NEW - EVENT] Launched server with pid 918
file = phd-tests/framework/src/test_vm/server.rs
line = 127
path = phd_tests::migrate::from_base::serial_history
target = phd_framework::test_vm::server
|
| 81 | 2026-10-03T05:50:47.303Z | INFO | phd-runner: [NEW - END]
elapsed_milliseconds = 58
file = phd-tests/framework/src/test_vm/mod.rs
line = 300
path = phd_tests::migrate::from_base::serial_history
target = phd_framework::test_vm
|
| 82 | 2026-10-03T05:50:47.303Z | INFO | phd-runner: [MIGRATE_FROM - START]
file = phd-tests/framework/src/test_vm/mod.rs
line = 609
path = phd_tests::migrate::from_base::serial_history
source = migration_serial_history_base
source_id = 713e6e50-517b-4c19-810d-53a9972e98a9
target = phd_framework::test_vm
target_id = 37448c04-beca-47c1-91c7-5eb07bb65fd1
|
| 83 | 2026-10-03T05:50:47.304Z | INFO | phd-runner: [MIGRATE_FROM - EVENT] Migrating from source at address 127.0.0.1:9000
file = phd-tests/framework/src/test_vm/mod.rs
line = 642
migration_id = 782227ce-6ca0-4d1d-a177-b28e2ce6e832
path = phd_tests::migrate::from_base::serial_history
source = migration_serial_history_base
source_id = 713e6e50-517b-4c19-810d-53a9972e98a9
target = phd_framework::test_vm
target_id = 37448c04-beca-47c1-91c7-5eb07bb65fd1
timeout_duration = 45s
|
| 84 | 2026-10-03T05:50:47.304Z | INFO | phd-runner: [INSTANCE_ENSURE_INTERNAL - START]
file = phd-tests/framework/src/test_vm/mod.rs
line = 412
path = phd_tests::migrate::from_base::serial_history
source = migration_serial_history_base
source_id = 713e6e50-517b-4c19-810d-53a9972e98a9
target = phd_framework::test_vm
target_id = 37448c04-beca-47c1-91c7-5eb07bb65fd1
vm = migration_serial_history_base_lifecycle_0
vm_id = 37448c04-beca-47c1-91c7-5eb07bb65fd1
|
| 85 | 2026-10-03T05:50:47.304Z | INFO | phd-runner: [INSTANCE_ENSURE_INTERNAL - EVENT] retriable error from instance_spec_ensure
e = Communication Error: error sending request for url (http://127.0.0.1:9002/instance)
file = phd-tests/framework/src/test_vm/mod.rs
line = 455
path = phd_tests::migrate::from_base::serial_history
source = migration_serial_history_base
source_id = 713e6e50-517b-4c19-810d-53a9972e98a9
target = phd_framework::test_vm
target_id = 37448c04-beca-47c1-91c7-5eb07bb65fd1
vm = migration_serial_history_base_lifecycle_0
vm_id = 37448c04-beca-47c1-91c7-5eb07bb65fd1
|
| 86 | 2026-10-03T05:50:47.965Z | INFO | phd-runner: [INSTANCE_ENSURE_INTERNAL - EVENT] Started instance
file = phd-tests/framework/src/test_vm/mod.rs
instance_description.instance = Instance { properties: InstanceProperties { id: 37448c04-beca-47c1-91c7-5eb07bb65fd1, name: "phd-vm-37448c04-beca-47c1-91c7-5eb07bb65fd1", description: "Pheidippides-managed VM", metadata: InstanceMetadata { silo_id: 1fef43db-a9ba-4f7e-ae4b-5d2eeef1e389, project_id: 5eedf955-1f10-4ae1-8a22-67de709fcccd, sled_id: aacd1c80-4c7c-4817-bc21-303402e830b2, sled_serial: "aacd1c80-4c7c-4817-bc21-303402e830b2", sled_revision: 1, sled_model: "pheidippes" } }, state: Migrating }
line = 514
path = phd_tests::migrate::from_base::serial_history
source = migration_serial_history_base
source_id = 713e6e50-517b-4c19-810d-53a9972e98a9
target = phd_framework::test_vm
target_id = 37448c04-beca-47c1-91c7-5eb07bb65fd1
vm = migration_serial_history_base_lifecycle_0
vm_id = 37448c04-beca-47c1-91c7-5eb07bb65fd1
|
| 87 | 2026-10-03T05:50:47.966Z | INFO | phd-runner: [MIGRATE - START]
file = phd-tests/framework/src/test_vm/mod.rs
line = 663
migration_id = 782227ce-6ca0-4d1d-a177-b28e2ce6e832
path = phd_tests::migrate::from_base::serial_history
source = migration_serial_history_base
source_id = 713e6e50-517b-4c19-810d-53a9972e98a9
target = phd_framework::test_vm
target_id = 37448c04-beca-47c1-91c7-5eb07bb65fd1
|
| 88 | 2026-10-03T05:50:50.443Z | INFO | phd-runner: [SERIAL CONSOLE TASK - EVENT] serial socket control message
file = phd-tests/framework/src/serial/mod.rs
line = 275
s = {"Migrating":{"destination":"127.0.0.1:9002","from_start":7756}}
target = phd_framework::serial
|
| 89 | 2026-10-03T05:50:50.929Z | INFO | phd-runner: [MIGRATE_FROM - EVENT] Migration completed successfully
file = phd-tests/framework/src/test_vm/mod.rs
line = 676
path = phd_tests::migrate::from_base::serial_history
source = migration_serial_history_base
source_id = 713e6e50-517b-4c19-810d-53a9972e98a9
target = phd_framework::test_vm
target_id = 37448c04-beca-47c1-91c7-5eb07bb65fd1
|
| 90 | 2026-10-03T05:50:50.930Z | INFO | phd-runner: [MIGRATE - END]
elapsed_milliseconds = 2963
file = phd-tests/framework/src/test_vm/mod.rs
line = 663
migration_id = 782227ce-6ca0-4d1d-a177-b28e2ce6e832
path = phd_tests::migrate::from_base::serial_history
source = migration_serial_history_base
source_id = 713e6e50-517b-4c19-810d-53a9972e98a9
target = phd_framework::test_vm
target_id = 37448c04-beca-47c1-91c7-5eb07bb65fd1
|
| 91 | 2026-10-03T05:50:50.932Z | INFO | phd-runner: [VM CLEANUP - START]
file = phd-tests/framework/src/test_vm/mod.rs
line = 1172
path = phd_tests::migrate::from_base::serial_history
target = phd_framework::test_vm
vm = migration_serial_history_base
vm_id = 713e6e50-517b-4c19-810d-53a9972e98a9
|
| 92 | 2026-10-03T05:50:50.937Z | DEBG | phd-runner: [VM CLEANUP - EVENT] Killing Propolis server process
file = phd-tests/framework/src/test_vm/server.rs
line = 177
path = phd_tests::migrate::from_base::serial_history
self.address = 127.0.0.1:9000
target = phd_framework::test_vm::server
vm = migration_serial_history_base
vm_id = 713e6e50-517b-4c19-810d-53a9972e98a9
|
| 93 | 2026-10-03T05:50:50.942Z | INFO | phd-runner: [VM CLEANUP - START]
file = phd-tests/framework/src/test_vm/mod.rs
line = 1172
path = phd_tests::migrate::from_base::serial_history
target = phd_framework::test_vm
vm = migration_serial_history_base_lifecycle_0
vm_id = 37448c04-beca-47c1-91c7-5eb07bb65fd1
|
| 94 | 2026-10-03T05:50:50.942Z | DEBG | phd-runner: [SERIAL CONSOLE TASK - EVENT] serial console command channel was closed
file = phd-tests/framework/src/serial/mod.rs
line = 213
target = phd_framework::serial
|
| 95 | 2026-10-03T05:50:50.944Z | DEBG | phd-runner: [VM CLEANUP - EVENT] trying to ensure Propolis server VM is destroyed
file = phd-tests/framework/src/test_vm/mod.rs
line = 1195
path = phd_tests::migrate::from_base::serial_history
target = phd_framework::test_vm
vm = migration_serial_history_base_lifecycle_0
vm_id = 37448c04-beca-47c1-91c7-5eb07bb65fd1
|
| 96 | 2026-10-03T05:50:50.944Z | INFO | phd-runner: [SERIAL CONSOLE TASK - END]
elapsed_milliseconds = 8425
file = phd-tests/framework/src/serial/mod.rs
line = 200
target = phd_framework::serial
|
| 97 | 2026-10-03T05:50:50.945Z | INFO | phd-runner: test phd_tests::migrate::from_base::serial_history ... ok
file = phd-tests/runner/src/execute.rs
line = 141
target = phd_runner::execute
|
| 98 | 2026-10-03T05:50:50.945Z | INFO | phd-runner: [TEST_CLEANUP - START]
file = phd-tests/runner/src/fixtures.rs
line = 51
target = phd_runner::fixtures
|
| 99 | 2026-10-03T05:50:51.012Z | INFO | phd-runner: [VM CLEANUP - END]
elapsed_milliseconds = 76
file = phd-tests/framework/src/test_vm/mod.rs
line = 1172
path = phd_tests::migrate::from_base::serial_history
target = phd_framework::test_vm
vm = migration_serial_history_base
vm_id = 713e6e50-517b-4c19-810d-53a9972e98a9
|
| 100 | 2026-10-03T05:50:51.012Z | INFO | phd-runner: [INSTANCE_ENSURE_INTERNAL - END]
elapsed_milliseconds = 9004
file = phd-tests/framework/src/test_vm/mod.rs
line = 412
path = phd_tests::migrate::from_base::serial_history
target = phd_framework::test_vm
vm = migration_serial_history_base
vm_id = 713e6e50-517b-4c19-810d-53a9972e98a9
|
| 101 | 2026-10-03T05:50:51.377Z | DEBG | phd-runner: [VM CLEANUP - EVENT] Killing Propolis server process
file = phd-tests/framework/src/test_vm/server.rs
line = 177
path = phd_tests::migrate::from_base::serial_history
self.address = 127.0.0.1:9002
target = phd_framework::test_vm::server
vm = migration_serial_history_base_lifecycle_0
vm_id = 37448c04-beca-47c1-91c7-5eb07bb65fd1
|
| 102 | 2026-10-03T05:50:51.481Z | DEBG | phd-runner: [VM CLEANUP - EVENT] zfs clone dropped
file = phd-tests/framework/src/zfs.rs
line = 83
path = phd_tests::migrate::from_base::serial_history
target = phd_framework::zfs
vm = migration_serial_history_base_lifecycle_0
vm_id = 37448c04-beca-47c1-91c7-5eb07bb65fd1
|
| 103 | 2026-10-03T05:50:51.481Z | DEBG | phd-runner: [VM CLEANUP - EVENT] executing ZFS command
args = ["phd-artifacts/phd-clone-f18a6245-9d12-4228-84c6-c41f547d04ac"]
file = phd-tests/framework/src/zfs.rs
line = 304
path = phd_tests::migrate::from_base::serial_history
target = phd_framework::zfs
verb = destroy
vm = migration_serial_history_base_lifecycle_0
vm_id = 37448c04-beca-47c1-91c7-5eb07bb65fd1
|
| 104 | 2026-10-03T05:50:51.509Z | DEBG | phd-runner: [VM CLEANUP - EVENT] zfs snapshot dropped
file = phd-tests/framework/src/zfs.rs
line = 57
path = phd_tests::migrate::from_base::serial_history
target = phd_framework::zfs
vm = migration_serial_history_base_lifecycle_0
vm_id = 37448c04-beca-47c1-91c7-5eb07bb65fd1
|
| 105 | 2026-10-03T05:50:51.509Z | DEBG | phd-runner: [VM CLEANUP - EVENT] executing ZFS command
args = ["phd-artifacts@phd-c578fed4-f802-4444-8fae-adb2e1d58a75"]
file = phd-tests/framework/src/zfs.rs
line = 304
path = phd_tests::migrate::from_base::serial_history
target = phd_framework::zfs
verb = destroy
vm = migration_serial_history_base_lifecycle_0
vm_id = 37448c04-beca-47c1-91c7-5eb07bb65fd1
|
| 106 | 2026-10-03T05:50:51.528Z | INFO | phd-runner: [VM CLEANUP - END]
elapsed_milliseconds = 586
file = phd-tests/framework/src/test_vm/mod.rs
line = 1172
path = phd_tests::migrate::from_base::serial_history
target = phd_framework::test_vm
vm = migration_serial_history_base_lifecycle_0
vm_id = 37448c04-beca-47c1-91c7-5eb07bb65fd1
|
| 107 | 2026-10-03T05:50:51.528Z | INFO | phd-runner: [INSTANCE_ENSURE_INTERNAL - END]
elapsed_milliseconds = 4224
file = phd-tests/framework/src/test_vm/mod.rs
line = 412
path = phd_tests::migrate::from_base::serial_history
source = migration_serial_history_base
source_id = 713e6e50-517b-4c19-810d-53a9972e98a9
target = phd_framework::test_vm
target_id = 37448c04-beca-47c1-91c7-5eb07bb65fd1
vm = migration_serial_history_base_lifecycle_0
vm_id = 37448c04-beca-47c1-91c7-5eb07bb65fd1
|
| 108 | 2026-10-03T05:50:51.529Z | INFO | phd-runner: [MIGRATE_FROM - END]
elapsed_milliseconds = 4225
file = phd-tests/framework/src/test_vm/mod.rs
line = 609
path = phd_tests::migrate::from_base::serial_history
source = migration_serial_history_base
source_id = 713e6e50-517b-4c19-810d-53a9972e98a9
target = phd_framework::test_vm
target_id = 37448c04-beca-47c1-91c7-5eb07bb65fd1
|
| 109 | 2026-10-03T05:50:51.529Z | INFO | phd-runner: [TEST - END]
elapsed_milliseconds = 57562
file = phd-tests/tests/src/migrate.rs
line = 40
path = phd_tests::migrate::from_base::serial_history
target = phd_tests::migrate::from_base
|
| 110 | 2026-10-03T05:50:51.529Z | INFO | phd-runner: [TEST_CLEANUP - END]
elapsed_milliseconds = 584
file = phd-tests/runner/src/fixtures.rs
line = 51
target = phd_runner::fixtures
|
| 111 | 2026-10-03T05:50:51.529Z | INFO | phd-runner: Starting test phd_tests::migrate::from_base::can_migrate_from_base
file = phd-tests/runner/src/execute.rs
line = 91
target = phd_runner::execute
|
| 112 | 2026-10-03T05:50:51.529Z | INFO | phd-runner: [TEST_SETUP - START]
file = phd-tests/runner/src/fixtures.rs
line = 41
target = phd_runner::fixtures
|
| 113 | 2026-10-03T05:50:51.529Z | INFO | phd-runner: [TEST_SETUP - END]
elapsed_milliseconds = 0
file = phd-tests/runner/src/fixtures.rs
line = 41
target = phd_runner::fixtures
|
| 114 | 2026-10-03T05:50:51.529Z | INFO | phd-runner: [TEST - START]
file = phd-tests/tests/src/migrate.rs
line = 34
path = phd_tests::migrate::from_base::can_migrate_from_base
target = phd_tests::migrate::from_base
|
| 115 | 2026-10-03T05:50:51.529Z | DEBG | phd-runner: [TEST - EVENT] Verified artifact already exists
file = phd-tests/framework/src/artifacts/store.rs
line = 45
path = /phd-artifacts/740187046a7267d0de72d3455070333547dbc0ea023531471fb2b2a61effa448/OVMF_CODE.fd
target = phd_framework::artifacts::store
|
| 116 | 2026-10-03T05:50:51.530Z | DEBG | phd-runner: [TEST - EVENT] Verified artifact already exists
file = phd-tests/framework/src/artifacts/store.rs
line = 45
path = /phd-artifacts/ba8007f74f9b54fbae3b2520da577831b4834778a498d732f091260c61aa7ca1/alpine.iso
target = phd_framework::artifacts::store
|
| 117 | 2026-10-03T05:50:51.530Z | DEBG | phd-runner: [TEST - EVENT] Verified artifact already exists
file = phd-tests/framework/src/artifacts/store.rs
line = 45
path = /phd-artifacts/ba8007f74f9b54fbae3b2520da577831b4834778a498d732f091260c61aa7ca1/alpine.iso
target = phd_framework::artifacts::store
|
| 118 | 2026-10-03T05:50:51.530Z | DEBG | phd-runner: [TEST - EVENT] executing ZFS command
args = ["/phd-artifacts/ba8007f74f9b54fbae3b2520da577831b4834778a498d732f091260c61aa7ca1/alpine.iso"]
file = phd-tests/framework/src/zfs.rs
line = 304
path = phd_tests::migrate::from_base::can_migrate_from_base
target = phd_framework::zfs
verb = list
|
| 119 | 2026-10-03T05:50:51.540Z | DEBG | phd-runner: [TEST - EVENT] parsing zfs list output
file = phd-tests/framework/src/zfs.rs
line = 238
path = phd_tests::migrate::from_base::can_migrate_from_base
stdout = NAME USED AVAIL REFER MOUNTPOINT\nphd-artifacts 1.30G 25.3T 1.30G /phd-artifacts\n
target = phd_framework::zfs
|
| 120 | 2026-10-03T05:50:51.541Z | DEBG | phd-runner: [TEST - EVENT] executing ZFS command
args = ["phd-artifacts@phd-74355da4-0179-48e8-a622-24b3b35942ae"]
file = phd-tests/framework/src/zfs.rs
line = 304
path = phd_tests::migrate::from_base::can_migrate_from_base
target = phd_framework::zfs
verb = snapshot
|
| 121 | 2026-10-03T05:50:51.558Z | DEBG | phd-runner: [TEST - EVENT] executing ZFS command
args = ["phd-artifacts@phd-74355da4-0179-48e8-a622-24b3b35942ae", "phd-artifacts/phd-clone-03dd6d43-8273-4599-8570-a27dc2769969"]
file = phd-tests/framework/src/zfs.rs
line = 304
path = phd_tests::migrate::from_base::can_migrate_from_base
target = phd_framework::zfs
verb = clone
|
| 122 | 2026-10-03T05:50:51.576Z | DEBG | phd-runner: [TEST - EVENT] executing ZFS command
args = ["phd-artifacts/phd-clone-03dd6d43-8273-4599-8570-a27dc2769969"]
file = phd-tests/framework/src/zfs.rs
line = 304
path = phd_tests::migrate::from_base::can_migrate_from_base
target = phd_framework::zfs
verb = list
|
| 123 | 2026-10-03T05:50:51.586Z | DEBG | phd-runner: [TEST - EVENT] parsing zfs list output
file = phd-tests/framework/src/zfs.rs
line = 238
path = phd_tests::migrate::from_base::can_migrate_from_base
stdout = NAME USED AVAIL REFER MOUNTPOINT\nphd-artifacts/phd-clone-03dd6d43-8273-4599-8570-a27dc2769969 0B 25.3T 1.30G /phd-artifacts/phd-clone-03dd6d43-8273-4599-8570-a27dc2769969\n
target = phd_framework::zfs
|
| 124 | 2026-10-03T05:50:51.587Z | INFO | phd-runner: [NEW - START]
file = phd-tests/framework/src/test_vm/mod.rs
line = 300
path = phd_tests::migrate::from_base::can_migrate_from_base
target = phd_framework::test_vm
|
| 125 | 2026-10-03T05:50:51.587Z | INFO | phd-runner: [NEW - EVENT] phd_framework::test_vm
environment = EnvironmentSpec { location: Local, propolis_artifact: "__BASE_PROPOLIS", metrics: None }
file = phd-tests/framework/src/test_vm/mod.rs
guest_os_kind = Alpine
line = 318
path = phd_tests::migrate::from_base::can_migrate_from_base
target = phd_framework::test_vm
vm_name = migration_from_base
|
| 126 | 2026-10-03T05:50:51.587Z | DEBG | phd-runner: [NEW - EVENT] Verified artifact already exists
file = phd-tests/framework/src/artifacts/store.rs
line = 45
path = /phd-artifacts/307d7cf409a11795bd2f449aff90849e1cd9fd6e26ea2c6267e3110786362da9/propolis-server
target = phd_framework::artifacts::store
|
| 127 | 2026-10-03T05:50:51.587Z | INFO | phd-runner: [NEW - EVENT] Launching Propolis server
bootrom_path = "/phd-artifacts/740187046a7267d0de72d3455070333547dbc0ea023531471fb2b2a61effa448/OVMF_CODE.fd"
file = phd-tests/framework/src/test_vm/server.rs
line = 66
path = phd_tests::migrate::from_base::can_migrate_from_base
server_addr = 127.0.0.1:9000
server_path = "/phd-artifacts/307d7cf409a11795bd2f449aff90849e1cd9fd6e26ea2c6267e3110786362da9/propolis-server"
target = phd_framework::test_vm::server
|
| 128 | 2026-10-03T05:50:51.587Z | INFO | phd-runner: [NEW - EVENT] Opening server log files
file = phd-tests/framework/src/log_config.rs
line = 84
path = phd_tests::migrate::from_base::can_migrate_from_base
stderr_path = "/tmp/propolis-phd/phd_tests::migrate::from_base::can_migrate_from_base/migration_from_base.stderr.log"
stdout_path = "/tmp/propolis-phd/phd_tests::migrate::from_base::can_migrate_from_base/migration_from_base.stdout.log"
target = phd_framework::log_config
|
| 129 | 2026-10-03T05:50:51.628Z | INFO | phd-runner: [NEW - EVENT] Launched server with pid 927
file = phd-tests/framework/src/test_vm/server.rs
line = 127
path = phd_tests::migrate::from_base::can_migrate_from_base
target = phd_framework::test_vm::server
|
| 130 | 2026-10-03T05:50:51.643Z | INFO | phd-runner: [NEW - END]
elapsed_milliseconds = 55
file = phd-tests/framework/src/test_vm/mod.rs
line = 300
path = phd_tests::migrate::from_base::can_migrate_from_base
target = phd_framework::test_vm
|
| 131 | 2026-10-03T05:50:51.643Z | INFO | phd-runner: [INSTANCE_ENSURE_INTERNAL - START]
file = phd-tests/framework/src/test_vm/mod.rs
line = 412
path = phd_tests::migrate::from_base::can_migrate_from_base
target = phd_framework::test_vm
vm = migration_from_base
vm_id = b9a9cb14-a826-4c81-a906-93062c424b36
|
| 132 | 2026-10-03T05:50:51.643Z | INFO | phd-runner: [INSTANCE_ENSURE_INTERNAL - EVENT] retriable error from instance_spec_ensure
e = Communication Error: error sending request for url (http://127.0.0.1:9000/instance)
file = phd-tests/framework/src/test_vm/mod.rs
line = 455
path = phd_tests::migrate::from_base::can_migrate_from_base
target = phd_framework::test_vm
vm = migration_from_base
vm_id = b9a9cb14-a826-4c81-a906-93062c424b36
|
| 133 | 2026-10-03T05:50:52.422Z | INFO | phd-runner: [SERIAL CONSOLE TASK - START]
file = phd-tests/framework/src/serial/mod.rs
line = 200
target = phd_framework::serial
|
| 134 | 2026-10-03T05:50:52.424Z | INFO | phd-runner: [INSTANCE_ENSURE_INTERNAL - EVENT] Started instance
file = phd-tests/framework/src/test_vm/mod.rs
instance_description.instance = Instance { properties: InstanceProperties { id: b9a9cb14-a826-4c81-a906-93062c424b36, name: "phd-vm-b9a9cb14-a826-4c81-a906-93062c424b36", description: "Pheidippides-managed VM", metadata: InstanceMetadata { silo_id: 48406fbc-45a9-4645-94d3-41b019078bc5, project_id: c2c4032e-763f-4ccc-b741-993b02fc7cdb, sled_id: 3992463f-6843-4192-ae88-44ea0b400d7b, sled_serial: "3992463f-6843-4192-ae88-44ea0b400d7b", sled_revision: 1, sled_model: "pheidippes" } }, state: Creating }
line = 514
path = phd_tests::migrate::from_base::can_migrate_from_base
target = phd_framework::test_vm
vm = migration_from_base
vm_id = b9a9cb14-a826-4c81-a906-93062c424b36
|
| 135 | 2026-10-03T05:50:52.424Z | INFO | phd-runner: [PUT_INSTANCE_STATE - START]
file = phd-tests/framework/src/test_vm/mod.rs
line = 575
path = phd_tests::migrate::from_base::can_migrate_from_base
target = phd_framework::test_vm
vm = migration_from_base
vm_id = b9a9cb14-a826-4c81-a906-93062c424b36
|
| 136 | 2026-10-03T05:50:52.424Z | INFO | phd-runner: [PUT_INSTANCE_STATE - EVENT] Requesting instance state change
file = phd-tests/framework/src/test_vm/mod.rs
line = 580
path = phd_tests::migrate::from_base::can_migrate_from_base
state = Run
target = phd_framework::test_vm
vm = migration_from_base
vm_id = b9a9cb14-a826-4c81-a906-93062c424b36
|
| 137 | 2026-10-03T05:50:52.425Z | INFO | phd-runner: [PUT_INSTANCE_STATE - END]
elapsed_milliseconds = 1
file = phd-tests/framework/src/test_vm/mod.rs
line = 575
path = phd_tests::migrate::from_base::can_migrate_from_base
target = phd_framework::test_vm
vm = migration_from_base
vm_id = b9a9cb14-a826-4c81-a906-93062c424b36
|
| 138 | 2026-10-03T05:50:52.425Z | INFO | phd-runner: [WAIT_TO_BOOT - START]
file = phd-tests/framework/src/test_vm/mod.rs
line = 890
path = phd_tests::migrate::from_base::can_migrate_from_base
target = phd_framework::test_vm
|
| 139 | 2026-10-03T05:50:52.425Z | INFO | phd-runner: [WAIT_TO_BOOT - EVENT] waiting for guest to boot
file = phd-tests/framework/src/test_vm/mod.rs
line = 839
path = phd_tests::migrate::from_base::can_migrate_from_base
target = phd_framework::test_vm
timeout_duration = 300s
vm = migration_from_base
vm_id = b9a9cb14-a826-4c81-a906-93062c424b36
|
| 140 | 2026-10-03T05:50:52.425Z | DEBG | phd-runner: [WAIT_TO_BOOT - EVENT] executing command in boot sequence
file = phd-tests/framework/src/test_vm/mod.rs
line = 847
path = phd_tests::migrate::from_base::can_migrate_from_base
step = WaitFor("localhost login: ")
target = phd_framework::test_vm
|
| 141 | 2026-10-03T05:50:52.426Z | INFO | phd-runner: [WAIT_FOR_SERIAL_OUTPUT - START]
file = phd-tests/framework/src/test_vm/mod.rs
line = 913
path = phd_tests::migrate::from_base::can_migrate_from_base
target = phd_framework::test_vm
vm = migration_from_base
vm_id = b9a9cb14-a826-4c81-a906-93062c424b36
|
| 142 | 2026-10-03T05:50:52.426Z | INFO | phd-runner: [WAIT_FOR_SERIAL_OUTPUT - EVENT] Waiting for output on serial console
file = phd-tests/framework/src/test_vm/mod.rs
line = 920
path = phd_tests::migrate::from_base::can_migrate_from_base
target = phd_framework::test_vm
timeout_duration = CallerTimeout
vm = migration_from_base
vm_id = b9a9cb14-a826-4c81-a906-93062c424b36
|
| 143 | 2026-10-03T05:50:56.977Z | INFO | phd-runner: [WAIT_FOR_SERIAL_OUTPUT - END]
elapsed_milliseconds = 4551
file = phd-tests/framework/src/test_vm/mod.rs
line = 913
path = phd_tests::migrate::from_base::can_migrate_from_base
target = phd_framework::test_vm
vm = migration_from_base
vm_id = b9a9cb14-a826-4c81-a906-93062c424b36
|
| 144 | 2026-10-03T05:50:56.978Z | DEBG | phd-runner: [WAIT_TO_BOOT - EVENT] executing command in boot sequence
file = phd-tests/framework/src/test_vm/mod.rs
line = 847
path = phd_tests::migrate::from_base::can_migrate_from_base
step = WriteStr("root")
target = phd_framework::test_vm
|
| 145 | 2026-10-03T05:50:56.978Z | DEBG | phd-runner: [WAIT_TO_BOOT - EVENT] executing command in boot sequence
file = phd-tests/framework/src/test_vm/mod.rs
line = 847
path = phd_tests::migrate::from_base::can_migrate_from_base
step = WaitFor("localhost:~#")
target = phd_framework::test_vm
|
| 146 | 2026-10-03T05:50:56.978Z | INFO | phd-runner: [WAIT_FOR_SERIAL_OUTPUT - START]
file = phd-tests/framework/src/test_vm/mod.rs
line = 913
path = phd_tests::migrate::from_base::can_migrate_from_base
target = phd_framework::test_vm
vm = migration_from_base
vm_id = b9a9cb14-a826-4c81-a906-93062c424b36
|
| 147 | 2026-10-03T05:50:56.978Z | INFO | phd-runner: [WAIT_FOR_SERIAL_OUTPUT - EVENT] Waiting for output on serial console
file = phd-tests/framework/src/test_vm/mod.rs
line = 920
path = phd_tests::migrate::from_base::can_migrate_from_base
target = phd_framework::test_vm
timeout_duration = CallerTimeout
vm = migration_from_base
vm_id = b9a9cb14-a826-4c81-a906-93062c424b36
|
| 148 | 2026-10-03T05:50:56.996Z | INFO | phd-runner: [WAIT_FOR_SERIAL_OUTPUT - END]
elapsed_milliseconds = 18
file = phd-tests/framework/src/test_vm/mod.rs
line = 913
path = phd_tests::migrate::from_base::can_migrate_from_base
target = phd_framework::test_vm
vm = migration_from_base
vm_id = b9a9cb14-a826-4c81-a906-93062c424b36
|
| 149 | 2026-10-03T05:50:56.996Z | DEBG | phd-runner: [WAIT_TO_BOOT - EVENT] executing command in boot sequence
file = phd-tests/framework/src/test_vm/mod.rs
line = 847
path = phd_tests::migrate::from_base::can_migrate_from_base
step = WriteStr("stty -F `tty` cols 9999")
target = phd_framework::test_vm
|
| 150 | 2026-10-03T05:50:56.996Z | DEBG | phd-runner: [WAIT_TO_BOOT - EVENT] executing command in boot sequence
file = phd-tests/framework/src/test_vm/mod.rs
line = 847
path = phd_tests::migrate::from_base::can_migrate_from_base
step = WaitFor("localhost:~#")
target = phd_framework::test_vm
|
| 151 | 2026-10-03T05:50:56.996Z | INFO | phd-runner: [WAIT_FOR_SERIAL_OUTPUT - START]
file = phd-tests/framework/src/test_vm/mod.rs
line = 913
path = phd_tests::migrate::from_base::can_migrate_from_base
target = phd_framework::test_vm
vm = migration_from_base
vm_id = b9a9cb14-a826-4c81-a906-93062c424b36
|
| 152 | 2026-10-03T05:50:56.997Z | INFO | phd-runner: [WAIT_FOR_SERIAL_OUTPUT - EVENT] Waiting for output on serial console
file = phd-tests/framework/src/test_vm/mod.rs
line = 920
path = phd_tests::migrate::from_base::can_migrate_from_base
target = phd_framework::test_vm
timeout_duration = CallerTimeout
vm = migration_from_base
vm_id = b9a9cb14-a826-4c81-a906-93062c424b36
|
| 153 | 2026-10-03T05:50:57.029Z | INFO | phd-runner: [WAIT_FOR_SERIAL_OUTPUT - END]
elapsed_milliseconds = 32
file = phd-tests/framework/src/test_vm/mod.rs
line = 913
path = phd_tests::migrate::from_base::can_migrate_from_base
target = phd_framework::test_vm
vm = migration_from_base
vm_id = b9a9cb14-a826-4c81-a906-93062c424b36
|
| 154 | 2026-10-03T05:50:57.030Z | INFO | phd-runner: [WAIT_TO_BOOT - EVENT] Guest has booted
file = phd-tests/framework/src/test_vm/mod.rs
line = 887
path = phd_tests::migrate::from_base::can_migrate_from_base
target = phd_framework::test_vm
|
| 155 | 2026-10-03T05:50:57.030Z | INFO | phd-runner: [WAIT_TO_BOOT - END]
elapsed_milliseconds = 4604
file = phd-tests/framework/src/test_vm/mod.rs
line = 890
path = phd_tests::migrate::from_base::can_migrate_from_base
target = phd_framework::test_vm
|
| 156 | 2026-10-03T05:50:57.030Z | INFO | phd-runner: [WAIT_FOR_SERIAL_OUTPUT - START]
file = phd-tests/framework/src/test_vm/mod.rs
line = 913
path = phd_tests::migrate::from_base::can_migrate_from_base
target = phd_framework::test_vm
vm = migration_from_base
vm_id = b9a9cb14-a826-4c81-a906-93062c424b36
|
| 157 | 2026-10-03T05:50:57.030Z | INFO | phd-runner: [WAIT_FOR_SERIAL_OUTPUT - EVENT] Waiting for output on serial console
file = phd-tests/framework/src/test_vm/mod.rs
line = 920
path = phd_tests::migrate::from_base::can_migrate_from_base
target = phd_framework::test_vm
timeout_duration = Explicit(15s)
vm = migration_from_base
vm_id = b9a9cb14-a826-4c81-a906-93062c424b36
|
| 158 | 2026-10-03T05:50:57.041Z | INFO | phd-runner: [WAIT_FOR_SERIAL_OUTPUT - END]
elapsed_milliseconds = 10
file = phd-tests/framework/src/test_vm/mod.rs
line = 913
path = phd_tests::migrate::from_base::can_migrate_from_base
target = phd_framework::test_vm
vm = migration_from_base
vm_id = b9a9cb14-a826-4c81-a906-93062c424b36
|
| 159 | 2026-10-03T05:50:57.041Z | INFO | phd-runner: [WAIT_FOR_SERIAL_OUTPUT - START]
file = phd-tests/framework/src/test_vm/mod.rs
line = 913
path = phd_tests::migrate::from_base::can_migrate_from_base
target = phd_framework::test_vm
vm = migration_from_base
vm_id = b9a9cb14-a826-4c81-a906-93062c424b36
|
| 160 | 2026-10-03T05:50:57.041Z | INFO | phd-runner: [WAIT_FOR_SERIAL_OUTPUT - EVENT] Waiting for output on serial console
file = phd-tests/framework/src/test_vm/mod.rs
line = 920
path = phd_tests::migrate::from_base::can_migrate_from_base
target = phd_framework::test_vm
timeout_duration = Explicit(300s)
vm = migration_from_base
vm_id = b9a9cb14-a826-4c81-a906-93062c424b36
|
| 161 | 2026-10-03T05:50:57.073Z | INFO | phd-runner: [WAIT_FOR_SERIAL_OUTPUT - END]
elapsed_milliseconds = 32
file = phd-tests/framework/src/test_vm/mod.rs
line = 913
path = phd_tests::migrate::from_base::can_migrate_from_base
target = phd_framework::test_vm
vm = migration_from_base
vm_id = b9a9cb14-a826-4c81-a906-93062c424b36
|
| 162 | 2026-10-03T05:50:57.074Z | INFO | phd-runner: [WAIT_FOR_SERIAL_OUTPUT - START]
file = phd-tests/framework/src/test_vm/mod.rs
line = 913
path = phd_tests::migrate::from_base::can_migrate_from_base
target = phd_framework::test_vm
vm = migration_from_base
vm_id = b9a9cb14-a826-4c81-a906-93062c424b36
|
| 163 | 2026-10-03T05:50:57.075Z | INFO | phd-runner: [WAIT_FOR_SERIAL_OUTPUT - EVENT] Waiting for output on serial console
file = phd-tests/framework/src/test_vm/mod.rs
line = 920
path = phd_tests::migrate::from_base::can_migrate_from_base
target = phd_framework::test_vm
timeout_duration = Explicit(15s)
vm = migration_from_base
vm_id = b9a9cb14-a826-4c81-a906-93062c424b36
|
| 164 | 2026-10-03T05:50:57.084Z | INFO | phd-runner: [WAIT_FOR_SERIAL_OUTPUT - END]
elapsed_milliseconds = 9
file = phd-tests/framework/src/test_vm/mod.rs
line = 913
path = phd_tests::migrate::from_base::can_migrate_from_base
target = phd_framework::test_vm
vm = migration_from_base
vm_id = b9a9cb14-a826-4c81-a906-93062c424b36
|
| 165 | 2026-10-03T05:50:57.084Z | INFO | phd-runner: [WAIT_FOR_SERIAL_OUTPUT - START]
file = phd-tests/framework/src/test_vm/mod.rs
line = 913
path = phd_tests::migrate::from_base::can_migrate_from_base
target = phd_framework::test_vm
vm = migration_from_base
vm_id = b9a9cb14-a826-4c81-a906-93062c424b36
|
| 166 | 2026-10-03T05:50:57.084Z | INFO | phd-runner: [WAIT_FOR_SERIAL_OUTPUT - EVENT] Waiting for output on serial console
file = phd-tests/framework/src/test_vm/mod.rs
line = 920
path = phd_tests::migrate::from_base::can_migrate_from_base
target = phd_framework::test_vm
timeout_duration = Explicit(300s)
vm = migration_from_base
vm_id = b9a9cb14-a826-4c81-a906-93062c424b36
|
| 167 | 2026-10-03T05:50:57.106Z | INFO | phd-runner: [WAIT_FOR_SERIAL_OUTPUT - END]
elapsed_milliseconds = 21
file = phd-tests/framework/src/test_vm/mod.rs
line = 913
path = phd_tests::migrate::from_base::can_migrate_from_base
target = phd_framework::test_vm
vm = migration_from_base
vm_id = b9a9cb14-a826-4c81-a906-93062c424b36
|
| 168 | 2026-10-03T05:50:57.107Z | INFO | phd-runner: [WAIT_FOR_SERIAL_OUTPUT - START]
file = phd-tests/framework/src/test_vm/mod.rs
line = 913
path = phd_tests::migrate::from_base::can_migrate_from_base
target = phd_framework::test_vm
vm = migration_from_base
vm_id = b9a9cb14-a826-4c81-a906-93062c424b36
|
| 169 | 2026-10-03T05:50:57.107Z | INFO | phd-runner: [WAIT_FOR_SERIAL_OUTPUT - EVENT] Waiting for output on serial console
file = phd-tests/framework/src/test_vm/mod.rs
line = 920
path = phd_tests::migrate::from_base::can_migrate_from_base
target = phd_framework::test_vm
timeout_duration = Explicit(15s)
vm = migration_from_base
vm_id = b9a9cb14-a826-4c81-a906-93062c424b36
|
| 170 | 2026-10-03T05:50:57.117Z | INFO | phd-runner: [WAIT_FOR_SERIAL_OUTPUT - END]
elapsed_milliseconds = 10
file = phd-tests/framework/src/test_vm/mod.rs
line = 913
path = phd_tests::migrate::from_base::can_migrate_from_base
target = phd_framework::test_vm
vm = migration_from_base
vm_id = b9a9cb14-a826-4c81-a906-93062c424b36
|
| 171 | 2026-10-03T05:50:57.117Z | INFO | phd-runner: [WAIT_FOR_SERIAL_OUTPUT - START]
file = phd-tests/framework/src/test_vm/mod.rs
line = 913
path = phd_tests::migrate::from_base::can_migrate_from_base
target = phd_framework::test_vm
vm = migration_from_base
vm_id = b9a9cb14-a826-4c81-a906-93062c424b36
|
| 172 | 2026-10-03T05:50:57.118Z | INFO | phd-runner: [WAIT_FOR_SERIAL_OUTPUT - EVENT] Waiting for output on serial console
file = phd-tests/framework/src/test_vm/mod.rs
line = 920
path = phd_tests::migrate::from_base::can_migrate_from_base
target = phd_framework::test_vm
timeout_duration = Explicit(300s)
vm = migration_from_base
vm_id = b9a9cb14-a826-4c81-a906-93062c424b36
|
| 173 | 2026-10-03T05:50:57.151Z | INFO | phd-runner: [WAIT_FOR_SERIAL_OUTPUT - END]
elapsed_milliseconds = 33
file = phd-tests/framework/src/test_vm/mod.rs
line = 913
path = phd_tests::migrate::from_base::can_migrate_from_base
target = phd_framework::test_vm
vm = migration_from_base
vm_id = b9a9cb14-a826-4c81-a906-93062c424b36
|
| 174 | 2026-10-03T05:50:57.151Z | INFO | phd-runner: [WAIT_FOR_SERIAL_OUTPUT - START]
file = phd-tests/framework/src/test_vm/mod.rs
line = 913
path = phd_tests::migrate::from_base::can_migrate_from_base
target = phd_framework::test_vm
vm = migration_from_base
vm_id = b9a9cb14-a826-4c81-a906-93062c424b36
|
| 175 | 2026-10-03T05:50:57.151Z | INFO | phd-runner: [WAIT_FOR_SERIAL_OUTPUT - EVENT] Waiting for output on serial console
file = phd-tests/framework/src/test_vm/mod.rs
line = 920
path = phd_tests::migrate::from_base::can_migrate_from_base
target = phd_framework::test_vm
timeout_duration = Explicit(15s)
vm = migration_from_base
vm_id = b9a9cb14-a826-4c81-a906-93062c424b36
|
| 176 | 2026-10-03T05:50:57.162Z | INFO | phd-runner: [WAIT_FOR_SERIAL_OUTPUT - END]
elapsed_milliseconds = 11
file = phd-tests/framework/src/test_vm/mod.rs
line = 913
path = phd_tests::migrate::from_base::can_migrate_from_base
target = phd_framework::test_vm
vm = migration_from_base
vm_id = b9a9cb14-a826-4c81-a906-93062c424b36
|
| 177 | 2026-10-03T05:50:57.162Z | INFO | phd-runner: [WAIT_FOR_SERIAL_OUTPUT - START]
file = phd-tests/framework/src/test_vm/mod.rs
line = 913
path = phd_tests::migrate::from_base::can_migrate_from_base
target = phd_framework::test_vm
vm = migration_from_base
vm_id = b9a9cb14-a826-4c81-a906-93062c424b36
|
| 178 | 2026-10-03T05:50:57.163Z | INFO | phd-runner: [WAIT_FOR_SERIAL_OUTPUT - EVENT] Waiting for output on serial console
file = phd-tests/framework/src/test_vm/mod.rs
line = 920
path = phd_tests::migrate::from_base::can_migrate_from_base
target = phd_framework::test_vm
timeout_duration = Explicit(300s)
vm = migration_from_base
vm_id = b9a9cb14-a826-4c81-a906-93062c424b36
|
| 179 | 2026-10-03T05:50:57.195Z | INFO | phd-runner: [WAIT_FOR_SERIAL_OUTPUT - END]
elapsed_milliseconds = 32
file = phd-tests/framework/src/test_vm/mod.rs
line = 913
path = phd_tests::migrate::from_base::can_migrate_from_base
target = phd_framework::test_vm
vm = migration_from_base
vm_id = b9a9cb14-a826-4c81-a906-93062c424b36
|
| 180 | 2026-10-03T05:50:57.195Z | INFO | phd-runner: [WAIT_FOR_SERIAL_OUTPUT - START]
file = phd-tests/framework/src/test_vm/mod.rs
line = 913
path = phd_tests::migrate::from_base::can_migrate_from_base
target = phd_framework::test_vm
vm = migration_from_base
vm_id = b9a9cb14-a826-4c81-a906-93062c424b36
|
| 181 | 2026-10-03T05:50:57.195Z | INFO | phd-runner: [WAIT_FOR_SERIAL_OUTPUT - EVENT] Waiting for output on serial console
file = phd-tests/framework/src/test_vm/mod.rs
line = 920
path = phd_tests::migrate::from_base::can_migrate_from_base
target = phd_framework::test_vm
timeout_duration = Explicit(15s)
vm = migration_from_base
vm_id = b9a9cb14-a826-4c81-a906-93062c424b36
|
| 182 | 2026-10-03T05:50:57.206Z | INFO | phd-runner: [WAIT_FOR_SERIAL_OUTPUT - END]
elapsed_milliseconds = 10
file = phd-tests/framework/src/test_vm/mod.rs
line = 913
path = phd_tests::migrate::from_base::can_migrate_from_base
target = phd_framework::test_vm
vm = migration_from_base
vm_id = b9a9cb14-a826-4c81-a906-93062c424b36
|
| 183 | 2026-10-03T05:50:57.206Z | INFO | phd-runner: [WAIT_FOR_SERIAL_OUTPUT - START]
file = phd-tests/framework/src/test_vm/mod.rs
line = 913
path = phd_tests::migrate::from_base::can_migrate_from_base
target = phd_framework::test_vm
vm = migration_from_base
vm_id = b9a9cb14-a826-4c81-a906-93062c424b36
|
| 184 | 2026-10-03T05:50:57.207Z | INFO | phd-runner: [WAIT_FOR_SERIAL_OUTPUT - EVENT] Waiting for output on serial console
file = phd-tests/framework/src/test_vm/mod.rs
line = 920
path = phd_tests::migrate::from_base::can_migrate_from_base
target = phd_framework::test_vm
timeout_duration = Explicit(300s)
vm = migration_from_base
vm_id = b9a9cb14-a826-4c81-a906-93062c424b36
|
| 185 | 2026-10-03T05:50:57.239Z | INFO | phd-runner: [WAIT_FOR_SERIAL_OUTPUT - END]
elapsed_milliseconds = 32
file = phd-tests/framework/src/test_vm/mod.rs
line = 913
path = phd_tests::migrate::from_base::can_migrate_from_base
target = phd_framework::test_vm
vm = migration_from_base
vm_id = b9a9cb14-a826-4c81-a906-93062c424b36
|
| 186 | 2026-10-03T05:50:57.241Z | INFO | phd-runner: [WAIT_FOR_SERIAL_OUTPUT - START]
file = phd-tests/framework/src/test_vm/mod.rs
line = 913
path = phd_tests::migrate::from_base::can_migrate_from_base
target = phd_framework::test_vm
vm = migration_from_base
vm_id = b9a9cb14-a826-4c81-a906-93062c424b36
|
| 187 | 2026-10-03T05:50:57.241Z | INFO | phd-runner: [WAIT_FOR_SERIAL_OUTPUT - EVENT] Waiting for output on serial console
file = phd-tests/framework/src/test_vm/mod.rs
line = 920
path = phd_tests::migrate::from_base::can_migrate_from_base
target = phd_framework::test_vm
timeout_duration = Explicit(15s)
vm = migration_from_base
vm_id = b9a9cb14-a826-4c81-a906-93062c424b36
|
| 188 | 2026-10-03T05:50:57.250Z | INFO | phd-runner: [WAIT_FOR_SERIAL_OUTPUT - END]
elapsed_milliseconds = 9
file = phd-tests/framework/src/test_vm/mod.rs
line = 913
path = phd_tests::migrate::from_base::can_migrate_from_base
target = phd_framework::test_vm
vm = migration_from_base
vm_id = b9a9cb14-a826-4c81-a906-93062c424b36
|
| 189 | 2026-10-03T05:50:57.251Z | INFO | phd-runner: [WAIT_FOR_SERIAL_OUTPUT - START]
file = phd-tests/framework/src/test_vm/mod.rs
line = 913
path = phd_tests::migrate::from_base::can_migrate_from_base
target = phd_framework::test_vm
vm = migration_from_base
vm_id = b9a9cb14-a826-4c81-a906-93062c424b36
|
| 190 | 2026-10-03T05:50:57.251Z | INFO | phd-runner: [WAIT_FOR_SERIAL_OUTPUT - EVENT] Waiting for output on serial console
file = phd-tests/framework/src/test_vm/mod.rs
line = 920
path = phd_tests::migrate::from_base::can_migrate_from_base
target = phd_framework::test_vm
timeout_duration = Explicit(300s)
vm = migration_from_base
vm_id = b9a9cb14-a826-4c81-a906-93062c424b36
|
| 191 | 2026-10-03T05:50:57.283Z | INFO | phd-runner: [WAIT_FOR_SERIAL_OUTPUT - END]
elapsed_milliseconds = 32
file = phd-tests/framework/src/test_vm/mod.rs
line = 913
path = phd_tests::migrate::from_base::can_migrate_from_base
target = phd_framework::test_vm
vm = migration_from_base
vm_id = b9a9cb14-a826-4c81-a906-93062c424b36
|
| 192 | 2026-10-03T05:50:57.283Z | INFO | phd-runner: [TEST - EVENT] migrating to new Propolis artifact for lifecycle test
file = phd-tests/framework/src/lifecycle.rs
line = 73
path = phd_tests::migrate::from_base::can_migrate_from_base
propolis_artifact = __DEFAULT_PROPOLIS
target = phd_framework::lifecycle
vm_name = migration_from_base
|
| 193 | 2026-10-03T05:50:57.284Z | INFO | phd-runner: [NEW - START]
file = phd-tests/framework/src/test_vm/mod.rs
line = 300
path = phd_tests::migrate::from_base::can_migrate_from_base
target = phd_framework::test_vm
|
| 194 | 2026-10-03T05:50:57.284Z | INFO | phd-runner: [NEW - EVENT] phd_framework::test_vm
environment = EnvironmentSpec { location: Local, propolis_artifact: "__DEFAULT_PROPOLIS", metrics: None }
file = phd-tests/framework/src/test_vm/mod.rs
guest_os_kind = Alpine
line = 318
path = phd_tests::migrate::from_base::can_migrate_from_base
target = phd_framework::test_vm
vm_name = migration_from_base_lifecycle_0
|
| 195 | 2026-10-03T05:50:57.284Z | DEBG | phd-runner: [NEW - EVENT] Verified artifact already exists
file = phd-tests/framework/src/artifacts/store.rs
line = 45
path = /work/phd-test/propolis-server
target = phd_framework::artifacts::store
|
| 196 | 2026-10-03T05:50:57.284Z | INFO | phd-runner: [NEW - EVENT] Launching Propolis server
bootrom_path = "/phd-artifacts/740187046a7267d0de72d3455070333547dbc0ea023531471fb2b2a61effa448/OVMF_CODE.fd"
file = phd-tests/framework/src/test_vm/server.rs
line = 66
path = phd_tests::migrate::from_base::can_migrate_from_base
server_addr = 127.0.0.1:9002
server_path = "/work/phd-test/propolis-server"
target = phd_framework::test_vm::server
|
| 197 | 2026-10-03T05:50:57.284Z | INFO | phd-runner: [NEW - EVENT] Opening server log files
file = phd-tests/framework/src/log_config.rs
line = 84
path = phd_tests::migrate::from_base::can_migrate_from_base
stderr_path = "/tmp/propolis-phd/phd_tests::migrate::from_base::can_migrate_from_base/migration_from_base_lifecycle_0.stderr.log"
stdout_path = "/tmp/propolis-phd/phd_tests::migrate::from_base::can_migrate_from_base/migration_from_base_lifecycle_0.stdout.log"
target = phd_framework::log_config
|
| 198 | 2026-10-03T05:50:57.325Z | INFO | phd-runner: [NEW - EVENT] Launched server with pid 928
file = phd-tests/framework/src/test_vm/server.rs
line = 127
path = phd_tests::migrate::from_base::can_migrate_from_base
target = phd_framework::test_vm::server
|
| 199 | 2026-10-03T05:50:57.338Z | INFO | phd-runner: [NEW - END]
elapsed_milliseconds = 54
file = phd-tests/framework/src/test_vm/mod.rs
line = 300
path = phd_tests::migrate::from_base::can_migrate_from_base
target = phd_framework::test_vm
|
| 200 | 2026-10-03T05:50:57.338Z | INFO | phd-runner: [MIGRATE_FROM - START]
file = phd-tests/framework/src/test_vm/mod.rs
line = 609
path = phd_tests::migrate::from_base::can_migrate_from_base
source = migration_from_base
source_id = b9a9cb14-a826-4c81-a906-93062c424b36
target = phd_framework::test_vm
target_id = 0a7a8f19-e61a-4c55-a1c1-9758b600148f
|
| 201 | 2026-10-03T05:50:57.338Z | INFO | phd-runner: [MIGRATE_FROM - EVENT] Migrating from source at address 127.0.0.1:9000
file = phd-tests/framework/src/test_vm/mod.rs
line = 642
migration_id = 6f9338f2-5254-4232-ac41-c2c66df689c9
path = phd_tests::migrate::from_base::can_migrate_from_base
source = migration_from_base
source_id = b9a9cb14-a826-4c81-a906-93062c424b36
target = phd_framework::test_vm
target_id = 0a7a8f19-e61a-4c55-a1c1-9758b600148f
timeout_duration = 45s
|
| 202 | 2026-10-03T05:50:57.339Z | INFO | phd-runner: [INSTANCE_ENSURE_INTERNAL - START]
file = phd-tests/framework/src/test_vm/mod.rs
line = 412
path = phd_tests::migrate::from_base::can_migrate_from_base
source = migration_from_base
source_id = b9a9cb14-a826-4c81-a906-93062c424b36
target = phd_framework::test_vm
target_id = 0a7a8f19-e61a-4c55-a1c1-9758b600148f
vm = migration_from_base_lifecycle_0
vm_id = 0a7a8f19-e61a-4c55-a1c1-9758b600148f
|
| 203 | 2026-10-03T05:50:57.339Z | INFO | phd-runner: [INSTANCE_ENSURE_INTERNAL - EVENT] retriable error from instance_spec_ensure
e = Communication Error: error sending request for url (http://127.0.0.1:9002/instance)
file = phd-tests/framework/src/test_vm/mod.rs
line = 455
path = phd_tests::migrate::from_base::can_migrate_from_base
source = migration_from_base
source_id = b9a9cb14-a826-4c81-a906-93062c424b36
target = phd_framework::test_vm
target_id = 0a7a8f19-e61a-4c55-a1c1-9758b600148f
vm = migration_from_base_lifecycle_0
vm_id = 0a7a8f19-e61a-4c55-a1c1-9758b600148f
|
| 204 | 2026-10-03T05:50:57.998Z | INFO | phd-runner: [INSTANCE_ENSURE_INTERNAL - EVENT] Started instance
file = phd-tests/framework/src/test_vm/mod.rs
instance_description.instance = Instance { properties: InstanceProperties { id: 0a7a8f19-e61a-4c55-a1c1-9758b600148f, name: "phd-vm-0a7a8f19-e61a-4c55-a1c1-9758b600148f", description: "Pheidippides-managed VM", metadata: InstanceMetadata { silo_id: 48406fbc-45a9-4645-94d3-41b019078bc5, project_id: c2c4032e-763f-4ccc-b741-993b02fc7cdb, sled_id: e11e80c1-7649-459f-90c3-062e30826317, sled_serial: "e11e80c1-7649-459f-90c3-062e30826317", sled_revision: 1, sled_model: "pheidippes" } }, state: Migrating }
line = 514
path = phd_tests::migrate::from_base::can_migrate_from_base
source = migration_from_base
source_id = b9a9cb14-a826-4c81-a906-93062c424b36
target = phd_framework::test_vm
target_id = 0a7a8f19-e61a-4c55-a1c1-9758b600148f
vm = migration_from_base_lifecycle_0
vm_id = 0a7a8f19-e61a-4c55-a1c1-9758b600148f
|
| 205 | 2026-10-03T05:50:57.998Z | INFO | phd-runner: [MIGRATE - START]
file = phd-tests/framework/src/test_vm/mod.rs
line = 663
migration_id = 6f9338f2-5254-4232-ac41-c2c66df689c9
path = phd_tests::migrate::from_base::can_migrate_from_base
source = migration_from_base
source_id = b9a9cb14-a826-4c81-a906-93062c424b36
target = phd_framework::test_vm
target_id = 0a7a8f19-e61a-4c55-a1c1-9758b600148f
|
| 206 | 2026-10-03T05:51:00.455Z | INFO | phd-runner: [SERIAL CONSOLE TASK - EVENT] serial socket control message
file = phd-tests/framework/src/serial/mod.rs
line = 275
s = {"Migrating":{"destination":"127.0.0.1:9002","from_start":7847}}
target = phd_framework::serial
|
| 207 | 2026-10-03T05:51:01.159Z | INFO | phd-runner: [MIGRATE_FROM - EVENT] Migration completed successfully
file = phd-tests/framework/src/test_vm/mod.rs
line = 676
path = phd_tests::migrate::from_base::can_migrate_from_base
source = migration_from_base
source_id = b9a9cb14-a826-4c81-a906-93062c424b36
target = phd_framework::test_vm
target_id = 0a7a8f19-e61a-4c55-a1c1-9758b600148f
|
| 208 | 2026-10-03T05:51:01.159Z | INFO | phd-runner: [MIGRATE - END]
elapsed_milliseconds = 3160
file = phd-tests/framework/src/test_vm/mod.rs
line = 663
migration_id = 6f9338f2-5254-4232-ac41-c2c66df689c9
path = phd_tests::migrate::from_base::can_migrate_from_base
source = migration_from_base
source_id = b9a9cb14-a826-4c81-a906-93062c424b36
target = phd_framework::test_vm
target_id = 0a7a8f19-e61a-4c55-a1c1-9758b600148f
|
| 209 | 2026-10-03T05:51:01.161Z | INFO | phd-runner: [VM CLEANUP - START]
file = phd-tests/framework/src/test_vm/mod.rs
line = 1172
path = phd_tests::migrate::from_base::can_migrate_from_base
target = phd_framework::test_vm
vm = migration_from_base
vm_id = b9a9cb14-a826-4c81-a906-93062c424b36
|
| 210 | 2026-10-03T05:51:01.162Z | INFO | phd-runner: [WAIT_FOR_SERIAL_OUTPUT - START]
file = phd-tests/framework/src/test_vm/mod.rs
line = 913
path = phd_tests::migrate::from_base::can_migrate_from_base
target = phd_framework::test_vm
vm = migration_from_base_lifecycle_0
vm_id = 0a7a8f19-e61a-4c55-a1c1-9758b600148f
|
| 211 | 2026-10-03T05:51:01.162Z | INFO | phd-runner: [WAIT_FOR_SERIAL_OUTPUT - EVENT] Waiting for output on serial console
file = phd-tests/framework/src/test_vm/mod.rs
line = 920
path = phd_tests::migrate::from_base::can_migrate_from_base
target = phd_framework::test_vm
timeout_duration = Explicit(15s)
vm = migration_from_base_lifecycle_0
vm_id = 0a7a8f19-e61a-4c55-a1c1-9758b600148f
|
| 212 | 2026-10-03T05:51:01.163Z | DEBG | phd-runner: [VM CLEANUP - EVENT] Killing Propolis server process
file = phd-tests/framework/src/test_vm/server.rs
line = 177
path = phd_tests::migrate::from_base::can_migrate_from_base
self.address = 127.0.0.1:9000
target = phd_framework::test_vm::server
vm = migration_from_base
vm_id = b9a9cb14-a826-4c81-a906-93062c424b36
|
| 213 | 2026-10-03T05:51:01.244Z | INFO | phd-runner: [VM CLEANUP - END]
elapsed_milliseconds = 82
file = phd-tests/framework/src/test_vm/mod.rs
line = 1172
path = phd_tests::migrate::from_base::can_migrate_from_base
target = phd_framework::test_vm
vm = migration_from_base
vm_id = b9a9cb14-a826-4c81-a906-93062c424b36
|
| 214 | 2026-10-03T05:51:01.245Z | INFO | phd-runner: [INSTANCE_ENSURE_INTERNAL - END]
elapsed_milliseconds = 9601
file = phd-tests/framework/src/test_vm/mod.rs
line = 412
path = phd_tests::migrate::from_base::can_migrate_from_base
target = phd_framework::test_vm
vm = migration_from_base
vm_id = b9a9cb14-a826-4c81-a906-93062c424b36
|
| 215 | 2026-10-03T05:51:03.320Z | INFO | phd-runner: [WAIT_FOR_SERIAL_OUTPUT - END]
elapsed_milliseconds = 2158
file = phd-tests/framework/src/test_vm/mod.rs
line = 913
path = phd_tests::migrate::from_base::can_migrate_from_base
target = phd_framework::test_vm
vm = migration_from_base_lifecycle_0
vm_id = 0a7a8f19-e61a-4c55-a1c1-9758b600148f
|
| 216 | 2026-10-03T05:51:03.320Z | INFO | phd-runner: [WAIT_FOR_SERIAL_OUTPUT - START]
file = phd-tests/framework/src/test_vm/mod.rs
line = 913
path = phd_tests::migrate::from_base::can_migrate_from_base
target = phd_framework::test_vm
vm = migration_from_base_lifecycle_0
vm_id = 0a7a8f19-e61a-4c55-a1c1-9758b600148f
|
| 217 | 2026-10-03T05:51:03.321Z | INFO | phd-runner: [WAIT_FOR_SERIAL_OUTPUT - EVENT] Waiting for output on serial console
file = phd-tests/framework/src/test_vm/mod.rs
line = 920
path = phd_tests::migrate::from_base::can_migrate_from_base
target = phd_framework::test_vm
timeout_duration = Explicit(300s)
vm = migration_from_base_lifecycle_0
vm_id = 0a7a8f19-e61a-4c55-a1c1-9758b600148f
|
| 218 | 2026-10-03T05:51:03.354Z | INFO | phd-runner: [WAIT_FOR_SERIAL_OUTPUT - END]
elapsed_milliseconds = 33
file = phd-tests/framework/src/test_vm/mod.rs
line = 913
path = phd_tests::migrate::from_base::can_migrate_from_base
target = phd_framework::test_vm
vm = migration_from_base_lifecycle_0
vm_id = 0a7a8f19-e61a-4c55-a1c1-9758b600148f
|
| 219 | 2026-10-03T05:51:03.354Z | INFO | phd-runner: [VM CLEANUP - START]
file = phd-tests/framework/src/test_vm/mod.rs
line = 1172
path = phd_tests::migrate::from_base::can_migrate_from_base
target = phd_framework::test_vm
vm = migration_from_base_lifecycle_0
vm_id = 0a7a8f19-e61a-4c55-a1c1-9758b600148f
|
| 220 | 2026-10-03T05:51:03.354Z | DEBG | phd-runner: [SERIAL CONSOLE TASK - EVENT] serial console command channel was closed
file = phd-tests/framework/src/serial/mod.rs
line = 213
target = phd_framework::serial
|
| 221 | 2026-10-03T05:51:03.354Z | INFO | phd-runner: test phd_tests::migrate::from_base::can_migrate_from_base ... ok
file = phd-tests/runner/src/execute.rs
line = 141
target = phd_runner::execute
|
| 222 | 2026-10-03T05:51:03.354Z | INFO | phd-runner: [TEST_CLEANUP - START]
file = phd-tests/runner/src/fixtures.rs
line = 51
target = phd_runner::fixtures
|
| 223 | 2026-10-03T05:51:03.354Z | INFO | phd-runner: [SERIAL CONSOLE TASK - END]
elapsed_milliseconds = 10931
file = phd-tests/framework/src/serial/mod.rs
line = 200
target = phd_framework::serial
|
| 224 | 2026-10-03T05:51:03.356Z | DEBG | phd-runner: [VM CLEANUP - EVENT] trying to ensure Propolis server VM is destroyed
file = phd-tests/framework/src/test_vm/mod.rs
line = 1195
path = phd_tests::migrate::from_base::can_migrate_from_base
target = phd_framework::test_vm
vm = migration_from_base_lifecycle_0
vm_id = 0a7a8f19-e61a-4c55-a1c1-9758b600148f
|
| 225 | 2026-10-03T05:51:03.916Z | DEBG | phd-runner: [VM CLEANUP - EVENT] Killing Propolis server process
file = phd-tests/framework/src/test_vm/server.rs
line = 177
path = phd_tests::migrate::from_base::can_migrate_from_base
self.address = 127.0.0.1:9002
target = phd_framework::test_vm::server
vm = migration_from_base_lifecycle_0
vm_id = 0a7a8f19-e61a-4c55-a1c1-9758b600148f
|
| 226 | 2026-10-03T05:51:04.004Z | DEBG | phd-runner: [VM CLEANUP - EVENT] zfs clone dropped
file = phd-tests/framework/src/zfs.rs
line = 83
path = phd_tests::migrate::from_base::can_migrate_from_base
target = phd_framework::zfs
vm = migration_from_base_lifecycle_0
vm_id = 0a7a8f19-e61a-4c55-a1c1-9758b600148f
|
| 227 | 2026-10-03T05:51:04.004Z | DEBG | phd-runner: [VM CLEANUP - EVENT] executing ZFS command
args = ["phd-artifacts/phd-clone-03dd6d43-8273-4599-8570-a27dc2769969"]
file = phd-tests/framework/src/zfs.rs
line = 304
path = phd_tests::migrate::from_base::can_migrate_from_base
target = phd_framework::zfs
verb = destroy
vm = migration_from_base_lifecycle_0
vm_id = 0a7a8f19-e61a-4c55-a1c1-9758b600148f
|
| 228 | 2026-10-03T05:51:04.031Z | DEBG | phd-runner: [VM CLEANUP - EVENT] zfs snapshot dropped
file = phd-tests/framework/src/zfs.rs
line = 57
path = phd_tests::migrate::from_base::can_migrate_from_base
target = phd_framework::zfs
vm = migration_from_base_lifecycle_0
vm_id = 0a7a8f19-e61a-4c55-a1c1-9758b600148f
|
| 229 | 2026-10-03T05:51:04.031Z | DEBG | phd-runner: [VM CLEANUP - EVENT] executing ZFS command
args = ["phd-artifacts@phd-74355da4-0179-48e8-a622-24b3b35942ae"]
file = phd-tests/framework/src/zfs.rs
line = 304
path = phd_tests::migrate::from_base::can_migrate_from_base
target = phd_framework::zfs
verb = destroy
vm = migration_from_base_lifecycle_0
vm_id = 0a7a8f19-e61a-4c55-a1c1-9758b600148f
|
| 230 | 2026-10-03T05:51:04.050Z | INFO | phd-runner: [VM CLEANUP - END]
elapsed_milliseconds = 695
file = phd-tests/framework/src/test_vm/mod.rs
line = 1172
path = phd_tests::migrate::from_base::can_migrate_from_base
target = phd_framework::test_vm
vm = migration_from_base_lifecycle_0
vm_id = 0a7a8f19-e61a-4c55-a1c1-9758b600148f
|
| 231 | 2026-10-03T05:51:04.050Z | INFO | phd-runner: [INSTANCE_ENSURE_INTERNAL - END]
elapsed_milliseconds = 6711
file = phd-tests/framework/src/test_vm/mod.rs
line = 412
path = phd_tests::migrate::from_base::can_migrate_from_base
source = migration_from_base
source_id = b9a9cb14-a826-4c81-a906-93062c424b36
target = phd_framework::test_vm
target_id = 0a7a8f19-e61a-4c55-a1c1-9758b600148f
vm = migration_from_base_lifecycle_0
vm_id = 0a7a8f19-e61a-4c55-a1c1-9758b600148f
|
| 232 | 2026-10-03T05:51:04.050Z | INFO | phd-runner: [TEST_CLEANUP - END]
elapsed_milliseconds = 695
file = phd-tests/runner/src/fixtures.rs
line = 51
target = phd_runner::fixtures
|
| 233 | 2026-10-03T05:51:04.050Z | INFO | phd-runner: [MIGRATE_FROM - END]
elapsed_milliseconds = 6711
file = phd-tests/framework/src/test_vm/mod.rs
line = 609
path = phd_tests::migrate::from_base::can_migrate_from_base
source = migration_from_base
source_id = b9a9cb14-a826-4c81-a906-93062c424b36
target = phd_framework::test_vm
target_id = 0a7a8f19-e61a-4c55-a1c1-9758b600148f
|
| 234 | 2026-10-03T05:51:04.050Z | INFO | phd-runner: [TEST - END]
elapsed_milliseconds = 12520
file = phd-tests/tests/src/migrate.rs
line = 34
path = phd_tests::migrate::from_base::can_migrate_from_base
target = phd_tests::migrate::from_base
|
| 235 | 2026-10-03T05:51:04.050Z | INFO | phd-runner: Starting test phd_tests::migrate::from_base::migration_from_base_and_back
file = phd-tests/runner/src/execute.rs
line = 91
target = phd_runner::execute
|
| 236 | 2026-10-03T05:51:04.051Z | INFO | phd-runner: [TEST_SETUP - START]
file = phd-tests/runner/src/fixtures.rs
line = 41
target = phd_runner::fixtures
|
| 237 | 2026-10-03T05:51:04.051Z | INFO | phd-runner: [TEST_SETUP - END]
elapsed_milliseconds = 0
file = phd-tests/runner/src/fixtures.rs
line = 41
target = phd_runner::fixtures
|
| 238 | 2026-10-03T05:51:04.051Z | INFO | phd-runner: [TEST - START]
file = phd-tests/tests/src/migrate.rs
line = 52
path = phd_tests::migrate::from_base::migration_from_base_and_back
target = phd_tests::migrate::from_base
|
| 239 | 2026-10-03T05:51:04.051Z | DEBG | phd-runner: [TEST - EVENT] Verified artifact already exists
file = phd-tests/framework/src/artifacts/store.rs
line = 45
path = /phd-artifacts/740187046a7267d0de72d3455070333547dbc0ea023531471fb2b2a61effa448/OVMF_CODE.fd
target = phd_framework::artifacts::store
|
| 240 | 2026-10-03T05:51:04.051Z | DEBG | phd-runner: [TEST - EVENT] Verified artifact already exists
file = phd-tests/framework/src/artifacts/store.rs
line = 45
path = /phd-artifacts/ba8007f74f9b54fbae3b2520da577831b4834778a498d732f091260c61aa7ca1/alpine.iso
target = phd_framework::artifacts::store
|
| 241 | 2026-10-03T05:51:04.051Z | DEBG | phd-runner: [TEST - EVENT] Verified artifact already exists
file = phd-tests/framework/src/artifacts/store.rs
line = 45
path = /phd-artifacts/ba8007f74f9b54fbae3b2520da577831b4834778a498d732f091260c61aa7ca1/alpine.iso
target = phd_framework::artifacts::store
|
| 242 | 2026-10-03T05:51:04.051Z | DEBG | phd-runner: [TEST - EVENT] executing ZFS command
args = ["/phd-artifacts/ba8007f74f9b54fbae3b2520da577831b4834778a498d732f091260c61aa7ca1/alpine.iso"]
file = phd-tests/framework/src/zfs.rs
line = 304
path = phd_tests::migrate::from_base::migration_from_base_and_back
target = phd_framework::zfs
verb = list
|
| 243 | 2026-10-03T05:51:04.062Z | DEBG | phd-runner: [TEST - EVENT] parsing zfs list output
file = phd-tests/framework/src/zfs.rs
line = 238
path = phd_tests::migrate::from_base::migration_from_base_and_back
stdout = NAME USED AVAIL REFER MOUNTPOINT\nphd-artifacts 1.30G 25.3T 1.30G /phd-artifacts\n
target = phd_framework::zfs
|
| 244 | 2026-10-03T05:51:04.063Z | DEBG | phd-runner: [TEST - EVENT] executing ZFS command
args = ["phd-artifacts@phd-71d0da23-9127-43e4-87fd-7348593e8060"]
file = phd-tests/framework/src/zfs.rs
line = 304
path = phd_tests::migrate::from_base::migration_from_base_and_back
target = phd_framework::zfs
verb = snapshot
|
| 245 | 2026-10-03T05:51:04.081Z | DEBG | phd-runner: [TEST - EVENT] executing ZFS command
args = ["phd-artifacts@phd-71d0da23-9127-43e4-87fd-7348593e8060", "phd-artifacts/phd-clone-d90cb244-6868-4ef3-97e6-f1b00375ed5d"]
file = phd-tests/framework/src/zfs.rs
line = 304
path = phd_tests::migrate::from_base::migration_from_base_and_back
target = phd_framework::zfs
verb = clone
|
| 246 | 2026-10-03T05:51:04.100Z | DEBG | phd-runner: [TEST - EVENT] executing ZFS command
args = ["phd-artifacts/phd-clone-d90cb244-6868-4ef3-97e6-f1b00375ed5d"]
file = phd-tests/framework/src/zfs.rs
line = 304
path = phd_tests::migrate::from_base::migration_from_base_and_back
target = phd_framework::zfs
verb = list
|
| 247 | 2026-10-03T05:51:04.111Z | DEBG | phd-runner: [TEST - EVENT] parsing zfs list output
file = phd-tests/framework/src/zfs.rs
line = 238
path = phd_tests::migrate::from_base::migration_from_base_and_back
stdout = NAME USED AVAIL REFER MOUNTPOINT\nphd-artifacts/phd-clone-d90cb244-6868-4ef3-97e6-f1b00375ed5d 0B 25.3T 1.30G /phd-artifacts/phd-clone-d90cb244-6868-4ef3-97e6-f1b00375ed5d\n
target = phd_framework::zfs
|
| 248 | 2026-10-03T05:51:04.112Z | INFO | phd-runner: [NEW - START]
file = phd-tests/framework/src/test_vm/mod.rs
line = 300
path = phd_tests::migrate::from_base::migration_from_base_and_back
target = phd_framework::test_vm
|
| 249 | 2026-10-03T05:51:04.112Z | INFO | phd-runner: [NEW - EVENT] phd_framework::test_vm
environment = EnvironmentSpec { location: Local, propolis_artifact: "__BASE_PROPOLIS", metrics: None }
file = phd-tests/framework/src/test_vm/mod.rs
guest_os_kind = Alpine
line = 318
path = phd_tests::migrate::from_base::migration_from_base_and_back
target = phd_framework::test_vm
vm_name = migration_from_base_and_back
|
| 250 | 2026-10-03T05:51:04.112Z | DEBG | phd-runner: [NEW - EVENT] Verified artifact already exists
file = phd-tests/framework/src/artifacts/store.rs
line = 45
path = /phd-artifacts/307d7cf409a11795bd2f449aff90849e1cd9fd6e26ea2c6267e3110786362da9/propolis-server
target = phd_framework::artifacts::store
|
| 251 | 2026-10-03T05:51:04.112Z | INFO | phd-runner: [NEW - EVENT] Launching Propolis server
bootrom_path = "/phd-artifacts/740187046a7267d0de72d3455070333547dbc0ea023531471fb2b2a61effa448/OVMF_CODE.fd"
file = phd-tests/framework/src/test_vm/server.rs
line = 66
path = phd_tests::migrate::from_base::migration_from_base_and_back
server_addr = 127.0.0.1:9000
server_path = "/phd-artifacts/307d7cf409a11795bd2f449aff90849e1cd9fd6e26ea2c6267e3110786362da9/propolis-server"
target = phd_framework::test_vm::server
|
| 252 | 2026-10-03T05:51:04.113Z | INFO | phd-runner: [NEW - EVENT] Opening server log files
file = phd-tests/framework/src/log_config.rs
line = 84
path = phd_tests::migrate::from_base::migration_from_base_and_back
stderr_path = "/tmp/propolis-phd/phd_tests::migrate::from_base::migration_from_base_and_back/migration_from_base_and_back.stderr.log"
stdout_path = "/tmp/propolis-phd/phd_tests::migrate::from_base::migration_from_base_and_back/migration_from_base_and_back.stdout.log"
target = phd_framework::log_config
|
| 253 | 2026-10-03T05:51:04.158Z | INFO | phd-runner: [NEW - EVENT] Launched server with pid 937
file = phd-tests/framework/src/test_vm/server.rs
line = 127
path = phd_tests::migrate::from_base::migration_from_base_and_back
target = phd_framework::test_vm::server
|
| 254 | 2026-10-03T05:51:04.173Z | INFO | phd-runner: [NEW - END]
elapsed_milliseconds = 60
file = phd-tests/framework/src/test_vm/mod.rs
line = 300
path = phd_tests::migrate::from_base::migration_from_base_and_back
target = phd_framework::test_vm
|
| 255 | 2026-10-03T05:51:04.173Z | INFO | phd-runner: [INSTANCE_ENSURE_INTERNAL - START]
file = phd-tests/framework/src/test_vm/mod.rs
line = 412
path = phd_tests::migrate::from_base::migration_from_base_and_back
target = phd_framework::test_vm
vm = migration_from_base_and_back
vm_id = ae72af00-9ae9-4133-8d29-67647c4e30e2
|
| 256 | 2026-10-03T05:51:04.174Z | INFO | phd-runner: [INSTANCE_ENSURE_INTERNAL - EVENT] retriable error from instance_spec_ensure
e = Communication Error: error sending request for url (http://127.0.0.1:9000/instance)
file = phd-tests/framework/src/test_vm/mod.rs
line = 455
path = phd_tests::migrate::from_base::migration_from_base_and_back
target = phd_framework::test_vm
vm = migration_from_base_and_back
vm_id = ae72af00-9ae9-4133-8d29-67647c4e30e2
|
| 257 | 2026-10-03T05:51:04.907Z | INFO | phd-runner: [SERIAL CONSOLE TASK - START]
file = phd-tests/framework/src/serial/mod.rs
line = 200
target = phd_framework::serial
|
| 258 | 2026-10-03T05:51:04.909Z | INFO | phd-runner: [INSTANCE_ENSURE_INTERNAL - EVENT] Started instance
file = phd-tests/framework/src/test_vm/mod.rs
instance_description.instance = Instance { properties: InstanceProperties { id: ae72af00-9ae9-4133-8d29-67647c4e30e2, name: "phd-vm-ae72af00-9ae9-4133-8d29-67647c4e30e2", description: "Pheidippides-managed VM", metadata: InstanceMetadata { silo_id: 84a8003e-7a05-4eee-a694-abccff82a247, project_id: c34a9713-ab12-40ce-acf8-c4f606a3889c, sled_id: fe5543d3-baaf-4536-9ca6-04fe4953de29, sled_serial: "fe5543d3-baaf-4536-9ca6-04fe4953de29", sled_revision: 1, sled_model: "pheidippes" } }, state: Creating }
line = 514
path = phd_tests::migrate::from_base::migration_from_base_and_back
target = phd_framework::test_vm
vm = migration_from_base_and_back
vm_id = ae72af00-9ae9-4133-8d29-67647c4e30e2
|
| 259 | 2026-10-03T05:51:04.909Z | INFO | phd-runner: [PUT_INSTANCE_STATE - START]
file = phd-tests/framework/src/test_vm/mod.rs
line = 575
path = phd_tests::migrate::from_base::migration_from_base_and_back
target = phd_framework::test_vm
vm = migration_from_base_and_back
vm_id = ae72af00-9ae9-4133-8d29-67647c4e30e2
|
| 260 | 2026-10-03T05:51:04.909Z | INFO | phd-runner: [PUT_INSTANCE_STATE - EVENT] Requesting instance state change
file = phd-tests/framework/src/test_vm/mod.rs
line = 580
path = phd_tests::migrate::from_base::migration_from_base_and_back
state = Run
target = phd_framework::test_vm
vm = migration_from_base_and_back
vm_id = ae72af00-9ae9-4133-8d29-67647c4e30e2
|
| 261 | 2026-10-03T05:51:04.910Z | INFO | phd-runner: [PUT_INSTANCE_STATE - END]
elapsed_milliseconds = 0
file = phd-tests/framework/src/test_vm/mod.rs
line = 575
path = phd_tests::migrate::from_base::migration_from_base_and_back
target = phd_framework::test_vm
vm = migration_from_base_and_back
vm_id = ae72af00-9ae9-4133-8d29-67647c4e30e2
|
| 262 | 2026-10-03T05:51:04.910Z | INFO | phd-runner: [WAIT_TO_BOOT - START]
file = phd-tests/framework/src/test_vm/mod.rs
line = 890
path = phd_tests::migrate::from_base::migration_from_base_and_back
target = phd_framework::test_vm
|
| 263 | 2026-10-03T05:51:04.910Z | INFO | phd-runner: [WAIT_TO_BOOT - EVENT] waiting for guest to boot
file = phd-tests/framework/src/test_vm/mod.rs
line = 839
path = phd_tests::migrate::from_base::migration_from_base_and_back
target = phd_framework::test_vm
timeout_duration = 300s
vm = migration_from_base_and_back
vm_id = ae72af00-9ae9-4133-8d29-67647c4e30e2
|
| 264 | 2026-10-03T05:51:04.910Z | DEBG | phd-runner: [WAIT_TO_BOOT - EVENT] executing command in boot sequence
file = phd-tests/framework/src/test_vm/mod.rs
line = 847
path = phd_tests::migrate::from_base::migration_from_base_and_back
step = WaitFor("localhost login: ")
target = phd_framework::test_vm
|
| 265 | 2026-10-03T05:51:04.910Z | INFO | phd-runner: [WAIT_FOR_SERIAL_OUTPUT - START]
file = phd-tests/framework/src/test_vm/mod.rs
line = 913
path = phd_tests::migrate::from_base::migration_from_base_and_back
target = phd_framework::test_vm
vm = migration_from_base_and_back
vm_id = ae72af00-9ae9-4133-8d29-67647c4e30e2
|
| 266 | 2026-10-03T05:51:04.910Z | INFO | phd-runner: [WAIT_FOR_SERIAL_OUTPUT - EVENT] Waiting for output on serial console
file = phd-tests/framework/src/test_vm/mod.rs
line = 920
path = phd_tests::migrate::from_base::migration_from_base_and_back
target = phd_framework::test_vm
timeout_duration = CallerTimeout
vm = migration_from_base_and_back
vm_id = ae72af00-9ae9-4133-8d29-67647c4e30e2
|
| 267 | 2026-10-03T05:51:09.565Z | INFO | phd-runner: [WAIT_FOR_SERIAL_OUTPUT - END]
elapsed_milliseconds = 4655
file = phd-tests/framework/src/test_vm/mod.rs
line = 913
path = phd_tests::migrate::from_base::migration_from_base_and_back
target = phd_framework::test_vm
vm = migration_from_base_and_back
vm_id = ae72af00-9ae9-4133-8d29-67647c4e30e2
|
| 268 | 2026-10-03T05:51:09.566Z | DEBG | phd-runner: [WAIT_TO_BOOT - EVENT] executing command in boot sequence
file = phd-tests/framework/src/test_vm/mod.rs
line = 847
path = phd_tests::migrate::from_base::migration_from_base_and_back
step = WriteStr("root")
target = phd_framework::test_vm
|
| 269 | 2026-10-03T05:51:09.566Z | DEBG | phd-runner: [WAIT_TO_BOOT - EVENT] executing command in boot sequence
file = phd-tests/framework/src/test_vm/mod.rs
line = 847
path = phd_tests::migrate::from_base::migration_from_base_and_back
step = WaitFor("localhost:~#")
target = phd_framework::test_vm
|
| 270 | 2026-10-03T05:51:09.566Z | INFO | phd-runner: [WAIT_FOR_SERIAL_OUTPUT - START]
file = phd-tests/framework/src/test_vm/mod.rs
line = 913
path = phd_tests::migrate::from_base::migration_from_base_and_back
target = phd_framework::test_vm
vm = migration_from_base_and_back
vm_id = ae72af00-9ae9-4133-8d29-67647c4e30e2
|
| 271 | 2026-10-03T05:51:09.566Z | INFO | phd-runner: [WAIT_FOR_SERIAL_OUTPUT - EVENT] Waiting for output on serial console
file = phd-tests/framework/src/test_vm/mod.rs
line = 920
path = phd_tests::migrate::from_base::migration_from_base_and_back
target = phd_framework::test_vm
timeout_duration = CallerTimeout
vm = migration_from_base_and_back
vm_id = ae72af00-9ae9-4133-8d29-67647c4e30e2
|
| 272 | 2026-10-03T05:51:09.585Z | INFO | phd-runner: [WAIT_FOR_SERIAL_OUTPUT - END]
elapsed_milliseconds = 18
file = phd-tests/framework/src/test_vm/mod.rs
line = 913
path = phd_tests::migrate::from_base::migration_from_base_and_back
target = phd_framework::test_vm
vm = migration_from_base_and_back
vm_id = ae72af00-9ae9-4133-8d29-67647c4e30e2
|
| 273 | 2026-10-03T05:51:09.585Z | DEBG | phd-runner: [WAIT_TO_BOOT - EVENT] executing command in boot sequence
file = phd-tests/framework/src/test_vm/mod.rs
line = 847
path = phd_tests::migrate::from_base::migration_from_base_and_back
step = WriteStr("stty -F `tty` cols 9999")
target = phd_framework::test_vm
|
| 274 | 2026-10-03T05:51:09.585Z | DEBG | phd-runner: [WAIT_TO_BOOT - EVENT] executing command in boot sequence
file = phd-tests/framework/src/test_vm/mod.rs
line = 847
path = phd_tests::migrate::from_base::migration_from_base_and_back
step = WaitFor("localhost:~#")
target = phd_framework::test_vm
|
| 275 | 2026-10-03T05:51:09.585Z | INFO | phd-runner: [WAIT_FOR_SERIAL_OUTPUT - START]
file = phd-tests/framework/src/test_vm/mod.rs
line = 913
path = phd_tests::migrate::from_base::migration_from_base_and_back
target = phd_framework::test_vm
vm = migration_from_base_and_back
vm_id = ae72af00-9ae9-4133-8d29-67647c4e30e2
|
| 276 | 2026-10-03T05:51:09.585Z | INFO | phd-runner: [WAIT_FOR_SERIAL_OUTPUT - EVENT] Waiting for output on serial console
file = phd-tests/framework/src/test_vm/mod.rs
line = 920
path = phd_tests::migrate::from_base::migration_from_base_and_back
target = phd_framework::test_vm
timeout_duration = CallerTimeout
vm = migration_from_base_and_back
vm_id = ae72af00-9ae9-4133-8d29-67647c4e30e2
|
| 277 | 2026-10-03T05:51:09.619Z | INFO | phd-runner: [WAIT_FOR_SERIAL_OUTPUT - END]
elapsed_milliseconds = 33
file = phd-tests/framework/src/test_vm/mod.rs
line = 913
path = phd_tests::migrate::from_base::migration_from_base_and_back
target = phd_framework::test_vm
vm = migration_from_base_and_back
vm_id = ae72af00-9ae9-4133-8d29-67647c4e30e2
|
| 278 | 2026-10-03T05:51:09.619Z | INFO | phd-runner: [WAIT_TO_BOOT - EVENT] Guest has booted
file = phd-tests/framework/src/test_vm/mod.rs
line = 887
path = phd_tests::migrate::from_base::migration_from_base_and_back
target = phd_framework::test_vm
|
| 279 | 2026-10-03T05:51:09.619Z | INFO | phd-runner: [WAIT_TO_BOOT - END]
elapsed_milliseconds = 4708
file = phd-tests/framework/src/test_vm/mod.rs
line = 890
path = phd_tests::migrate::from_base::migration_from_base_and_back
target = phd_framework::test_vm
|
| 280 | 2026-10-03T05:51:09.619Z | INFO | phd-runner: [WAIT_FOR_SERIAL_OUTPUT - START]
file = phd-tests/framework/src/test_vm/mod.rs
line = 913
path = phd_tests::migrate::from_base::migration_from_base_and_back
target = phd_framework::test_vm
vm = migration_from_base_and_back
vm_id = ae72af00-9ae9-4133-8d29-67647c4e30e2
|
| 281 | 2026-10-03T05:51:09.619Z | INFO | phd-runner: [WAIT_FOR_SERIAL_OUTPUT - EVENT] Waiting for output on serial console
file = phd-tests/framework/src/test_vm/mod.rs
line = 920
path = phd_tests::migrate::from_base::migration_from_base_and_back
target = phd_framework::test_vm
timeout_duration = Explicit(15s)
vm = migration_from_base_and_back
vm_id = ae72af00-9ae9-4133-8d29-67647c4e30e2
|
| 282 | 2026-10-03T05:51:09.629Z | INFO | phd-runner: [WAIT_FOR_SERIAL_OUTPUT - END]
elapsed_milliseconds = 9
file = phd-tests/framework/src/test_vm/mod.rs
line = 913
path = phd_tests::migrate::from_base::migration_from_base_and_back
target = phd_framework::test_vm
vm = migration_from_base_and_back
vm_id = ae72af00-9ae9-4133-8d29-67647c4e30e2
|
| 283 | 2026-10-03T05:51:09.629Z | INFO | phd-runner: [WAIT_FOR_SERIAL_OUTPUT - START]
file = phd-tests/framework/src/test_vm/mod.rs
line = 913
path = phd_tests::migrate::from_base::migration_from_base_and_back
target = phd_framework::test_vm
vm = migration_from_base_and_back
vm_id = ae72af00-9ae9-4133-8d29-67647c4e30e2
|
| 284 | 2026-10-03T05:51:09.629Z | INFO | phd-runner: [WAIT_FOR_SERIAL_OUTPUT - EVENT] Waiting for output on serial console
file = phd-tests/framework/src/test_vm/mod.rs
line = 920
path = phd_tests::migrate::from_base::migration_from_base_and_back
target = phd_framework::test_vm
timeout_duration = Explicit(300s)
vm = migration_from_base_and_back
vm_id = ae72af00-9ae9-4133-8d29-67647c4e30e2
|
| 285 | 2026-10-03T05:51:09.663Z | INFO | phd-runner: [WAIT_FOR_SERIAL_OUTPUT - END]
elapsed_milliseconds = 33
file = phd-tests/framework/src/test_vm/mod.rs
line = 913
path = phd_tests::migrate::from_base::migration_from_base_and_back
target = phd_framework::test_vm
vm = migration_from_base_and_back
vm_id = ae72af00-9ae9-4133-8d29-67647c4e30e2
|
| 286 | 2026-10-03T05:51:09.663Z | INFO | phd-runner: [WAIT_FOR_SERIAL_OUTPUT - START]
file = phd-tests/framework/src/test_vm/mod.rs
line = 913
path = phd_tests::migrate::from_base::migration_from_base_and_back
target = phd_framework::test_vm
vm = migration_from_base_and_back
vm_id = ae72af00-9ae9-4133-8d29-67647c4e30e2
|
| 287 | 2026-10-03T05:51:09.663Z | INFO | phd-runner: [WAIT_FOR_SERIAL_OUTPUT - EVENT] Waiting for output on serial console
file = phd-tests/framework/src/test_vm/mod.rs
line = 920
path = phd_tests::migrate::from_base::migration_from_base_and_back
target = phd_framework::test_vm
timeout_duration = Explicit(15s)
vm = migration_from_base_and_back
vm_id = ae72af00-9ae9-4133-8d29-67647c4e30e2
|
| 288 | 2026-10-03T05:51:09.674Z | INFO | phd-runner: [WAIT_FOR_SERIAL_OUTPUT - END]
elapsed_milliseconds = 10
file = phd-tests/framework/src/test_vm/mod.rs
line = 913
path = phd_tests::migrate::from_base::migration_from_base_and_back
target = phd_framework::test_vm
vm = migration_from_base_and_back
vm_id = ae72af00-9ae9-4133-8d29-67647c4e30e2
|
| 289 | 2026-10-03T05:51:09.674Z | INFO | phd-runner: [WAIT_FOR_SERIAL_OUTPUT - START]
file = phd-tests/framework/src/test_vm/mod.rs
line = 913
path = phd_tests::migrate::from_base::migration_from_base_and_back
target = phd_framework::test_vm
vm = migration_from_base_and_back
vm_id = ae72af00-9ae9-4133-8d29-67647c4e30e2
|
| 290 | 2026-10-03T05:51:09.674Z | INFO | phd-runner: [WAIT_FOR_SERIAL_OUTPUT - EVENT] Waiting for output on serial console
file = phd-tests/framework/src/test_vm/mod.rs
line = 920
path = phd_tests::migrate::from_base::migration_from_base_and_back
target = phd_framework::test_vm
timeout_duration = Explicit(300s)
vm = migration_from_base_and_back
vm_id = ae72af00-9ae9-4133-8d29-67647c4e30e2
|
| 291 | 2026-10-03T05:51:09.707Z | INFO | phd-runner: [WAIT_FOR_SERIAL_OUTPUT - END]
elapsed_milliseconds = 33
file = phd-tests/framework/src/test_vm/mod.rs
line = 913
path = phd_tests::migrate::from_base::migration_from_base_and_back
target = phd_framework::test_vm
vm = migration_from_base_and_back
vm_id = ae72af00-9ae9-4133-8d29-67647c4e30e2
|
| 292 | 2026-10-03T05:51:09.708Z | INFO | phd-runner: [WAIT_FOR_SERIAL_OUTPUT - START]
file = phd-tests/framework/src/test_vm/mod.rs
line = 913
path = phd_tests::migrate::from_base::migration_from_base_and_back
target = phd_framework::test_vm
vm = migration_from_base_and_back
vm_id = ae72af00-9ae9-4133-8d29-67647c4e30e2
|
| 293 | 2026-10-03T05:51:09.708Z | INFO | phd-runner: [WAIT_FOR_SERIAL_OUTPUT - EVENT] Waiting for output on serial console
file = phd-tests/framework/src/test_vm/mod.rs
line = 920
path = phd_tests::migrate::from_base::migration_from_base_and_back
target = phd_framework::test_vm
timeout_duration = Explicit(15s)
vm = migration_from_base_and_back
vm_id = ae72af00-9ae9-4133-8d29-67647c4e30e2
|
| 294 | 2026-10-03T05:51:09.718Z | INFO | phd-runner: [WAIT_FOR_SERIAL_OUTPUT - END]
elapsed_milliseconds = 10
file = phd-tests/framework/src/test_vm/mod.rs
line = 913
path = phd_tests::migrate::from_base::migration_from_base_and_back
target = phd_framework::test_vm
vm = migration_from_base_and_back
vm_id = ae72af00-9ae9-4133-8d29-67647c4e30e2
|
| 295 | 2026-10-03T05:51:09.718Z | INFO | phd-runner: [WAIT_FOR_SERIAL_OUTPUT - START]
file = phd-tests/framework/src/test_vm/mod.rs
line = 913
path = phd_tests::migrate::from_base::migration_from_base_and_back
target = phd_framework::test_vm
vm = migration_from_base_and_back
vm_id = ae72af00-9ae9-4133-8d29-67647c4e30e2
|
| 296 | 2026-10-03T05:51:09.719Z | INFO | phd-runner: [WAIT_FOR_SERIAL_OUTPUT - EVENT] Waiting for output on serial console
file = phd-tests/framework/src/test_vm/mod.rs
line = 920
path = phd_tests::migrate::from_base::migration_from_base_and_back
target = phd_framework::test_vm
timeout_duration = Explicit(300s)
vm = migration_from_base_and_back
vm_id = ae72af00-9ae9-4133-8d29-67647c4e30e2
|
| 297 | 2026-10-03T05:51:09.752Z | INFO | phd-runner: [WAIT_FOR_SERIAL_OUTPUT - END]
elapsed_milliseconds = 33
file = phd-tests/framework/src/test_vm/mod.rs
line = 913
path = phd_tests::migrate::from_base::migration_from_base_and_back
target = phd_framework::test_vm
vm = migration_from_base_and_back
vm_id = ae72af00-9ae9-4133-8d29-67647c4e30e2
|
| 298 | 2026-10-03T05:51:09.752Z | INFO | phd-runner: [WAIT_FOR_SERIAL_OUTPUT - START]
file = phd-tests/framework/src/test_vm/mod.rs
line = 913
path = phd_tests::migrate::from_base::migration_from_base_and_back
target = phd_framework::test_vm
vm = migration_from_base_and_back
vm_id = ae72af00-9ae9-4133-8d29-67647c4e30e2
|
| 299 | 2026-10-03T05:51:09.752Z | INFO | phd-runner: [WAIT_FOR_SERIAL_OUTPUT - EVENT] Waiting for output on serial console
file = phd-tests/framework/src/test_vm/mod.rs
line = 920
path = phd_tests::migrate::from_base::migration_from_base_and_back
target = phd_framework::test_vm
timeout_duration = Explicit(15s)
vm = migration_from_base_and_back
vm_id = ae72af00-9ae9-4133-8d29-67647c4e30e2
|
| 300 | 2026-10-03T05:51:09.763Z | INFO | phd-runner: [WAIT_FOR_SERIAL_OUTPUT - END]
elapsed_milliseconds = 10
file = phd-tests/framework/src/test_vm/mod.rs
line = 913
path = phd_tests::migrate::from_base::migration_from_base_and_back
target = phd_framework::test_vm
vm = migration_from_base_and_back
vm_id = ae72af00-9ae9-4133-8d29-67647c4e30e2
|
| 301 | 2026-10-03T05:51:09.764Z | INFO | phd-runner: [WAIT_FOR_SERIAL_OUTPUT - START]
file = phd-tests/framework/src/test_vm/mod.rs
line = 913
path = phd_tests::migrate::from_base::migration_from_base_and_back
target = phd_framework::test_vm
vm = migration_from_base_and_back
vm_id = ae72af00-9ae9-4133-8d29-67647c4e30e2
|
| 302 | 2026-10-03T05:51:09.764Z | INFO | phd-runner: [WAIT_FOR_SERIAL_OUTPUT - EVENT] Waiting for output on serial console
file = phd-tests/framework/src/test_vm/mod.rs
line = 920
path = phd_tests::migrate::from_base::migration_from_base_and_back
target = phd_framework::test_vm
timeout_duration = Explicit(300s)
vm = migration_from_base_and_back
vm_id = ae72af00-9ae9-4133-8d29-67647c4e30e2
|
| 303 | 2026-10-03T05:51:09.797Z | INFO | phd-runner: [WAIT_FOR_SERIAL_OUTPUT - END]
elapsed_milliseconds = 33
file = phd-tests/framework/src/test_vm/mod.rs
line = 913
path = phd_tests::migrate::from_base::migration_from_base_and_back
target = phd_framework::test_vm
vm = migration_from_base_and_back
vm_id = ae72af00-9ae9-4133-8d29-67647c4e30e2
|
| 304 | 2026-10-03T05:51:09.797Z | INFO | phd-runner: [WAIT_FOR_SERIAL_OUTPUT - START]
file = phd-tests/framework/src/test_vm/mod.rs
line = 913
path = phd_tests::migrate::from_base::migration_from_base_and_back
target = phd_framework::test_vm
vm = migration_from_base_and_back
vm_id = ae72af00-9ae9-4133-8d29-67647c4e30e2
|
| 305 | 2026-10-03T05:51:09.797Z | INFO | phd-runner: [WAIT_FOR_SERIAL_OUTPUT - EVENT] Waiting for output on serial console
file = phd-tests/framework/src/test_vm/mod.rs
line = 920
path = phd_tests::migrate::from_base::migration_from_base_and_back
target = phd_framework::test_vm
timeout_duration = Explicit(15s)
vm = migration_from_base_and_back
vm_id = ae72af00-9ae9-4133-8d29-67647c4e30e2
|
| 306 | 2026-10-03T05:51:09.808Z | INFO | phd-runner: [WAIT_FOR_SERIAL_OUTPUT - END]
elapsed_milliseconds = 10
file = phd-tests/framework/src/test_vm/mod.rs
line = 913
path = phd_tests::migrate::from_base::migration_from_base_and_back
target = phd_framework::test_vm
vm = migration_from_base_and_back
vm_id = ae72af00-9ae9-4133-8d29-67647c4e30e2
|
| 307 | 2026-10-03T05:51:09.808Z | INFO | phd-runner: [WAIT_FOR_SERIAL_OUTPUT - START]
file = phd-tests/framework/src/test_vm/mod.rs
line = 913
path = phd_tests::migrate::from_base::migration_from_base_and_back
target = phd_framework::test_vm
vm = migration_from_base_and_back
vm_id = ae72af00-9ae9-4133-8d29-67647c4e30e2
|
| 308 | 2026-10-03T05:51:09.808Z | INFO | phd-runner: [WAIT_FOR_SERIAL_OUTPUT - EVENT] Waiting for output on serial console
file = phd-tests/framework/src/test_vm/mod.rs
line = 920
path = phd_tests::migrate::from_base::migration_from_base_and_back
target = phd_framework::test_vm
timeout_duration = Explicit(300s)
vm = migration_from_base_and_back
vm_id = ae72af00-9ae9-4133-8d29-67647c4e30e2
|
| 309 | 2026-10-03T05:51:09.840Z | INFO | phd-runner: [WAIT_FOR_SERIAL_OUTPUT - END]
elapsed_milliseconds = 32
file = phd-tests/framework/src/test_vm/mod.rs
line = 913
path = phd_tests::migrate::from_base::migration_from_base_and_back
target = phd_framework::test_vm
vm = migration_from_base_and_back
vm_id = ae72af00-9ae9-4133-8d29-67647c4e30e2
|
| 310 | 2026-10-03T05:51:09.840Z | INFO | phd-runner: [WAIT_FOR_SERIAL_OUTPUT - START]
file = phd-tests/framework/src/test_vm/mod.rs
line = 913
path = phd_tests::migrate::from_base::migration_from_base_and_back
target = phd_framework::test_vm
vm = migration_from_base_and_back
vm_id = ae72af00-9ae9-4133-8d29-67647c4e30e2
|
| 311 | 2026-10-03T05:51:09.841Z | INFO | phd-runner: [WAIT_FOR_SERIAL_OUTPUT - EVENT] Waiting for output on serial console
file = phd-tests/framework/src/test_vm/mod.rs
line = 920
path = phd_tests::migrate::from_base::migration_from_base_and_back
target = phd_framework::test_vm
timeout_duration = Explicit(15s)
vm = migration_from_base_and_back
vm_id = ae72af00-9ae9-4133-8d29-67647c4e30e2
|
| 312 | 2026-10-03T05:51:09.851Z | INFO | phd-runner: [WAIT_FOR_SERIAL_OUTPUT - END]
elapsed_milliseconds = 10
file = phd-tests/framework/src/test_vm/mod.rs
line = 913
path = phd_tests::migrate::from_base::migration_from_base_and_back
target = phd_framework::test_vm
vm = migration_from_base_and_back
vm_id = ae72af00-9ae9-4133-8d29-67647c4e30e2
|
| 313 | 2026-10-03T05:51:09.851Z | INFO | phd-runner: [WAIT_FOR_SERIAL_OUTPUT - START]
file = phd-tests/framework/src/test_vm/mod.rs
line = 913
path = phd_tests::migrate::from_base::migration_from_base_and_back
target = phd_framework::test_vm
vm = migration_from_base_and_back
vm_id = ae72af00-9ae9-4133-8d29-67647c4e30e2
|
| 314 | 2026-10-03T05:51:09.851Z | INFO | phd-runner: [WAIT_FOR_SERIAL_OUTPUT - EVENT] Waiting for output on serial console
file = phd-tests/framework/src/test_vm/mod.rs
line = 920
path = phd_tests::migrate::from_base::migration_from_base_and_back
target = phd_framework::test_vm
timeout_duration = Explicit(300s)
vm = migration_from_base_and_back
vm_id = ae72af00-9ae9-4133-8d29-67647c4e30e2
|
| 315 | 2026-10-03T05:51:09.885Z | INFO | phd-runner: [WAIT_FOR_SERIAL_OUTPUT - END]
elapsed_milliseconds = 33
file = phd-tests/framework/src/test_vm/mod.rs
line = 913
path = phd_tests::migrate::from_base::migration_from_base_and_back
target = phd_framework::test_vm
vm = migration_from_base_and_back
vm_id = ae72af00-9ae9-4133-8d29-67647c4e30e2
|
| 316 | 2026-10-03T05:51:09.885Z | INFO | phd-runner: [TEST - EVENT] migrating to new Propolis artifact for lifecycle test
file = phd-tests/framework/src/lifecycle.rs
line = 73
path = phd_tests::migrate::from_base::migration_from_base_and_back
propolis_artifact = __DEFAULT_PROPOLIS
target = phd_framework::lifecycle
vm_name = migration_from_base_and_back
|
| 317 | 2026-10-03T05:51:09.885Z | INFO | phd-runner: [NEW - START]
file = phd-tests/framework/src/test_vm/mod.rs
line = 300
path = phd_tests::migrate::from_base::migration_from_base_and_back
target = phd_framework::test_vm
|
| 318 | 2026-10-03T05:51:09.885Z | INFO | phd-runner: [NEW - EVENT] phd_framework::test_vm
environment = EnvironmentSpec { location: Local, propolis_artifact: "__DEFAULT_PROPOLIS", metrics: None }
file = phd-tests/framework/src/test_vm/mod.rs
guest_os_kind = Alpine
line = 318
path = phd_tests::migrate::from_base::migration_from_base_and_back
target = phd_framework::test_vm
vm_name = migration_from_base_and_back_lifecycle_0
|
| 319 | 2026-10-03T05:51:09.885Z | DEBG | phd-runner: [NEW - EVENT] Verified artifact already exists
file = phd-tests/framework/src/artifacts/store.rs
line = 45
path = /work/phd-test/propolis-server
target = phd_framework::artifacts::store
|
| 320 | 2026-10-03T05:51:09.885Z | INFO | phd-runner: [NEW - EVENT] Launching Propolis server
bootrom_path = "/phd-artifacts/740187046a7267d0de72d3455070333547dbc0ea023531471fb2b2a61effa448/OVMF_CODE.fd"
file = phd-tests/framework/src/test_vm/server.rs
line = 66
path = phd_tests::migrate::from_base::migration_from_base_and_back
server_addr = 127.0.0.1:9002
server_path = "/work/phd-test/propolis-server"
target = phd_framework::test_vm::server
|
| 321 | 2026-10-03T05:51:09.885Z | INFO | phd-runner: [NEW - EVENT] Opening server log files
file = phd-tests/framework/src/log_config.rs
line = 84
path = phd_tests::migrate::from_base::migration_from_base_and_back
stderr_path = "/tmp/propolis-phd/phd_tests::migrate::from_base::migration_from_base_and_back/migration_from_base_and_back_lifecycle_0.stderr.log"
stdout_path = "/tmp/propolis-phd/phd_tests::migrate::from_base::migration_from_base_and_back/migration_from_base_and_back_lifecycle_0.stdout.log"
target = phd_framework::log_config
|
| 322 | 2026-10-03T05:51:09.926Z | INFO | phd-runner: [NEW - EVENT] Launched server with pid 938
file = phd-tests/framework/src/test_vm/server.rs
line = 127
path = phd_tests::migrate::from_base::migration_from_base_and_back
target = phd_framework::test_vm::server
|
| 323 | 2026-10-03T05:51:09.939Z | INFO | phd-runner: [NEW - END]
elapsed_milliseconds = 54
file = phd-tests/framework/src/test_vm/mod.rs
line = 300
path = phd_tests::migrate::from_base::migration_from_base_and_back
target = phd_framework::test_vm
|
| 324 | 2026-10-03T05:51:09.939Z | INFO | phd-runner: [MIGRATE_FROM - START]
file = phd-tests/framework/src/test_vm/mod.rs
line = 609
path = phd_tests::migrate::from_base::migration_from_base_and_back
source = migration_from_base_and_back
source_id = ae72af00-9ae9-4133-8d29-67647c4e30e2
target = phd_framework::test_vm
target_id = 6e7455ec-0ac8-4901-939c-2b6a2a60d626
|
| 325 | 2026-10-03T05:51:09.939Z | INFO | phd-runner: [MIGRATE_FROM - EVENT] Migrating from source at address 127.0.0.1:9000
file = phd-tests/framework/src/test_vm/mod.rs
line = 642
migration_id = d0a848a4-773c-4020-9ae2-07fe0b09b94c
path = phd_tests::migrate::from_base::migration_from_base_and_back
source = migration_from_base_and_back
source_id = ae72af00-9ae9-4133-8d29-67647c4e30e2
target = phd_framework::test_vm
target_id = 6e7455ec-0ac8-4901-939c-2b6a2a60d626
timeout_duration = 45s
|
| 326 | 2026-10-03T05:51:09.939Z | INFO | phd-runner: [INSTANCE_ENSURE_INTERNAL - START]
file = phd-tests/framework/src/test_vm/mod.rs
line = 412
path = phd_tests::migrate::from_base::migration_from_base_and_back
source = migration_from_base_and_back
source_id = ae72af00-9ae9-4133-8d29-67647c4e30e2
target = phd_framework::test_vm
target_id = 6e7455ec-0ac8-4901-939c-2b6a2a60d626
vm = migration_from_base_and_back_lifecycle_0
vm_id = 6e7455ec-0ac8-4901-939c-2b6a2a60d626
|
| 327 | 2026-10-03T05:51:09.940Z | INFO | phd-runner: [INSTANCE_ENSURE_INTERNAL - EVENT] retriable error from instance_spec_ensure
e = Communication Error: error sending request for url (http://127.0.0.1:9002/instance)
file = phd-tests/framework/src/test_vm/mod.rs
line = 455
path = phd_tests::migrate::from_base::migration_from_base_and_back
source = migration_from_base_and_back
source_id = ae72af00-9ae9-4133-8d29-67647c4e30e2
target = phd_framework::test_vm
target_id = 6e7455ec-0ac8-4901-939c-2b6a2a60d626
vm = migration_from_base_and_back_lifecycle_0
vm_id = 6e7455ec-0ac8-4901-939c-2b6a2a60d626
|
| 328 | 2026-10-03T05:51:10.473Z | INFO | phd-runner: [INSTANCE_ENSURE_INTERNAL - EVENT] Started instance
file = phd-tests/framework/src/test_vm/mod.rs
instance_description.instance = Instance { properties: InstanceProperties { id: 6e7455ec-0ac8-4901-939c-2b6a2a60d626, name: "phd-vm-6e7455ec-0ac8-4901-939c-2b6a2a60d626", description: "Pheidippides-managed VM", metadata: InstanceMetadata { silo_id: 84a8003e-7a05-4eee-a694-abccff82a247, project_id: c34a9713-ab12-40ce-acf8-c4f606a3889c, sled_id: ec3c9a4e-032d-4a7b-9cc8-d7e8df44f833, sled_serial: "ec3c9a4e-032d-4a7b-9cc8-d7e8df44f833", sled_revision: 1, sled_model: "pheidippes" } }, state: Migrating }
line = 514
path = phd_tests::migrate::from_base::migration_from_base_and_back
source = migration_from_base_and_back
source_id = ae72af00-9ae9-4133-8d29-67647c4e30e2
target = phd_framework::test_vm
target_id = 6e7455ec-0ac8-4901-939c-2b6a2a60d626
vm = migration_from_base_and_back_lifecycle_0
vm_id = 6e7455ec-0ac8-4901-939c-2b6a2a60d626
|
| 329 | 2026-10-03T05:51:10.473Z | INFO | phd-runner: [MIGRATE - START]
file = phd-tests/framework/src/test_vm/mod.rs
line = 663
migration_id = d0a848a4-773c-4020-9ae2-07fe0b09b94c
path = phd_tests::migrate::from_base::migration_from_base_and_back
source = migration_from_base_and_back
source_id = ae72af00-9ae9-4133-8d29-67647c4e30e2
target = phd_framework::test_vm
target_id = 6e7455ec-0ac8-4901-939c-2b6a2a60d626
|
| 330 | 2026-10-03T05:51:13.028Z | INFO | phd-runner: [SERIAL CONSOLE TASK - EVENT] serial socket control message
file = phd-tests/framework/src/serial/mod.rs
line = 275
s = {"Migrating":{"destination":"127.0.0.1:9002","from_start":7847}}
target = phd_framework::serial
|
| 331 | 2026-10-03T05:51:14.211Z | INFO | phd-runner: [MIGRATE_FROM - EVENT] Migration completed successfully
file = phd-tests/framework/src/test_vm/mod.rs
line = 676
path = phd_tests::migrate::from_base::migration_from_base_and_back
source = migration_from_base_and_back
source_id = ae72af00-9ae9-4133-8d29-67647c4e30e2
target = phd_framework::test_vm
target_id = 6e7455ec-0ac8-4901-939c-2b6a2a60d626
|
| 332 | 2026-10-03T05:51:14.212Z | INFO | phd-runner: [MIGRATE - END]
elapsed_milliseconds = 3737
file = phd-tests/framework/src/test_vm/mod.rs
line = 663
migration_id = d0a848a4-773c-4020-9ae2-07fe0b09b94c
path = phd_tests::migrate::from_base::migration_from_base_and_back
source = migration_from_base_and_back
source_id = ae72af00-9ae9-4133-8d29-67647c4e30e2
target = phd_framework::test_vm
target_id = 6e7455ec-0ac8-4901-939c-2b6a2a60d626
|
| 333 | 2026-10-03T05:51:14.214Z | INFO | phd-runner: [VM CLEANUP - START]
file = phd-tests/framework/src/test_vm/mod.rs
line = 1172
path = phd_tests::migrate::from_base::migration_from_base_and_back
target = phd_framework::test_vm
vm = migration_from_base_and_back
vm_id = ae72af00-9ae9-4133-8d29-67647c4e30e2
|
| 334 | 2026-10-03T05:51:14.214Z | INFO | phd-runner: [WAIT_FOR_SERIAL_OUTPUT - START]
file = phd-tests/framework/src/test_vm/mod.rs
line = 913
path = phd_tests::migrate::from_base::migration_from_base_and_back
target = phd_framework::test_vm
vm = migration_from_base_and_back_lifecycle_0
vm_id = 6e7455ec-0ac8-4901-939c-2b6a2a60d626
|
| 335 | 2026-10-03T05:51:14.214Z | INFO | phd-runner: [WAIT_FOR_SERIAL_OUTPUT - EVENT] Waiting for output on serial console
file = phd-tests/framework/src/test_vm/mod.rs
line = 920
path = phd_tests::migrate::from_base::migration_from_base_and_back
target = phd_framework::test_vm
timeout_duration = Explicit(15s)
vm = migration_from_base_and_back_lifecycle_0
vm_id = 6e7455ec-0ac8-4901-939c-2b6a2a60d626
|
| 336 | 2026-10-03T05:51:14.216Z | DEBG | phd-runner: [VM CLEANUP - EVENT] Killing Propolis server process
file = phd-tests/framework/src/test_vm/server.rs
line = 177
path = phd_tests::migrate::from_base::migration_from_base_and_back
self.address = 127.0.0.1:9000
target = phd_framework::test_vm::server
vm = migration_from_base_and_back
vm_id = ae72af00-9ae9-4133-8d29-67647c4e30e2
|
| 337 | 2026-10-03T05:51:14.299Z | INFO | phd-runner: [VM CLEANUP - END]
elapsed_milliseconds = 84
file = phd-tests/framework/src/test_vm/mod.rs
line = 1172
path = phd_tests::migrate::from_base::migration_from_base_and_back
target = phd_framework::test_vm
vm = migration_from_base_and_back
vm_id = ae72af00-9ae9-4133-8d29-67647c4e30e2
|
| 338 | 2026-10-03T05:51:14.299Z | INFO | phd-runner: [INSTANCE_ENSURE_INTERNAL - END]
elapsed_milliseconds = 10125
file = phd-tests/framework/src/test_vm/mod.rs
line = 412
path = phd_tests::migrate::from_base::migration_from_base_and_back
target = phd_framework::test_vm
vm = migration_from_base_and_back
vm_id = ae72af00-9ae9-4133-8d29-67647c4e30e2
|
| 339 | 2026-10-03T05:51:14.299Z | INFO | phd-runner: [WAIT_FOR_SERIAL_OUTPUT - END]
elapsed_milliseconds = 84
file = phd-tests/framework/src/test_vm/mod.rs
line = 913
path = phd_tests::migrate::from_base::migration_from_base_and_back
target = phd_framework::test_vm
vm = migration_from_base_and_back_lifecycle_0
vm_id = 6e7455ec-0ac8-4901-939c-2b6a2a60d626
|
| 340 | 2026-10-03T05:51:14.299Z | INFO | phd-runner: [WAIT_FOR_SERIAL_OUTPUT - START]
file = phd-tests/framework/src/test_vm/mod.rs
line = 913
path = phd_tests::migrate::from_base::migration_from_base_and_back
target = phd_framework::test_vm
vm = migration_from_base_and_back_lifecycle_0
vm_id = 6e7455ec-0ac8-4901-939c-2b6a2a60d626
|
| 341 | 2026-10-03T05:51:14.299Z | INFO | phd-runner: [WAIT_FOR_SERIAL_OUTPUT - EVENT] Waiting for output on serial console
file = phd-tests/framework/src/test_vm/mod.rs
line = 920
path = phd_tests::migrate::from_base::migration_from_base_and_back
target = phd_framework::test_vm
timeout_duration = Explicit(300s)
vm = migration_from_base_and_back_lifecycle_0
vm_id = 6e7455ec-0ac8-4901-939c-2b6a2a60d626
|
| 342 | 2026-10-03T05:51:14.326Z | INFO | phd-runner: [WAIT_FOR_SERIAL_OUTPUT - END]
elapsed_milliseconds = 26
file = phd-tests/framework/src/test_vm/mod.rs
line = 913
path = phd_tests::migrate::from_base::migration_from_base_and_back
target = phd_framework::test_vm
vm = migration_from_base_and_back_lifecycle_0
vm_id = 6e7455ec-0ac8-4901-939c-2b6a2a60d626
|
| 343 | 2026-10-03T05:51:14.326Z | INFO | phd-runner: [TEST - EVENT] migrating to new Propolis artifact for lifecycle test
file = phd-tests/framework/src/lifecycle.rs
line = 73
path = phd_tests::migrate::from_base::migration_from_base_and_back
propolis_artifact = __BASE_PROPOLIS
target = phd_framework::lifecycle
vm_name = migration_from_base_and_back
|
| 344 | 2026-10-03T05:51:14.326Z | INFO | phd-runner: [NEW - START]
file = phd-tests/framework/src/test_vm/mod.rs
line = 300
path = phd_tests::migrate::from_base::migration_from_base_and_back
target = phd_framework::test_vm
|
| 345 | 2026-10-03T05:51:14.326Z | INFO | phd-runner: [NEW - EVENT] phd_framework::test_vm
environment = EnvironmentSpec { location: Local, propolis_artifact: "__BASE_PROPOLIS", metrics: None }
file = phd-tests/framework/src/test_vm/mod.rs
guest_os_kind = Alpine
line = 318
path = phd_tests::migrate::from_base::migration_from_base_and_back
target = phd_framework::test_vm
vm_name = migration_from_base_and_back_lifecycle_1
|
| 346 | 2026-10-03T05:51:14.327Z | DEBG | phd-runner: [NEW - EVENT] Verified artifact already exists
file = phd-tests/framework/src/artifacts/store.rs
line = 45
path = /phd-artifacts/307d7cf409a11795bd2f449aff90849e1cd9fd6e26ea2c6267e3110786362da9/propolis-server
target = phd_framework::artifacts::store
|
| 347 | 2026-10-03T05:51:14.327Z | INFO | phd-runner: [NEW - EVENT] Launching Propolis server
bootrom_path = "/phd-artifacts/740187046a7267d0de72d3455070333547dbc0ea023531471fb2b2a61effa448/OVMF_CODE.fd"
file = phd-tests/framework/src/test_vm/server.rs
line = 66
path = phd_tests::migrate::from_base::migration_from_base_and_back
server_addr = 127.0.0.1:9004
server_path = "/phd-artifacts/307d7cf409a11795bd2f449aff90849e1cd9fd6e26ea2c6267e3110786362da9/propolis-server"
target = phd_framework::test_vm::server
|
| 348 | 2026-10-03T05:51:14.327Z | INFO | phd-runner: [NEW - EVENT] Opening server log files
file = phd-tests/framework/src/log_config.rs
line = 84
path = phd_tests::migrate::from_base::migration_from_base_and_back
stderr_path = "/tmp/propolis-phd/phd_tests::migrate::from_base::migration_from_base_and_back/migration_from_base_and_back_lifecycle_1.stderr.log"
stdout_path = "/tmp/propolis-phd/phd_tests::migrate::from_base::migration_from_base_and_back/migration_from_base_and_back_lifecycle_1.stdout.log"
target = phd_framework::log_config
|
| 349 | 2026-10-03T05:51:14.371Z | INFO | phd-runner: [NEW - EVENT] Launched server with pid 940
file = phd-tests/framework/src/test_vm/server.rs
line = 127
path = phd_tests::migrate::from_base::migration_from_base_and_back
target = phd_framework::test_vm::server
|
| 350 | 2026-10-03T05:51:14.385Z | INFO | phd-runner: [NEW - END]
elapsed_milliseconds = 58
file = phd-tests/framework/src/test_vm/mod.rs
line = 300
path = phd_tests::migrate::from_base::migration_from_base_and_back
target = phd_framework::test_vm
|
| 351 | 2026-10-03T05:51:14.385Z | INFO | phd-runner: [MIGRATE_FROM - START]
file = phd-tests/framework/src/test_vm/mod.rs
line = 609
path = phd_tests::migrate::from_base::migration_from_base_and_back
source = migration_from_base_and_back_lifecycle_0
source_id = 6e7455ec-0ac8-4901-939c-2b6a2a60d626
target = phd_framework::test_vm
target_id = a3d43092-a581-4a39-95d8-ed717871ecf7
|
| 352 | 2026-10-03T05:51:14.385Z | INFO | phd-runner: [MIGRATE_FROM - EVENT] Migrating from source at address 127.0.0.1:9002
file = phd-tests/framework/src/test_vm/mod.rs
line = 642
migration_id = 81558b90-de79-4635-bf47-bcda4201ddd5
path = phd_tests::migrate::from_base::migration_from_base_and_back
source = migration_from_base_and_back_lifecycle_0
source_id = 6e7455ec-0ac8-4901-939c-2b6a2a60d626
target = phd_framework::test_vm
target_id = a3d43092-a581-4a39-95d8-ed717871ecf7
timeout_duration = 45s
|
| 353 | 2026-10-03T05:51:14.385Z | INFO | phd-runner: [INSTANCE_ENSURE_INTERNAL - START]
file = phd-tests/framework/src/test_vm/mod.rs
line = 412
path = phd_tests::migrate::from_base::migration_from_base_and_back
source = migration_from_base_and_back_lifecycle_0
source_id = 6e7455ec-0ac8-4901-939c-2b6a2a60d626
target = phd_framework::test_vm
target_id = a3d43092-a581-4a39-95d8-ed717871ecf7
vm = migration_from_base_and_back_lifecycle_1
vm_id = a3d43092-a581-4a39-95d8-ed717871ecf7
|
| 354 | 2026-10-03T05:51:14.386Z | INFO | phd-runner: [INSTANCE_ENSURE_INTERNAL - EVENT] retriable error from instance_spec_ensure
e = Communication Error: error sending request for url (http://127.0.0.1:9004/instance)
file = phd-tests/framework/src/test_vm/mod.rs
line = 455
path = phd_tests::migrate::from_base::migration_from_base_and_back
source = migration_from_base_and_back_lifecycle_0
source_id = 6e7455ec-0ac8-4901-939c-2b6a2a60d626
target = phd_framework::test_vm
target_id = a3d43092-a581-4a39-95d8-ed717871ecf7
vm = migration_from_base_and_back_lifecycle_1
vm_id = a3d43092-a581-4a39-95d8-ed717871ecf7
|
| 355 | 2026-10-03T05:51:15.201Z | INFO | phd-runner: [INSTANCE_ENSURE_INTERNAL - EVENT] Started instance
file = phd-tests/framework/src/test_vm/mod.rs
instance_description.instance = Instance { properties: InstanceProperties { id: a3d43092-a581-4a39-95d8-ed717871ecf7, name: "phd-vm-a3d43092-a581-4a39-95d8-ed717871ecf7", description: "Pheidippides-managed VM", metadata: InstanceMetadata { silo_id: 84a8003e-7a05-4eee-a694-abccff82a247, project_id: c34a9713-ab12-40ce-acf8-c4f606a3889c, sled_id: e1b776eb-0b48-43f8-925e-7cc3a77afeb2, sled_serial: "e1b776eb-0b48-43f8-925e-7cc3a77afeb2", sled_revision: 1, sled_model: "pheidippes" } }, state: Migrating }
line = 514
path = phd_tests::migrate::from_base::migration_from_base_and_back
source = migration_from_base_and_back_lifecycle_0
source_id = 6e7455ec-0ac8-4901-939c-2b6a2a60d626
target = phd_framework::test_vm
target_id = a3d43092-a581-4a39-95d8-ed717871ecf7
vm = migration_from_base_and_back_lifecycle_1
vm_id = a3d43092-a581-4a39-95d8-ed717871ecf7
|
| 356 | 2026-10-03T05:51:15.201Z | INFO | phd-runner: [MIGRATE - START]
file = phd-tests/framework/src/test_vm/mod.rs
line = 663
migration_id = 81558b90-de79-4635-bf47-bcda4201ddd5
path = phd_tests::migrate::from_base::migration_from_base_and_back
source = migration_from_base_and_back_lifecycle_0
source_id = 6e7455ec-0ac8-4901-939c-2b6a2a60d626
target = phd_framework::test_vm
target_id = a3d43092-a581-4a39-95d8-ed717871ecf7
|
| 357 | 2026-10-03T05:51:17.706Z | INFO | phd-runner: [SERIAL CONSOLE TASK - EVENT] serial socket control message
file = phd-tests/framework/src/serial/mod.rs
line = 275
s = {"Migrating":{"destination":"127.0.0.1:9004","from_start":7894}}
target = phd_framework::serial
|
| 358 | 2026-10-03T05:51:19.333Z | INFO | phd-runner: [MIGRATE_FROM - EVENT] Migration completed successfully
file = phd-tests/framework/src/test_vm/mod.rs
line = 676
path = phd_tests::migrate::from_base::migration_from_base_and_back
source = migration_from_base_and_back_lifecycle_0
source_id = 6e7455ec-0ac8-4901-939c-2b6a2a60d626
target = phd_framework::test_vm
target_id = a3d43092-a581-4a39-95d8-ed717871ecf7
|
| 359 | 2026-10-03T05:51:19.333Z | INFO | phd-runner: [MIGRATE - END]
elapsed_milliseconds = 4131
file = phd-tests/framework/src/test_vm/mod.rs
line = 663
migration_id = 81558b90-de79-4635-bf47-bcda4201ddd5
path = phd_tests::migrate::from_base::migration_from_base_and_back
source = migration_from_base_and_back_lifecycle_0
source_id = 6e7455ec-0ac8-4901-939c-2b6a2a60d626
target = phd_framework::test_vm
target_id = a3d43092-a581-4a39-95d8-ed717871ecf7
|
| 360 | 2026-10-03T05:51:19.336Z | INFO | phd-runner: [VM CLEANUP - START]
file = phd-tests/framework/src/test_vm/mod.rs
line = 1172
path = phd_tests::migrate::from_base::migration_from_base_and_back
target = phd_framework::test_vm
vm = migration_from_base_and_back_lifecycle_0
vm_id = 6e7455ec-0ac8-4901-939c-2b6a2a60d626
|
| 361 | 2026-10-03T05:51:19.336Z | INFO | phd-runner: [WAIT_FOR_SERIAL_OUTPUT - START]
file = phd-tests/framework/src/test_vm/mod.rs
line = 913
path = phd_tests::migrate::from_base::migration_from_base_and_back
target = phd_framework::test_vm
vm = migration_from_base_and_back_lifecycle_1
vm_id = a3d43092-a581-4a39-95d8-ed717871ecf7
|
| 362 | 2026-10-03T05:51:19.336Z | INFO | phd-runner: [WAIT_FOR_SERIAL_OUTPUT - EVENT] Waiting for output on serial console
file = phd-tests/framework/src/test_vm/mod.rs
line = 920
path = phd_tests::migrate::from_base::migration_from_base_and_back
target = phd_framework::test_vm
timeout_duration = Explicit(15s)
vm = migration_from_base_and_back_lifecycle_1
vm_id = a3d43092-a581-4a39-95d8-ed717871ecf7
|
| 363 | 2026-10-03T05:51:19.338Z | DEBG | phd-runner: [VM CLEANUP - EVENT] Killing Propolis server process
file = phd-tests/framework/src/test_vm/server.rs
line = 177
path = phd_tests::migrate::from_base::migration_from_base_and_back
self.address = 127.0.0.1:9002
target = phd_framework::test_vm::server
vm = migration_from_base_and_back_lifecycle_0
vm_id = 6e7455ec-0ac8-4901-939c-2b6a2a60d626
|
| 364 | 2026-10-03T05:51:19.430Z | INFO | phd-runner: [VM CLEANUP - END]
elapsed_milliseconds = 94
file = phd-tests/framework/src/test_vm/mod.rs
line = 1172
path = phd_tests::migrate::from_base::migration_from_base_and_back
target = phd_framework::test_vm
vm = migration_from_base_and_back_lifecycle_0
vm_id = 6e7455ec-0ac8-4901-939c-2b6a2a60d626
|
| 365 | 2026-10-03T05:51:19.430Z | INFO | phd-runner: [INSTANCE_ENSURE_INTERNAL - END]
elapsed_milliseconds = 9490
file = phd-tests/framework/src/test_vm/mod.rs
line = 412
path = phd_tests::migrate::from_base::migration_from_base_and_back
source = migration_from_base_and_back
source_id = ae72af00-9ae9-4133-8d29-67647c4e30e2
target = phd_framework::test_vm
target_id = 6e7455ec-0ac8-4901-939c-2b6a2a60d626
vm = migration_from_base_and_back_lifecycle_0
vm_id = 6e7455ec-0ac8-4901-939c-2b6a2a60d626
|
| 366 | 2026-10-03T05:51:19.431Z | INFO | phd-runner: [MIGRATE_FROM - END]
elapsed_milliseconds = 9490
file = phd-tests/framework/src/test_vm/mod.rs
line = 609
path = phd_tests::migrate::from_base::migration_from_base_and_back
source = migration_from_base_and_back
source_id = ae72af00-9ae9-4133-8d29-67647c4e30e2
target = phd_framework::test_vm
target_id = 6e7455ec-0ac8-4901-939c-2b6a2a60d626
|
| 367 | 2026-10-03T05:51:19.431Z | INFO | phd-runner: [WAIT_FOR_SERIAL_OUTPUT - END]
elapsed_milliseconds = 94
file = phd-tests/framework/src/test_vm/mod.rs
line = 913
path = phd_tests::migrate::from_base::migration_from_base_and_back
target = phd_framework::test_vm
vm = migration_from_base_and_back_lifecycle_1
vm_id = a3d43092-a581-4a39-95d8-ed717871ecf7
|
| 368 | 2026-10-03T05:51:19.431Z | INFO | phd-runner: [WAIT_FOR_SERIAL_OUTPUT - START]
file = phd-tests/framework/src/test_vm/mod.rs
line = 913
path = phd_tests::migrate::from_base::migration_from_base_and_back
target = phd_framework::test_vm
vm = migration_from_base_and_back_lifecycle_1
vm_id = a3d43092-a581-4a39-95d8-ed717871ecf7
|
| 369 | 2026-10-03T05:51:19.431Z | INFO | phd-runner: [WAIT_FOR_SERIAL_OUTPUT - EVENT] Waiting for output on serial console
file = phd-tests/framework/src/test_vm/mod.rs
line = 920
path = phd_tests::migrate::from_base::migration_from_base_and_back
target = phd_framework::test_vm
timeout_duration = Explicit(300s)
vm = migration_from_base_and_back_lifecycle_1
vm_id = a3d43092-a581-4a39-95d8-ed717871ecf7
|
| 370 | 2026-10-03T05:51:19.464Z | INFO | phd-runner: [WAIT_FOR_SERIAL_OUTPUT - END]
elapsed_milliseconds = 33
file = phd-tests/framework/src/test_vm/mod.rs
line = 913
path = phd_tests::migrate::from_base::migration_from_base_and_back
target = phd_framework::test_vm
vm = migration_from_base_and_back_lifecycle_1
vm_id = a3d43092-a581-4a39-95d8-ed717871ecf7
|
| 371 | 2026-10-03T05:51:19.465Z | INFO | phd-runner: [TEST - EVENT] migrating to new Propolis artifact for lifecycle test
file = phd-tests/framework/src/lifecycle.rs
line = 73
path = phd_tests::migrate::from_base::migration_from_base_and_back
propolis_artifact = __DEFAULT_PROPOLIS
target = phd_framework::lifecycle
vm_name = migration_from_base_and_back
|
| 372 | 2026-10-03T05:51:19.465Z | INFO | phd-runner: [NEW - START]
file = phd-tests/framework/src/test_vm/mod.rs
line = 300
path = phd_tests::migrate::from_base::migration_from_base_and_back
target = phd_framework::test_vm
|
| 373 | 2026-10-03T05:51:19.465Z | INFO | phd-runner: [NEW - EVENT] phd_framework::test_vm
environment = EnvironmentSpec { location: Local, propolis_artifact: "__DEFAULT_PROPOLIS", metrics: None }
file = phd-tests/framework/src/test_vm/mod.rs
guest_os_kind = Alpine
line = 318
path = phd_tests::migrate::from_base::migration_from_base_and_back
target = phd_framework::test_vm
vm_name = migration_from_base_and_back_lifecycle_2
|
| 374 | 2026-10-03T05:51:19.465Z | DEBG | phd-runner: [NEW - EVENT] Verified artifact already exists
file = phd-tests/framework/src/artifacts/store.rs
line = 45
path = /work/phd-test/propolis-server
target = phd_framework::artifacts::store
|
| 375 | 2026-10-03T05:51:19.465Z | INFO | phd-runner: [NEW - EVENT] Launching Propolis server
bootrom_path = "/phd-artifacts/740187046a7267d0de72d3455070333547dbc0ea023531471fb2b2a61effa448/OVMF_CODE.fd"
file = phd-tests/framework/src/test_vm/server.rs
line = 66
path = phd_tests::migrate::from_base::migration_from_base_and_back
server_addr = 127.0.0.1:9006
server_path = "/work/phd-test/propolis-server"
target = phd_framework::test_vm::server
|
| 376 | 2026-10-03T05:51:19.465Z | INFO | phd-runner: [NEW - EVENT] Opening server log files
file = phd-tests/framework/src/log_config.rs
line = 84
path = phd_tests::migrate::from_base::migration_from_base_and_back
stderr_path = "/tmp/propolis-phd/phd_tests::migrate::from_base::migration_from_base_and_back/migration_from_base_and_back_lifecycle_2.stderr.log"
stdout_path = "/tmp/propolis-phd/phd_tests::migrate::from_base::migration_from_base_and_back/migration_from_base_and_back_lifecycle_2.stdout.log"
target = phd_framework::log_config
|
| 377 | 2026-10-03T05:51:19.509Z | INFO | phd-runner: [NEW - EVENT] Launched server with pid 942
file = phd-tests/framework/src/test_vm/server.rs
line = 127
path = phd_tests::migrate::from_base::migration_from_base_and_back
target = phd_framework::test_vm::server
|
| 378 | 2026-10-03T05:51:19.523Z | INFO | phd-runner: [NEW - END]
elapsed_milliseconds = 57
file = phd-tests/framework/src/test_vm/mod.rs
line = 300
path = phd_tests::migrate::from_base::migration_from_base_and_back
target = phd_framework::test_vm
|
| 379 | 2026-10-03T05:51:19.523Z | INFO | phd-runner: [MIGRATE_FROM - START]
file = phd-tests/framework/src/test_vm/mod.rs
line = 609
path = phd_tests::migrate::from_base::migration_from_base_and_back
source = migration_from_base_and_back_lifecycle_1
source_id = a3d43092-a581-4a39-95d8-ed717871ecf7
target = phd_framework::test_vm
target_id = 9f5b9355-9830-4dd4-9859-4cc5a8489547
|
| 380 | 2026-10-03T05:51:19.523Z | INFO | phd-runner: [MIGRATE_FROM - EVENT] Migrating from source at address 127.0.0.1:9004
file = phd-tests/framework/src/test_vm/mod.rs
line = 642
migration_id = ff47fe99-1c45-4284-ae2c-793516a1fd6b
path = phd_tests::migrate::from_base::migration_from_base_and_back
source = migration_from_base_and_back_lifecycle_1
source_id = a3d43092-a581-4a39-95d8-ed717871ecf7
target = phd_framework::test_vm
target_id = 9f5b9355-9830-4dd4-9859-4cc5a8489547
timeout_duration = 45s
|
| 381 | 2026-10-03T05:51:19.523Z | INFO | phd-runner: [INSTANCE_ENSURE_INTERNAL - START]
file = phd-tests/framework/src/test_vm/mod.rs
line = 412
path = phd_tests::migrate::from_base::migration_from_base_and_back
source = migration_from_base_and_back_lifecycle_1
source_id = a3d43092-a581-4a39-95d8-ed717871ecf7
target = phd_framework::test_vm
target_id = 9f5b9355-9830-4dd4-9859-4cc5a8489547
vm = migration_from_base_and_back_lifecycle_2
vm_id = 9f5b9355-9830-4dd4-9859-4cc5a8489547
|
| 382 | 2026-10-03T05:51:19.524Z | INFO | phd-runner: [INSTANCE_ENSURE_INTERNAL - EVENT] retriable error from instance_spec_ensure
e = Communication Error: error sending request for url (http://127.0.0.1:9006/instance)
file = phd-tests/framework/src/test_vm/mod.rs
line = 455
path = phd_tests::migrate::from_base::migration_from_base_and_back
source = migration_from_base_and_back_lifecycle_1
source_id = a3d43092-a581-4a39-95d8-ed717871ecf7
target = phd_framework::test_vm
target_id = 9f5b9355-9830-4dd4-9859-4cc5a8489547
vm = migration_from_base_and_back_lifecycle_2
vm_id = 9f5b9355-9830-4dd4-9859-4cc5a8489547
|
| 383 | 2026-10-03T05:51:20.113Z | INFO | phd-runner: [INSTANCE_ENSURE_INTERNAL - EVENT] Started instance
file = phd-tests/framework/src/test_vm/mod.rs
instance_description.instance = Instance { properties: InstanceProperties { id: 9f5b9355-9830-4dd4-9859-4cc5a8489547, name: "phd-vm-9f5b9355-9830-4dd4-9859-4cc5a8489547", description: "Pheidippides-managed VM", metadata: InstanceMetadata { silo_id: 84a8003e-7a05-4eee-a694-abccff82a247, project_id: c34a9713-ab12-40ce-acf8-c4f606a3889c, sled_id: dc5b92b1-a0ef-48ec-9a77-60660724811e, sled_serial: "dc5b92b1-a0ef-48ec-9a77-60660724811e", sled_revision: 1, sled_model: "pheidippes" } }, state: Migrating }
line = 514
path = phd_tests::migrate::from_base::migration_from_base_and_back
source = migration_from_base_and_back_lifecycle_1
source_id = a3d43092-a581-4a39-95d8-ed717871ecf7
target = phd_framework::test_vm
target_id = 9f5b9355-9830-4dd4-9859-4cc5a8489547
vm = migration_from_base_and_back_lifecycle_2
vm_id = 9f5b9355-9830-4dd4-9859-4cc5a8489547
|
| 384 | 2026-10-03T05:51:20.113Z | INFO | phd-runner: [MIGRATE - START]
file = phd-tests/framework/src/test_vm/mod.rs
line = 663
migration_id = ff47fe99-1c45-4284-ae2c-793516a1fd6b
path = phd_tests::migrate::from_base::migration_from_base_and_back
source = migration_from_base_and_back_lifecycle_1
source_id = a3d43092-a581-4a39-95d8-ed717871ecf7
target = phd_framework::test_vm
target_id = 9f5b9355-9830-4dd4-9859-4cc5a8489547
|
| 385 | 2026-10-03T05:51:22.592Z | INFO | phd-runner: [SERIAL CONSOLE TASK - EVENT] serial socket control message
file = phd-tests/framework/src/serial/mod.rs
line = 275
s = {"Migrating":{"destination":"127.0.0.1:9006","from_start":7941}}
target = phd_framework::serial
|
| 386 | 2026-10-03T05:51:23.975Z | INFO | phd-runner: [MIGRATE_FROM - EVENT] Migration completed successfully
file = phd-tests/framework/src/test_vm/mod.rs
line = 676
path = phd_tests::migrate::from_base::migration_from_base_and_back
source = migration_from_base_and_back_lifecycle_1
source_id = a3d43092-a581-4a39-95d8-ed717871ecf7
target = phd_framework::test_vm
target_id = 9f5b9355-9830-4dd4-9859-4cc5a8489547
|
| 387 | 2026-10-03T05:51:23.976Z | INFO | phd-runner: [MIGRATE - END]
elapsed_milliseconds = 3862
file = phd-tests/framework/src/test_vm/mod.rs
line = 663
migration_id = ff47fe99-1c45-4284-ae2c-793516a1fd6b
path = phd_tests::migrate::from_base::migration_from_base_and_back
source = migration_from_base_and_back_lifecycle_1
source_id = a3d43092-a581-4a39-95d8-ed717871ecf7
target = phd_framework::test_vm
target_id = 9f5b9355-9830-4dd4-9859-4cc5a8489547
|
| 388 | 2026-10-03T05:51:23.978Z | INFO | phd-runner: [VM CLEANUP - START]
file = phd-tests/framework/src/test_vm/mod.rs
line = 1172
path = phd_tests::migrate::from_base::migration_from_base_and_back
target = phd_framework::test_vm
vm = migration_from_base_and_back_lifecycle_1
vm_id = a3d43092-a581-4a39-95d8-ed717871ecf7
|
| 389 | 2026-10-03T05:51:23.978Z | INFO | phd-runner: [WAIT_FOR_SERIAL_OUTPUT - START]
file = phd-tests/framework/src/test_vm/mod.rs
line = 913
path = phd_tests::migrate::from_base::migration_from_base_and_back
target = phd_framework::test_vm
vm = migration_from_base_and_back_lifecycle_2
vm_id = 9f5b9355-9830-4dd4-9859-4cc5a8489547
|
| 390 | 2026-10-03T05:51:23.978Z | INFO | phd-runner: [WAIT_FOR_SERIAL_OUTPUT - EVENT] Waiting for output on serial console
file = phd-tests/framework/src/test_vm/mod.rs
line = 920
path = phd_tests::migrate::from_base::migration_from_base_and_back
target = phd_framework::test_vm
timeout_duration = Explicit(15s)
vm = migration_from_base_and_back_lifecycle_2
vm_id = 9f5b9355-9830-4dd4-9859-4cc5a8489547
|
| 391 | 2026-10-03T05:51:23.980Z | DEBG | phd-runner: [VM CLEANUP - EVENT] Killing Propolis server process
file = phd-tests/framework/src/test_vm/server.rs
line = 177
path = phd_tests::migrate::from_base::migration_from_base_and_back
self.address = 127.0.0.1:9004
target = phd_framework::test_vm::server
vm = migration_from_base_and_back_lifecycle_1
vm_id = a3d43092-a581-4a39-95d8-ed717871ecf7
|
| 392 | 2026-10-03T05:51:24.058Z | INFO | phd-runner: [VM CLEANUP - END]
elapsed_milliseconds = 79
file = phd-tests/framework/src/test_vm/mod.rs
line = 1172
path = phd_tests::migrate::from_base::migration_from_base_and_back
target = phd_framework::test_vm
vm = migration_from_base_and_back_lifecycle_1
vm_id = a3d43092-a581-4a39-95d8-ed717871ecf7
|
| 393 | 2026-10-03T05:51:24.058Z | INFO | phd-runner: [INSTANCE_ENSURE_INTERNAL - END]
elapsed_milliseconds = 9672
file = phd-tests/framework/src/test_vm/mod.rs
line = 412
path = phd_tests::migrate::from_base::migration_from_base_and_back
source = migration_from_base_and_back_lifecycle_0
source_id = 6e7455ec-0ac8-4901-939c-2b6a2a60d626
target = phd_framework::test_vm
target_id = a3d43092-a581-4a39-95d8-ed717871ecf7
vm = migration_from_base_and_back_lifecycle_1
vm_id = a3d43092-a581-4a39-95d8-ed717871ecf7
|
| 394 | 2026-10-03T05:51:24.058Z | INFO | phd-runner: [MIGRATE_FROM - END]
elapsed_milliseconds = 9673
file = phd-tests/framework/src/test_vm/mod.rs
line = 609
path = phd_tests::migrate::from_base::migration_from_base_and_back
source = migration_from_base_and_back_lifecycle_0
source_id = 6e7455ec-0ac8-4901-939c-2b6a2a60d626
target = phd_framework::test_vm
target_id = a3d43092-a581-4a39-95d8-ed717871ecf7
|
| 395 | 2026-10-03T05:51:24.058Z | INFO | phd-runner: [WAIT_FOR_SERIAL_OUTPUT - END]
elapsed_milliseconds = 79
file = phd-tests/framework/src/test_vm/mod.rs
line = 913
path = phd_tests::migrate::from_base::migration_from_base_and_back
target = phd_framework::test_vm
vm = migration_from_base_and_back_lifecycle_2
vm_id = 9f5b9355-9830-4dd4-9859-4cc5a8489547
|
| 396 | 2026-10-03T05:51:24.059Z | INFO | phd-runner: [WAIT_FOR_SERIAL_OUTPUT - START]
file = phd-tests/framework/src/test_vm/mod.rs
line = 913
path = phd_tests::migrate::from_base::migration_from_base_and_back
target = phd_framework::test_vm
vm = migration_from_base_and_back_lifecycle_2
vm_id = 9f5b9355-9830-4dd4-9859-4cc5a8489547
|
| 397 | 2026-10-03T05:51:24.059Z | INFO | phd-runner: [WAIT_FOR_SERIAL_OUTPUT - EVENT] Waiting for output on serial console
file = phd-tests/framework/src/test_vm/mod.rs
line = 920
path = phd_tests::migrate::from_base::migration_from_base_and_back
target = phd_framework::test_vm
timeout_duration = Explicit(300s)
vm = migration_from_base_and_back_lifecycle_2
vm_id = 9f5b9355-9830-4dd4-9859-4cc5a8489547
|
| 398 | 2026-10-03T05:51:24.091Z | INFO | phd-runner: [WAIT_FOR_SERIAL_OUTPUT - END]
elapsed_milliseconds = 31
file = phd-tests/framework/src/test_vm/mod.rs
line = 913
path = phd_tests::migrate::from_base::migration_from_base_and_back
target = phd_framework::test_vm
vm = migration_from_base_and_back_lifecycle_2
vm_id = 9f5b9355-9830-4dd4-9859-4cc5a8489547
|
| 399 | 2026-10-03T05:51:24.091Z | INFO | phd-runner: [VM CLEANUP - START]
file = phd-tests/framework/src/test_vm/mod.rs
line = 1172
path = phd_tests::migrate::from_base::migration_from_base_and_back
target = phd_framework::test_vm
vm = migration_from_base_and_back_lifecycle_2
vm_id = 9f5b9355-9830-4dd4-9859-4cc5a8489547
|
| 400 | 2026-10-03T05:51:24.091Z | DEBG | phd-runner: [SERIAL CONSOLE TASK - EVENT] serial console command channel was closed
file = phd-tests/framework/src/serial/mod.rs
line = 213
target = phd_framework::serial
|
| 401 | 2026-10-03T05:51:24.091Z | INFO | phd-runner: [SERIAL CONSOLE TASK - END]
elapsed_milliseconds = 19183
file = phd-tests/framework/src/serial/mod.rs
line = 200
target = phd_framework::serial
|
| 402 | 2026-10-03T05:51:24.092Z | INFO | phd-runner: test phd_tests::migrate::from_base::migration_from_base_and_back ... ok
file = phd-tests/runner/src/execute.rs
line = 141
target = phd_runner::execute
|
| 403 | 2026-10-03T05:51:24.092Z | INFO | phd-runner: [TEST_CLEANUP - START]
file = phd-tests/runner/src/fixtures.rs
line = 51
target = phd_runner::fixtures
|
| 404 | 2026-10-03T05:51:24.093Z | DEBG | phd-runner: [VM CLEANUP - EVENT] trying to ensure Propolis server VM is destroyed
file = phd-tests/framework/src/test_vm/mod.rs
line = 1195
path = phd_tests::migrate::from_base::migration_from_base_and_back
target = phd_framework::test_vm
vm = migration_from_base_and_back_lifecycle_2
vm_id = 9f5b9355-9830-4dd4-9859-4cc5a8489547
|
| 405 | 2026-10-03T05:51:24.817Z | DEBG | phd-runner: [VM CLEANUP - EVENT] Killing Propolis server process
file = phd-tests/framework/src/test_vm/server.rs
line = 177
path = phd_tests::migrate::from_base::migration_from_base_and_back
self.address = 127.0.0.1:9006
target = phd_framework::test_vm::server
vm = migration_from_base_and_back_lifecycle_2
vm_id = 9f5b9355-9830-4dd4-9859-4cc5a8489547
|
| 406 | 2026-10-03T05:51:24.906Z | DEBG | phd-runner: [VM CLEANUP - EVENT] zfs clone dropped
file = phd-tests/framework/src/zfs.rs
line = 83
path = phd_tests::migrate::from_base::migration_from_base_and_back
target = phd_framework::zfs
vm = migration_from_base_and_back_lifecycle_2
vm_id = 9f5b9355-9830-4dd4-9859-4cc5a8489547
|
| 407 | 2026-10-03T05:51:24.907Z | DEBG | phd-runner: [VM CLEANUP - EVENT] executing ZFS command
args = ["phd-artifacts/phd-clone-d90cb244-6868-4ef3-97e6-f1b00375ed5d"]
file = phd-tests/framework/src/zfs.rs
line = 304
path = phd_tests::migrate::from_base::migration_from_base_and_back
target = phd_framework::zfs
verb = destroy
vm = migration_from_base_and_back_lifecycle_2
vm_id = 9f5b9355-9830-4dd4-9859-4cc5a8489547
|
| 408 | 2026-10-03T05:51:24.933Z | DEBG | phd-runner: [VM CLEANUP - EVENT] zfs snapshot dropped
file = phd-tests/framework/src/zfs.rs
line = 57
path = phd_tests::migrate::from_base::migration_from_base_and_back
target = phd_framework::zfs
vm = migration_from_base_and_back_lifecycle_2
vm_id = 9f5b9355-9830-4dd4-9859-4cc5a8489547
|
| 409 | 2026-10-03T05:51:24.933Z | DEBG | phd-runner: [VM CLEANUP - EVENT] executing ZFS command
args = ["phd-artifacts@phd-71d0da23-9127-43e4-87fd-7348593e8060"]
file = phd-tests/framework/src/zfs.rs
line = 304
path = phd_tests::migrate::from_base::migration_from_base_and_back
target = phd_framework::zfs
verb = destroy
vm = migration_from_base_and_back_lifecycle_2
vm_id = 9f5b9355-9830-4dd4-9859-4cc5a8489547
|
| 410 | 2026-10-03T05:51:24.950Z | INFO | phd-runner: [VM CLEANUP - END]
elapsed_milliseconds = 858
file = phd-tests/framework/src/test_vm/mod.rs
line = 1172
path = phd_tests::migrate::from_base::migration_from_base_and_back
target = phd_framework::test_vm
vm = migration_from_base_and_back_lifecycle_2
vm_id = 9f5b9355-9830-4dd4-9859-4cc5a8489547
|
| 411 | 2026-10-03T05:51:24.950Z | INFO | phd-runner: [INSTANCE_ENSURE_INTERNAL - END]
elapsed_milliseconds = 5427
file = phd-tests/framework/src/test_vm/mod.rs
line = 412
path = phd_tests::migrate::from_base::migration_from_base_and_back
source = migration_from_base_and_back_lifecycle_1
source_id = a3d43092-a581-4a39-95d8-ed717871ecf7
target = phd_framework::test_vm
target_id = 9f5b9355-9830-4dd4-9859-4cc5a8489547
vm = migration_from_base_and_back_lifecycle_2
vm_id = 9f5b9355-9830-4dd4-9859-4cc5a8489547
|
| 412 | 2026-10-03T05:51:24.950Z | INFO | phd-runner: [TEST_CLEANUP - END]
elapsed_milliseconds = 858
file = phd-tests/runner/src/fixtures.rs
line = 51
target = phd_runner::fixtures
|
| 413 | 2026-10-03T05:51:24.950Z | INFO | phd-runner: [MIGRATE_FROM - END]
elapsed_milliseconds = 5427
file = phd-tests/framework/src/test_vm/mod.rs
line = 609
path = phd_tests::migrate::from_base::migration_from_base_and_back
source = migration_from_base_and_back_lifecycle_1
source_id = a3d43092-a581-4a39-95d8-ed717871ecf7
target = phd_framework::test_vm
target_id = 9f5b9355-9830-4dd4-9859-4cc5a8489547
|
| 414 | 2026-10-03T05:51:24.950Z | INFO | phd-runner: [TEST - END]
elapsed_milliseconds = 20899
file = phd-tests/tests/src/migrate.rs
line = 52
path = phd_tests::migrate::from_base::migration_from_base_and_back
target = phd_tests::migrate::from_base
|
| 415 | 2026-10-03T05:51:24.950Z | INFO | phd-runner: [EXECUTION_CLEANUP - START]
file = phd-tests/runner/src/fixtures.rs
line = 35
target = phd_runner::fixtures
|
| 416 | 2026-10-03T05:51:24.951Z | INFO | phd-runner: [EXECUTION_CLEANUP - END]
elapsed_milliseconds = 0
file = phd-tests/runner/src/fixtures.rs
line = 35
target = phd_runner::fixtures
|
| 417 | | test result: ok. 3 passed; 0 failed; 0 skipped; 0 not run; finished in 90.99s |
| 418 | | |
| 419 | 2026-10-03T05:51:24.953Z | DEBG | phd-runner: phd_runner
exit_code = 0
file = phd-tests/runner/src/main.rs
line = 41
target = phd_runner
|