| 1 | 2026-10-06T00:09:40.239Z | INFO | phd-runner: phd_runner
file = phd-tests/runner/src/main.rs
line = 36
runner_args = ProcessArgs { command: Run(RunOptions { propolis_server_cmd: "/work/phd-test/propolis-server", base_propolis_branch: Some("master"), base_propolis_commit: None, base_propolis_cmd: None, crucible_downstairs_cmd: None, crucible_downstairs_commit: Some(Auto), tmp_directory: "/tmp/propolis-phd", artifact_directory: Some("/phd-artifacts"), output_mode: TmpFile, default_guest_cpus: 2, default_guest_memory_mib: 512, artifact_toml_path: "/work/phd-test/artifacts.toml", default_guest_artifact: "alpine", default_bootrom_artifact: "ovmf", include_filter: ["phd_tests::migrate::from_base"], exclude_filter: [], max_buildomat_wait_secs: 1200, manual_stop_on_failure: false }), disable_ansi: false, emit_bunyan: true }
target = phd_runner
|
| 2 | 2026-10-06T00:09:40.266Z | DEBG | phd-runner: Created new artifact store from manifest
file = phd-tests/framework/src/artifacts/store.rs
line = 219
store = Store { local_dir: "/phd-artifacts", artifacts: {"alpine": Mutex { data: StoredArtifact { description: Artifact { filename: "alpine.iso", kind: GuestOs(Alpine), source: RemoteServer { sha256: "ba8007f74f9b54fbae3b2520da577831b4834778a498d732f091260c61aa7ca1" }, untar: None }, cached_path: None } }, "ovmf": Mutex { data: StoredArtifact { description: Artifact { filename: "OVMF_CODE.fd", kind: Bootrom, source: Buildomat(BuildomatArtifact { repo: Repo("oxidecomputer/edk2"), series: Series("image_debug"), commit: Commit("bf64f45b1a58e69d126a3c6ca1e4512c88668132"), sha256: "740187046a7267d0de72d3455070333547dbc0ea023531471fb2b2a61effa448" }), untar: None }, cached_path: None } }}, downloader: DownloadConfig { timeout: 600s, buildomat_backoff: ExponentialBackoff { current_interval: 1s, initial_interval: 1s, randomization_factor: 0.5, multiplier: 1.5, max_interval: 60s, start_time: Instant { tv_sec: 254, tv_nsec: 191081088 }, max_elapsed_time: Some(1200s), clock: SystemClock }, remote_server_uris: ["https://oxide-omicron-build.s3.amazonaws.com"] } }
target = phd_framework::artifacts::store
|
| 3 | 2026-10-06T00:09:40.267Z | INFO | phd-runner: Adding Propolis server from local command
file = phd-tests/framework/src/artifacts/store.rs
line = 227
propolis_server_cmd = /work/phd-test/propolis-server
target = phd_framework::artifacts::store
|
| 4 | 2026-10-06T00:09:40.269Z | INFO | phd-runner: Adding crucible-downstairs from Buildomat Git revision
commit = ad8a31742adc45e925e63443a5b43c8e30604022
file = phd-tests/framework/src/artifacts/store.rs
line = 311
target = phd_framework::artifacts::store
|
| 5 | 2026-10-06T00:09:40.274Z | DEBG | phd-runner: Downloading file from Buildomat...
file = phd-tests/framework/src/artifacts/buildomat.rs
line = 215
target = phd_framework::artifacts::buildomat
timeout = 600s
uri = https://buildomat.eng.oxide.computer/public/file/oxidecomputer/crucible/nightly-image/ad8a31742adc45e925e63443a5b43c8e30604022/crucible-nightly.sha256.txt
|
| 6 | 2026-10-06T00:09:40.526Z | INFO | phd-runner: Adding 'current' Propolis server from Buildomat Git branch 'master'
file = phd-tests/framework/src/artifacts/store.rs
line = 248
target = phd_framework::artifacts::store
|
| 7 | 2026-10-06T00:09:41.160Z | DEBG | phd-runner: Downloading file from Buildomat...
file = phd-tests/framework/src/artifacts/buildomat.rs
line = 215
target = phd_framework::artifacts::buildomat
timeout = 600s
uri = https://buildomat.eng.oxide.computer/public/file/oxidecomputer/propolis/phd_build/77848924fedc3e1439efb055f5459714c2bb322c/propolis-server.sha256.txt
|
| 8 | 2026-10-06T00:09:41.341Z | INFO | phd-runner: [EXECUTION_SETUP - START]
file = phd-tests/runner/src/fixtures.rs
line = 25
target = phd_runner::fixtures
|
| 9 | 2026-10-06T00:09:41.342Z | INFO | phd-runner: [EXECUTION_SETUP - END]
elapsed_milliseconds = 0
file = phd-tests/runner/src/fixtures.rs
line = 25
target = phd_runner::fixtures
|
| 10 | 2026-10-06T00:09:41.344Z | INFO | phd-runner: Running 3 test(s)
file = phd-tests/runner/src/execute.rs
line = 83
target = phd_runner::execute
|
| 11 | 2026-10-06T00:09:41.344Z | INFO | phd-runner: Starting test phd_tests::migrate::from_base::serial_history
file = phd-tests/runner/src/execute.rs
line = 91
target = phd_runner::execute
|
| 12 | 2026-10-06T00:09:41.344Z | INFO | phd-runner: [TEST_SETUP - START]
file = phd-tests/runner/src/fixtures.rs
line = 41
target = phd_runner::fixtures
|
| 13 | 2026-10-06T00:09:41.344Z | INFO | phd-runner: [TEST_SETUP - END]
elapsed_milliseconds = 0
file = phd-tests/runner/src/fixtures.rs
line = 41
target = phd_runner::fixtures
|
| 14 | 2026-10-06T00:09:41.345Z | INFO | phd-runner: [TEST - START]
file = phd-tests/tests/src/migrate.rs
line = 40
path = phd_tests::migrate::from_base::serial_history
target = phd_tests::migrate::from_base
|
| 15 | 2026-10-06T00:09:41.347Z | DEBG | phd-runner: [TEST - EVENT] checking for existing copy of artifact
file = phd-tests/framework/src/artifacts/store.rs
line = 89
maybe_path = /phd-artifacts/740187046a7267d0de72d3455070333547dbc0ea023531471fb2b2a61effa448/OVMF_CODE.fd
path = phd_tests::migrate::from_base::serial_history
target = phd_framework::artifacts::store
|
| 16 | 2026-10-06T00:09:41.349Z | DEBG | phd-runner: [TEST - EVENT] Downloading file from Buildomat...
file = phd-tests/framework/src/artifacts/buildomat.rs
line = 215
path = phd_tests::migrate::from_base::serial_history
target = phd_framework::artifacts::buildomat
timeout = 600s
uri = https://buildomat.eng.oxide.computer/public/file/oxidecomputer/edk2/image_debug/bf64f45b1a58e69d126a3c6ca1e4512c88668132/OVMF_CODE.fd
|
| 17 | 2026-10-06T00:09:41.893Z | DEBG | phd-runner: [TEST - EVENT] checking for existing copy of artifact
file = phd-tests/framework/src/artifacts/store.rs
line = 89
maybe_path = /phd-artifacts/ba8007f74f9b54fbae3b2520da577831b4834778a498d732f091260c61aa7ca1/alpine.iso
path = phd_tests::migrate::from_base::serial_history
target = phd_framework::artifacts::store
|
| 18 | 2026-10-06T00:09:41.906Z | DEBG | phd-runner: [TEST - EVENT] Downloading alpine.iso from https://oxide-omicron-build.s3.amazonaws.com/alpine.iso
file = phd-tests/framework/src/artifacts/store.rs
line = 614
path = phd_tests::migrate::from_base::serial_history
target = phd_framework::artifacts::store
timeout = 600s
|
| 19 | 2026-10-06T00:09:48.475Z | DEBG | phd-runner: [TEST - EVENT] Verified artifact already exists
file = phd-tests/framework/src/artifacts/store.rs
line = 45
path = /phd-artifacts/ba8007f74f9b54fbae3b2520da577831b4834778a498d732f091260c61aa7ca1/alpine.iso
target = phd_framework::artifacts::store
|
| 20 | 2026-10-06T00:09:48.475Z | DEBG | phd-runner: [TEST - EVENT] executing ZFS command
args = ["/phd-artifacts/ba8007f74f9b54fbae3b2520da577831b4834778a498d732f091260c61aa7ca1/alpine.iso"]
file = phd-tests/framework/src/zfs.rs
line = 304
path = phd_tests::migrate::from_base::serial_history
target = phd_framework::zfs
verb = list
|
| 21 | 2026-10-06T00:09:48.492Z | DEBG | phd-runner: [TEST - EVENT] parsing zfs list output
file = phd-tests/framework/src/zfs.rs
line = 238
path = phd_tests::migrate::from_base::serial_history
stdout = NAME USED AVAIL REFER MOUNTPOINT\nphd-artifacts 4.60M 25.3T 2M /phd-artifacts\n
target = phd_framework::zfs
|
| 22 | 2026-10-06T00:09:48.494Z | DEBG | phd-runner: [TEST - EVENT] executing ZFS command
args = ["phd-artifacts@phd-797a8b76-faaa-46df-a842-19599555f9bd"]
file = phd-tests/framework/src/zfs.rs
line = 304
path = phd_tests::migrate::from_base::serial_history
target = phd_framework::zfs
verb = snapshot
|
| 23 | 2026-10-06T00:09:48.515Z | DEBG | phd-runner: [TEST - EVENT] executing ZFS command
args = ["phd-artifacts@phd-797a8b76-faaa-46df-a842-19599555f9bd", "phd-artifacts/phd-clone-90151d78-e482-4371-86a3-d369022b3410"]
file = phd-tests/framework/src/zfs.rs
line = 304
path = phd_tests::migrate::from_base::serial_history
target = phd_framework::zfs
verb = clone
|
| 24 | 2026-10-06T00:09:48.532Z | DEBG | phd-runner: [TEST - EVENT] executing ZFS command
args = ["phd-artifacts/phd-clone-90151d78-e482-4371-86a3-d369022b3410"]
file = phd-tests/framework/src/zfs.rs
line = 304
path = phd_tests::migrate::from_base::serial_history
target = phd_framework::zfs
verb = list
|
| 25 | 2026-10-06T00:09:48.543Z | DEBG | phd-runner: [TEST - EVENT] parsing zfs list output
file = phd-tests/framework/src/zfs.rs
line = 238
path = phd_tests::migrate::from_base::serial_history
stdout = NAME USED AVAIL REFER MOUNTPOINT\nphd-artifacts/phd-clone-90151d78-e482-4371-86a3-d369022b3410 0B 25.3T 49.0M /phd-artifacts/phd-clone-90151d78-e482-4371-86a3-d369022b3410\n
target = phd_framework::zfs
|
| 26 | 2026-10-06T00:09:48.547Z | INFO | phd-runner: [NEW - START]
file = phd-tests/framework/src/test_vm/mod.rs
line = 300
path = phd_tests::migrate::from_base::serial_history
target = phd_framework::test_vm
|
| 27 | 2026-10-06T00:09:48.548Z | INFO | phd-runner: [NEW - EVENT] phd_framework::test_vm
environment = EnvironmentSpec { location: Local, propolis_artifact: "__BASE_PROPOLIS", metrics: None }
file = phd-tests/framework/src/test_vm/mod.rs
guest_os_kind = Alpine
line = 318
path = phd_tests::migrate::from_base::serial_history
target = phd_framework::test_vm
vm_name = migration_serial_history_base
|
| 28 | 2026-10-06T00:09:48.548Z | DEBG | phd-runner: [NEW - EVENT] checking for existing copy of artifact
file = phd-tests/framework/src/artifacts/store.rs
line = 89
maybe_path = /phd-artifacts/4bf8fc6099e34afbdcfdef6b4e86494863090e3d681d8eb37a4e182353d1c2dd/propolis-server.tar.gz
path = phd_tests::migrate::from_base::serial_history
target = phd_framework::artifacts::store
|
| 29 | 2026-10-06T00:09:48.548Z | DEBG | phd-runner: [NEW - EVENT] Downloading file from Buildomat...
file = phd-tests/framework/src/artifacts/buildomat.rs
line = 215
path = phd_tests::migrate::from_base::serial_history
target = phd_framework::artifacts::buildomat
timeout = 600s
uri = https://buildomat.eng.oxide.computer/public/file/oxidecomputer/propolis/phd_build/77848924fedc3e1439efb055f5459714c2bb322c/propolis-server.tar.gz
|
| 30 | 2026-10-06T00:10:05.672Z | DEBG | phd-runner: [NEW - EVENT] Extracting artifact from tarball
extracted_path = /phd-artifacts/4bf8fc6099e34afbdcfdef6b4e86494863090e3d681d8eb37a4e182353d1c2dd/propolis-server
file = phd-tests/framework/src/artifacts/store.rs
line = 160
path = phd_tests::migrate::from_base::serial_history
target = phd_framework::artifacts::store
untar_path = propolis-server
|
| 31 | 2026-10-06T00:10:05.672Z | DEBG | phd-runner: [NEW - EVENT] Extracting gzipped tarball...
file = phd-tests/framework/src/artifacts/store.rs
line = 514
path = phd_tests::migrate::from_base::serial_history
target = phd_framework::artifacts::store
|
| 32 | 2026-10-06T00:10:30.769Z | INFO | phd-runner: [NEW - EVENT] Launching Propolis server
bootrom_path = "/phd-artifacts/740187046a7267d0de72d3455070333547dbc0ea023531471fb2b2a61effa448/OVMF_CODE.fd"
file = phd-tests/framework/src/test_vm/server.rs
line = 66
path = phd_tests::migrate::from_base::serial_history
server_addr = 127.0.0.1:9000
server_path = "/phd-artifacts/4bf8fc6099e34afbdcfdef6b4e86494863090e3d681d8eb37a4e182353d1c2dd/propolis-server"
target = phd_framework::test_vm::server
|
| 33 | 2026-10-06T00:10:30.769Z | INFO | phd-runner: [NEW - EVENT] Opening server log files
file = phd-tests/framework/src/log_config.rs
line = 84
path = phd_tests::migrate::from_base::serial_history
stderr_path = "/tmp/propolis-phd/phd_tests::migrate::from_base::serial_history/migration_serial_history_base.stderr.log"
stdout_path = "/tmp/propolis-phd/phd_tests::migrate::from_base::serial_history/migration_serial_history_base.stdout.log"
target = phd_framework::log_config
|
| 34 | 2026-10-06T00:10:30.952Z | INFO | phd-runner: [NEW - EVENT] Launched server with pid 917
file = phd-tests/framework/src/test_vm/server.rs
line = 127
path = phd_tests::migrate::from_base::serial_history
target = phd_framework::test_vm::server
|
| 35 | 2026-10-06T00:10:30.966Z | INFO | phd-runner: [INSTANCE_ENSURE_INTERNAL - START]
file = phd-tests/framework/src/test_vm/mod.rs
line = 412
path = phd_tests::migrate::from_base::serial_history
target = phd_framework::test_vm
vm = migration_serial_history_base
vm_id = e2207d1a-2dfa-4148-b261-58384c109771
|
| 36 | 2026-10-06T00:10:30.977Z | INFO | phd-runner: [INSTANCE_ENSURE_INTERNAL - EVENT] retriable error from instance_spec_ensure
e = Communication Error: error sending request for url (http://127.0.0.1:9000/instance)
file = phd-tests/framework/src/test_vm/mod.rs
line = 455
path = phd_tests::migrate::from_base::serial_history
target = phd_framework::test_vm
vm = migration_serial_history_base
vm_id = e2207d1a-2dfa-4148-b261-58384c109771
|
| 37 | 2026-10-06T00:10:30.981Z | INFO | phd-runner: [NEW - END]
elapsed_milliseconds = 42434
file = phd-tests/framework/src/test_vm/mod.rs
line = 300
path = phd_tests::migrate::from_base::serial_history
target = phd_framework::test_vm
|
| 38 | 2026-10-06T00:10:31.491Z | INFO | phd-runner: [SERIAL CONSOLE TASK - START]
file = phd-tests/framework/src/serial/mod.rs
line = 200
target = phd_framework::serial
|
| 39 | 2026-10-06T00:10:31.495Z | INFO | phd-runner: [INSTANCE_ENSURE_INTERNAL - EVENT] Started instance
file = phd-tests/framework/src/test_vm/mod.rs
instance_description.instance = Instance { properties: InstanceProperties { id: e2207d1a-2dfa-4148-b261-58384c109771, name: "phd-vm-e2207d1a-2dfa-4148-b261-58384c109771", description: "Pheidippides-managed VM", metadata: InstanceMetadata { silo_id: 95d1a759-062d-4774-bf36-301d49b34a81, project_id: d25b4899-63cd-4611-9a3d-06912dbe1abe, sled_id: 4f03a5f3-fe69-4034-9d53-ff83eab2bf6e, sled_serial: "4f03a5f3-fe69-4034-9d53-ff83eab2bf6e", sled_revision: 1, sled_model: "pheidippes" } }, state: Creating }
line = 514
path = phd_tests::migrate::from_base::serial_history
target = phd_framework::test_vm
vm = migration_serial_history_base
vm_id = e2207d1a-2dfa-4148-b261-58384c109771
|
| 40 | 2026-10-06T00:10:31.496Z | INFO | phd-runner: [PUT_INSTANCE_STATE - START]
file = phd-tests/framework/src/test_vm/mod.rs
line = 575
path = phd_tests::migrate::from_base::serial_history
target = phd_framework::test_vm
vm = migration_serial_history_base
vm_id = e2207d1a-2dfa-4148-b261-58384c109771
|
| 41 | 2026-10-06T00:10:31.496Z | INFO | phd-runner: [PUT_INSTANCE_STATE - EVENT] Requesting instance state change
file = phd-tests/framework/src/test_vm/mod.rs
line = 580
path = phd_tests::migrate::from_base::serial_history
state = Run
target = phd_framework::test_vm
vm = migration_serial_history_base
vm_id = e2207d1a-2dfa-4148-b261-58384c109771
|
| 42 | 2026-10-06T00:10:31.498Z | INFO | phd-runner: [PUT_INSTANCE_STATE - END]
elapsed_milliseconds = 2
file = phd-tests/framework/src/test_vm/mod.rs
line = 575
path = phd_tests::migrate::from_base::serial_history
target = phd_framework::test_vm
vm = migration_serial_history_base
vm_id = e2207d1a-2dfa-4148-b261-58384c109771
|
| 43 | 2026-10-06T00:10:31.499Z | INFO | phd-runner: [WAIT_TO_BOOT - START]
file = phd-tests/framework/src/test_vm/mod.rs
line = 890
path = phd_tests::migrate::from_base::serial_history
target = phd_framework::test_vm
|
| 44 | 2026-10-06T00:10:31.499Z | INFO | phd-runner: [WAIT_TO_BOOT - EVENT] waiting for guest to boot
file = phd-tests/framework/src/test_vm/mod.rs
line = 839
path = phd_tests::migrate::from_base::serial_history
target = phd_framework::test_vm
timeout_duration = 300s
vm = migration_serial_history_base
vm_id = e2207d1a-2dfa-4148-b261-58384c109771
|
| 45 | 2026-10-06T00:10:31.499Z | DEBG | phd-runner: [WAIT_TO_BOOT - EVENT] executing command in boot sequence
file = phd-tests/framework/src/test_vm/mod.rs
line = 847
path = phd_tests::migrate::from_base::serial_history
step = WaitFor("localhost login: ")
target = phd_framework::test_vm
|
| 46 | 2026-10-06T00:10:31.499Z | INFO | phd-runner: [WAIT_FOR_SERIAL_OUTPUT - START]
file = phd-tests/framework/src/test_vm/mod.rs
line = 913
path = phd_tests::migrate::from_base::serial_history
target = phd_framework::test_vm
vm = migration_serial_history_base
vm_id = e2207d1a-2dfa-4148-b261-58384c109771
|
| 47 | 2026-10-06T00:10:31.499Z | INFO | phd-runner: [WAIT_FOR_SERIAL_OUTPUT - EVENT] Waiting for output on serial console
file = phd-tests/framework/src/test_vm/mod.rs
line = 920
path = phd_tests::migrate::from_base::serial_history
target = phd_framework::test_vm
timeout_duration = CallerTimeout
vm = migration_serial_history_base
vm_id = e2207d1a-2dfa-4148-b261-58384c109771
|
| 48 | 2026-10-06T00:10:36.042Z | INFO | phd-runner: [WAIT_FOR_SERIAL_OUTPUT - END]
elapsed_milliseconds = 4543
file = phd-tests/framework/src/test_vm/mod.rs
line = 913
path = phd_tests::migrate::from_base::serial_history
target = phd_framework::test_vm
vm = migration_serial_history_base
vm_id = e2207d1a-2dfa-4148-b261-58384c109771
|
| 49 | 2026-10-06T00:10:36.043Z | DEBG | phd-runner: [WAIT_TO_BOOT - EVENT] executing command in boot sequence
file = phd-tests/framework/src/test_vm/mod.rs
line = 847
path = phd_tests::migrate::from_base::serial_history
step = WriteStr("root")
target = phd_framework::test_vm
|
| 50 | 2026-10-06T00:10:36.046Z | DEBG | phd-runner: [WAIT_TO_BOOT - EVENT] executing command in boot sequence
file = phd-tests/framework/src/test_vm/mod.rs
line = 847
path = phd_tests::migrate::from_base::serial_history
step = WaitFor("localhost:~#")
target = phd_framework::test_vm
|
| 51 | 2026-10-06T00:10:36.046Z | INFO | phd-runner: [WAIT_FOR_SERIAL_OUTPUT - START]
file = phd-tests/framework/src/test_vm/mod.rs
line = 913
path = phd_tests::migrate::from_base::serial_history
target = phd_framework::test_vm
vm = migration_serial_history_base
vm_id = e2207d1a-2dfa-4148-b261-58384c109771
|
| 52 | 2026-10-06T00:10:36.047Z | INFO | phd-runner: [WAIT_FOR_SERIAL_OUTPUT - EVENT] Waiting for output on serial console
file = phd-tests/framework/src/test_vm/mod.rs
line = 920
path = phd_tests::migrate::from_base::serial_history
target = phd_framework::test_vm
timeout_duration = CallerTimeout
vm = migration_serial_history_base
vm_id = e2207d1a-2dfa-4148-b261-58384c109771
|
| 53 | 2026-10-06T00:10:36.071Z | INFO | phd-runner: [WAIT_FOR_SERIAL_OUTPUT - END]
elapsed_milliseconds = 24
file = phd-tests/framework/src/test_vm/mod.rs
line = 913
path = phd_tests::migrate::from_base::serial_history
target = phd_framework::test_vm
vm = migration_serial_history_base
vm_id = e2207d1a-2dfa-4148-b261-58384c109771
|
| 54 | 2026-10-06T00:10:36.071Z | DEBG | phd-runner: [WAIT_TO_BOOT - EVENT] executing command in boot sequence
file = phd-tests/framework/src/test_vm/mod.rs
line = 847
path = phd_tests::migrate::from_base::serial_history
step = WriteStr("stty -F `tty` cols 9999")
target = phd_framework::test_vm
|
| 55 | 2026-10-06T00:10:36.072Z | DEBG | phd-runner: [WAIT_TO_BOOT - EVENT] executing command in boot sequence
file = phd-tests/framework/src/test_vm/mod.rs
line = 847
path = phd_tests::migrate::from_base::serial_history
step = WaitFor("localhost:~#")
target = phd_framework::test_vm
|
| 56 | 2026-10-06T00:10:36.072Z | INFO | phd-runner: [WAIT_FOR_SERIAL_OUTPUT - START]
file = phd-tests/framework/src/test_vm/mod.rs
line = 913
path = phd_tests::migrate::from_base::serial_history
target = phd_framework::test_vm
vm = migration_serial_history_base
vm_id = e2207d1a-2dfa-4148-b261-58384c109771
|
| 57 | 2026-10-06T00:10:36.072Z | INFO | phd-runner: [WAIT_FOR_SERIAL_OUTPUT - EVENT] Waiting for output on serial console
file = phd-tests/framework/src/test_vm/mod.rs
line = 920
path = phd_tests::migrate::from_base::serial_history
target = phd_framework::test_vm
timeout_duration = CallerTimeout
vm = migration_serial_history_base
vm_id = e2207d1a-2dfa-4148-b261-58384c109771
|
| 58 | 2026-10-06T00:10:36.104Z | INFO | phd-runner: [WAIT_FOR_SERIAL_OUTPUT - END]
elapsed_milliseconds = 32
file = phd-tests/framework/src/test_vm/mod.rs
line = 913
path = phd_tests::migrate::from_base::serial_history
target = phd_framework::test_vm
vm = migration_serial_history_base
vm_id = e2207d1a-2dfa-4148-b261-58384c109771
|
| 59 | 2026-10-06T00:10:36.105Z | INFO | phd-runner: [WAIT_TO_BOOT - EVENT] Guest has booted
file = phd-tests/framework/src/test_vm/mod.rs
line = 887
path = phd_tests::migrate::from_base::serial_history
target = phd_framework::test_vm
|
| 60 | 2026-10-06T00:10:36.105Z | INFO | phd-runner: [WAIT_TO_BOOT - END]
elapsed_milliseconds = 4605
file = phd-tests/framework/src/test_vm/mod.rs
line = 890
path = phd_tests::migrate::from_base::serial_history
target = phd_framework::test_vm
|
| 61 | 2026-10-06T00:10:36.105Z | INFO | phd-runner: [WAIT_FOR_SERIAL_OUTPUT - START]
file = phd-tests/framework/src/test_vm/mod.rs
line = 913
path = phd_tests::migrate::from_base::serial_history
target = phd_framework::test_vm
vm = migration_serial_history_base
vm_id = e2207d1a-2dfa-4148-b261-58384c109771
|
| 62 | 2026-10-06T00:10:36.106Z | INFO | phd-runner: [WAIT_FOR_SERIAL_OUTPUT - EVENT] Waiting for output on serial console
file = phd-tests/framework/src/test_vm/mod.rs
line = 920
path = phd_tests::migrate::from_base::serial_history
target = phd_framework::test_vm
timeout_duration = Explicit(15s)
vm = migration_serial_history_base
vm_id = e2207d1a-2dfa-4148-b261-58384c109771
|
| 63 | 2026-10-06T00:10:36.116Z | INFO | phd-runner: [WAIT_FOR_SERIAL_OUTPUT - END]
elapsed_milliseconds = 10
file = phd-tests/framework/src/test_vm/mod.rs
line = 913
path = phd_tests::migrate::from_base::serial_history
target = phd_framework::test_vm
vm = migration_serial_history_base
vm_id = e2207d1a-2dfa-4148-b261-58384c109771
|
| 64 | 2026-10-06T00:10:36.116Z | INFO | phd-runner: [WAIT_FOR_SERIAL_OUTPUT - START]
file = phd-tests/framework/src/test_vm/mod.rs
line = 913
path = phd_tests::migrate::from_base::serial_history
target = phd_framework::test_vm
vm = migration_serial_history_base
vm_id = e2207d1a-2dfa-4148-b261-58384c109771
|
| 65 | 2026-10-06T00:10:36.116Z | INFO | phd-runner: [WAIT_FOR_SERIAL_OUTPUT - EVENT] Waiting for output on serial console
file = phd-tests/framework/src/test_vm/mod.rs
line = 920
path = phd_tests::migrate::from_base::serial_history
target = phd_framework::test_vm
timeout_duration = Explicit(300s)
vm = migration_serial_history_base
vm_id = e2207d1a-2dfa-4148-b261-58384c109771
|
| 66 | 2026-10-06T00:10:36.149Z | INFO | phd-runner: [WAIT_FOR_SERIAL_OUTPUT - END]
elapsed_milliseconds = 32
file = phd-tests/framework/src/test_vm/mod.rs
line = 913
path = phd_tests::migrate::from_base::serial_history
target = phd_framework::test_vm
vm = migration_serial_history_base
vm_id = e2207d1a-2dfa-4148-b261-58384c109771
|
| 67 | 2026-10-06T00:10:36.149Z | INFO | phd-runner: [WAIT_FOR_SERIAL_OUTPUT - START]
file = phd-tests/framework/src/test_vm/mod.rs
line = 913
path = phd_tests::migrate::from_base::serial_history
target = phd_framework::test_vm
vm = migration_serial_history_base
vm_id = e2207d1a-2dfa-4148-b261-58384c109771
|
| 68 | 2026-10-06T00:10:36.149Z | INFO | phd-runner: [WAIT_FOR_SERIAL_OUTPUT - EVENT] Waiting for output on serial console
file = phd-tests/framework/src/test_vm/mod.rs
line = 920
path = phd_tests::migrate::from_base::serial_history
target = phd_framework::test_vm
timeout_duration = Explicit(15s)
vm = migration_serial_history_base
vm_id = e2207d1a-2dfa-4148-b261-58384c109771
|
| 69 | 2026-10-06T00:10:36.160Z | INFO | phd-runner: [WAIT_FOR_SERIAL_OUTPUT - END]
elapsed_milliseconds = 10
file = phd-tests/framework/src/test_vm/mod.rs
line = 913
path = phd_tests::migrate::from_base::serial_history
target = phd_framework::test_vm
vm = migration_serial_history_base
vm_id = e2207d1a-2dfa-4148-b261-58384c109771
|
| 70 | 2026-10-06T00:10:36.160Z | INFO | phd-runner: [WAIT_FOR_SERIAL_OUTPUT - START]
file = phd-tests/framework/src/test_vm/mod.rs
line = 913
path = phd_tests::migrate::from_base::serial_history
target = phd_framework::test_vm
vm = migration_serial_history_base
vm_id = e2207d1a-2dfa-4148-b261-58384c109771
|
| 71 | 2026-10-06T00:10:36.160Z | INFO | phd-runner: [WAIT_FOR_SERIAL_OUTPUT - EVENT] Waiting for output on serial console
file = phd-tests/framework/src/test_vm/mod.rs
line = 920
path = phd_tests::migrate::from_base::serial_history
target = phd_framework::test_vm
timeout_duration = Explicit(300s)
vm = migration_serial_history_base
vm_id = e2207d1a-2dfa-4148-b261-58384c109771
|
| 72 | 2026-10-06T00:10:36.194Z | INFO | phd-runner: [WAIT_FOR_SERIAL_OUTPUT - END]
elapsed_milliseconds = 33
file = phd-tests/framework/src/test_vm/mod.rs
line = 913
path = phd_tests::migrate::from_base::serial_history
target = phd_framework::test_vm
vm = migration_serial_history_base
vm_id = e2207d1a-2dfa-4148-b261-58384c109771
|
| 73 | 2026-10-06T00:10:36.204Z | INFO | phd-runner: [TEST - EVENT] migrating to new Propolis artifact for lifecycle test
file = phd-tests/framework/src/lifecycle.rs
line = 73
path = phd_tests::migrate::from_base::serial_history
propolis_artifact = __DEFAULT_PROPOLIS
target = phd_framework::lifecycle
vm_name = migration_serial_history_base
|
| 74 | 2026-10-06T00:10:36.204Z | INFO | phd-runner: [NEW - START]
file = phd-tests/framework/src/test_vm/mod.rs
line = 300
path = phd_tests::migrate::from_base::serial_history
target = phd_framework::test_vm
|
| 75 | 2026-10-06T00:10:36.204Z | INFO | phd-runner: [NEW - EVENT] phd_framework::test_vm
environment = EnvironmentSpec { location: Local, propolis_artifact: "__DEFAULT_PROPOLIS", metrics: None }
file = phd-tests/framework/src/test_vm/mod.rs
guest_os_kind = Alpine
line = 318
path = phd_tests::migrate::from_base::serial_history
target = phd_framework::test_vm
vm_name = migration_serial_history_base_lifecycle_0
|
| 76 | 2026-10-06T00:10:36.204Z | DEBG | phd-runner: [NEW - EVENT] Examining locally-sourced artifact
file = phd-tests/framework/src/artifacts/store.rs
line = 56
path = /work/phd-test/propolis-server
sha256 = None
target = phd_framework::artifacts::store
|
| 77 | 2026-10-06T00:10:36.204Z | DEBG | phd-runner: [NEW - EVENT] Locally-sourced artifact is valid, caching its path
file = phd-tests/framework/src/artifacts/store.rs
line = 69
path = /work/phd-test/propolis-server
target = phd_framework::artifacts::store
|
| 78 | 2026-10-06T00:10:36.205Z | INFO | phd-runner: [NEW - EVENT] Launching Propolis server
bootrom_path = "/phd-artifacts/740187046a7267d0de72d3455070333547dbc0ea023531471fb2b2a61effa448/OVMF_CODE.fd"
file = phd-tests/framework/src/test_vm/server.rs
line = 66
path = phd_tests::migrate::from_base::serial_history
server_addr = 127.0.0.1:9002
server_path = "/work/phd-test/propolis-server"
target = phd_framework::test_vm::server
|
| 79 | 2026-10-06T00:10:36.205Z | INFO | phd-runner: [NEW - EVENT] Opening server log files
file = phd-tests/framework/src/log_config.rs
line = 84
path = phd_tests::migrate::from_base::serial_history
stderr_path = "/tmp/propolis-phd/phd_tests::migrate::from_base::serial_history/migration_serial_history_base_lifecycle_0.stderr.log"
stdout_path = "/tmp/propolis-phd/phd_tests::migrate::from_base::serial_history/migration_serial_history_base_lifecycle_0.stdout.log"
target = phd_framework::log_config
|
| 80 | 2026-10-06T00:10:36.249Z | INFO | phd-runner: [NEW - EVENT] Launched server with pid 918
file = phd-tests/framework/src/test_vm/server.rs
line = 127
path = phd_tests::migrate::from_base::serial_history
target = phd_framework::test_vm::server
|
| 81 | 2026-10-06T00:10:36.261Z | INFO | phd-runner: [NEW - END]
elapsed_milliseconds = 57
file = phd-tests/framework/src/test_vm/mod.rs
line = 300
path = phd_tests::migrate::from_base::serial_history
target = phd_framework::test_vm
|
| 82 | 2026-10-06T00:10:36.262Z | INFO | phd-runner: [MIGRATE_FROM - START]
file = phd-tests/framework/src/test_vm/mod.rs
line = 609
path = phd_tests::migrate::from_base::serial_history
source = migration_serial_history_base
source_id = e2207d1a-2dfa-4148-b261-58384c109771
target = phd_framework::test_vm
target_id = cc19ed4d-6347-4c26-8861-e8babf9fb04c
|
| 83 | 2026-10-06T00:10:36.262Z | INFO | phd-runner: [MIGRATE_FROM - EVENT] Migrating from source at address 127.0.0.1:9000
file = phd-tests/framework/src/test_vm/mod.rs
line = 642
migration_id = 52cd67fe-ebee-4602-ac36-b023b402e08d
path = phd_tests::migrate::from_base::serial_history
source = migration_serial_history_base
source_id = e2207d1a-2dfa-4148-b261-58384c109771
target = phd_framework::test_vm
target_id = cc19ed4d-6347-4c26-8861-e8babf9fb04c
timeout_duration = 45s
|
| 84 | 2026-10-06T00:10:36.262Z | INFO | phd-runner: [INSTANCE_ENSURE_INTERNAL - START]
file = phd-tests/framework/src/test_vm/mod.rs
line = 412
path = phd_tests::migrate::from_base::serial_history
source = migration_serial_history_base
source_id = e2207d1a-2dfa-4148-b261-58384c109771
target = phd_framework::test_vm
target_id = cc19ed4d-6347-4c26-8861-e8babf9fb04c
vm = migration_serial_history_base_lifecycle_0
vm_id = cc19ed4d-6347-4c26-8861-e8babf9fb04c
|
| 85 | 2026-10-06T00:10:36.263Z | INFO | phd-runner: [INSTANCE_ENSURE_INTERNAL - EVENT] retriable error from instance_spec_ensure
e = Communication Error: error sending request for url (http://127.0.0.1:9002/instance)
file = phd-tests/framework/src/test_vm/mod.rs
line = 455
path = phd_tests::migrate::from_base::serial_history
source = migration_serial_history_base
source_id = e2207d1a-2dfa-4148-b261-58384c109771
target = phd_framework::test_vm
target_id = cc19ed4d-6347-4c26-8861-e8babf9fb04c
vm = migration_serial_history_base_lifecycle_0
vm_id = cc19ed4d-6347-4c26-8861-e8babf9fb04c
|
| 86 | 2026-10-06T00:10:37.002Z | INFO | phd-runner: [INSTANCE_ENSURE_INTERNAL - EVENT] Started instance
file = phd-tests/framework/src/test_vm/mod.rs
instance_description.instance = Instance { properties: InstanceProperties { id: cc19ed4d-6347-4c26-8861-e8babf9fb04c, name: "phd-vm-cc19ed4d-6347-4c26-8861-e8babf9fb04c", description: "Pheidippides-managed VM", metadata: InstanceMetadata { silo_id: 95d1a759-062d-4774-bf36-301d49b34a81, project_id: d25b4899-63cd-4611-9a3d-06912dbe1abe, sled_id: bc120c99-99e5-47e3-9af3-addf158e583e, sled_serial: "bc120c99-99e5-47e3-9af3-addf158e583e", sled_revision: 1, sled_model: "pheidippes" } }, state: Migrating }
line = 514
path = phd_tests::migrate::from_base::serial_history
source = migration_serial_history_base
source_id = e2207d1a-2dfa-4148-b261-58384c109771
target = phd_framework::test_vm
target_id = cc19ed4d-6347-4c26-8861-e8babf9fb04c
vm = migration_serial_history_base_lifecycle_0
vm_id = cc19ed4d-6347-4c26-8861-e8babf9fb04c
|
| 87 | 2026-10-06T00:10:37.003Z | INFO | phd-runner: [MIGRATE - START]
file = phd-tests/framework/src/test_vm/mod.rs
line = 663
migration_id = 52cd67fe-ebee-4602-ac36-b023b402e08d
path = phd_tests::migrate::from_base::serial_history
source = migration_serial_history_base
source_id = e2207d1a-2dfa-4148-b261-58384c109771
target = phd_framework::test_vm
target_id = cc19ed4d-6347-4c26-8861-e8babf9fb04c
|
| 88 | 2026-10-06T00:10:39.523Z | INFO | phd-runner: [SERIAL CONSOLE TASK - EVENT] serial socket control message
file = phd-tests/framework/src/serial/mod.rs
line = 275
s = {"Migrating":{"destination":"127.0.0.1:9002","from_start":7756}}
target = phd_framework::serial
|
| 89 | 2026-10-06T00:10:39.822Z | INFO | phd-runner: [MIGRATE_FROM - EVENT] Migration completed successfully
file = phd-tests/framework/src/test_vm/mod.rs
line = 676
path = phd_tests::migrate::from_base::serial_history
source = migration_serial_history_base
source_id = e2207d1a-2dfa-4148-b261-58384c109771
target = phd_framework::test_vm
target_id = cc19ed4d-6347-4c26-8861-e8babf9fb04c
|
| 90 | 2026-10-06T00:10:39.823Z | INFO | phd-runner: [MIGRATE - END]
elapsed_milliseconds = 2819
file = phd-tests/framework/src/test_vm/mod.rs
line = 663
migration_id = 52cd67fe-ebee-4602-ac36-b023b402e08d
path = phd_tests::migrate::from_base::serial_history
source = migration_serial_history_base
source_id = e2207d1a-2dfa-4148-b261-58384c109771
target = phd_framework::test_vm
target_id = cc19ed4d-6347-4c26-8861-e8babf9fb04c
|
| 91 | 2026-10-06T00:10:39.826Z | INFO | phd-runner: [VM CLEANUP - START]
file = phd-tests/framework/src/test_vm/mod.rs
line = 1172
path = phd_tests::migrate::from_base::serial_history
target = phd_framework::test_vm
vm = migration_serial_history_base
vm_id = e2207d1a-2dfa-4148-b261-58384c109771
|
| 92 | 2026-10-06T00:10:39.829Z | DEBG | phd-runner: [VM CLEANUP - EVENT] Killing Propolis server process
file = phd-tests/framework/src/test_vm/server.rs
line = 177
path = phd_tests::migrate::from_base::serial_history
self.address = 127.0.0.1:9000
target = phd_framework::test_vm::server
vm = migration_serial_history_base
vm_id = e2207d1a-2dfa-4148-b261-58384c109771
|
| 93 | 2026-10-06T00:10:39.907Z | INFO | phd-runner: [VM CLEANUP - END]
elapsed_milliseconds = 79
file = phd-tests/framework/src/test_vm/mod.rs
line = 1172
path = phd_tests::migrate::from_base::serial_history
target = phd_framework::test_vm
vm = migration_serial_history_base
vm_id = e2207d1a-2dfa-4148-b261-58384c109771
|
| 94 | 2026-10-06T00:10:39.908Z | INFO | phd-runner: [INSTANCE_ENSURE_INTERNAL - END]
elapsed_milliseconds = 8941
file = phd-tests/framework/src/test_vm/mod.rs
line = 412
path = phd_tests::migrate::from_base::serial_history
target = phd_framework::test_vm
vm = migration_serial_history_base
vm_id = e2207d1a-2dfa-4148-b261-58384c109771
|
| 95 | 2026-10-06T00:10:39.910Z | INFO | phd-runner: [VM CLEANUP - START]
file = phd-tests/framework/src/test_vm/mod.rs
line = 1172
path = phd_tests::migrate::from_base::serial_history
target = phd_framework::test_vm
vm = migration_serial_history_base_lifecycle_0
vm_id = cc19ed4d-6347-4c26-8861-e8babf9fb04c
|
| 96 | 2026-10-06T00:10:39.911Z | DEBG | phd-runner: [SERIAL CONSOLE TASK - EVENT] serial console command channel was closed
file = phd-tests/framework/src/serial/mod.rs
line = 213
target = phd_framework::serial
|
| 97 | 2026-10-06T00:10:39.912Z | INFO | phd-runner: [SERIAL CONSOLE TASK - END]
elapsed_milliseconds = 8420
file = phd-tests/framework/src/serial/mod.rs
line = 200
target = phd_framework::serial
|
| 98 | 2026-10-06T00:10:39.913Z | DEBG | phd-runner: [VM CLEANUP - EVENT] trying to ensure Propolis server VM is destroyed
file = phd-tests/framework/src/test_vm/mod.rs
line = 1195
path = phd_tests::migrate::from_base::serial_history
target = phd_framework::test_vm
vm = migration_serial_history_base_lifecycle_0
vm_id = cc19ed4d-6347-4c26-8861-e8babf9fb04c
|
| 99 | 2026-10-06T00:10:39.913Z | INFO | phd-runner: test phd_tests::migrate::from_base::serial_history ... ok
file = phd-tests/runner/src/execute.rs
line = 141
target = phd_runner::execute
|
| 100 | 2026-10-06T00:10:39.913Z | INFO | phd-runner: [TEST_CLEANUP - START]
file = phd-tests/runner/src/fixtures.rs
line = 51
target = phd_runner::fixtures
|
| 101 | 2026-10-06T00:10:40.553Z | DEBG | phd-runner: [VM CLEANUP - EVENT] Killing Propolis server process
file = phd-tests/framework/src/test_vm/server.rs
line = 177
path = phd_tests::migrate::from_base::serial_history
self.address = 127.0.0.1:9002
target = phd_framework::test_vm::server
vm = migration_serial_history_base_lifecycle_0
vm_id = cc19ed4d-6347-4c26-8861-e8babf9fb04c
|
| 102 | 2026-10-06T00:10:40.638Z | DEBG | phd-runner: [VM CLEANUP - EVENT] zfs clone dropped
file = phd-tests/framework/src/zfs.rs
line = 83
path = phd_tests::migrate::from_base::serial_history
target = phd_framework::zfs
vm = migration_serial_history_base_lifecycle_0
vm_id = cc19ed4d-6347-4c26-8861-e8babf9fb04c
|
| 103 | 2026-10-06T00:10:40.639Z | DEBG | phd-runner: [VM CLEANUP - EVENT] executing ZFS command
args = ["phd-artifacts/phd-clone-90151d78-e482-4371-86a3-d369022b3410"]
file = phd-tests/framework/src/zfs.rs
line = 304
path = phd_tests::migrate::from_base::serial_history
target = phd_framework::zfs
verb = destroy
vm = migration_serial_history_base_lifecycle_0
vm_id = cc19ed4d-6347-4c26-8861-e8babf9fb04c
|
| 104 | 2026-10-06T00:10:40.665Z | DEBG | phd-runner: [VM CLEANUP - EVENT] zfs snapshot dropped
file = phd-tests/framework/src/zfs.rs
line = 57
path = phd_tests::migrate::from_base::serial_history
target = phd_framework::zfs
vm = migration_serial_history_base_lifecycle_0
vm_id = cc19ed4d-6347-4c26-8861-e8babf9fb04c
|
| 105 | 2026-10-06T00:10:40.665Z | DEBG | phd-runner: [VM CLEANUP - EVENT] executing ZFS command
args = ["phd-artifacts@phd-797a8b76-faaa-46df-a842-19599555f9bd"]
file = phd-tests/framework/src/zfs.rs
line = 304
path = phd_tests::migrate::from_base::serial_history
target = phd_framework::zfs
verb = destroy
vm = migration_serial_history_base_lifecycle_0
vm_id = cc19ed4d-6347-4c26-8861-e8babf9fb04c
|
| 106 | 2026-10-06T00:10:40.683Z | INFO | phd-runner: [VM CLEANUP - END]
elapsed_milliseconds = 772
file = phd-tests/framework/src/test_vm/mod.rs
line = 1172
path = phd_tests::migrate::from_base::serial_history
target = phd_framework::test_vm
vm = migration_serial_history_base_lifecycle_0
vm_id = cc19ed4d-6347-4c26-8861-e8babf9fb04c
|
| 107 | 2026-10-06T00:10:40.683Z | INFO | phd-runner: [INSTANCE_ENSURE_INTERNAL - END]
elapsed_milliseconds = 4421
file = phd-tests/framework/src/test_vm/mod.rs
line = 412
path = phd_tests::migrate::from_base::serial_history
source = migration_serial_history_base
source_id = e2207d1a-2dfa-4148-b261-58384c109771
target = phd_framework::test_vm
target_id = cc19ed4d-6347-4c26-8861-e8babf9fb04c
vm = migration_serial_history_base_lifecycle_0
vm_id = cc19ed4d-6347-4c26-8861-e8babf9fb04c
|
| 108 | 2026-10-06T00:10:40.683Z | INFO | phd-runner: [MIGRATE_FROM - END]
elapsed_milliseconds = 4421
file = phd-tests/framework/src/test_vm/mod.rs
line = 609
path = phd_tests::migrate::from_base::serial_history
source = migration_serial_history_base
source_id = e2207d1a-2dfa-4148-b261-58384c109771
target = phd_framework::test_vm
target_id = cc19ed4d-6347-4c26-8861-e8babf9fb04c
|
| 109 | 2026-10-06T00:10:40.683Z | INFO | phd-runner: [TEST - END]
elapsed_milliseconds = 59338
file = phd-tests/tests/src/migrate.rs
line = 40
path = phd_tests::migrate::from_base::serial_history
target = phd_tests::migrate::from_base
|
| 110 | 2026-10-06T00:10:40.684Z | INFO | phd-runner: [TEST_CLEANUP - END]
elapsed_milliseconds = 770
file = phd-tests/runner/src/fixtures.rs
line = 51
target = phd_runner::fixtures
|
| 111 | 2026-10-06T00:10:40.684Z | INFO | phd-runner: Starting test phd_tests::migrate::from_base::can_migrate_from_base
file = phd-tests/runner/src/execute.rs
line = 91
target = phd_runner::execute
|
| 112 | 2026-10-06T00:10:40.684Z | INFO | phd-runner: [TEST_SETUP - START]
file = phd-tests/runner/src/fixtures.rs
line = 41
target = phd_runner::fixtures
|
| 113 | 2026-10-06T00:10:40.684Z | INFO | phd-runner: [TEST_SETUP - END]
elapsed_milliseconds = 0
file = phd-tests/runner/src/fixtures.rs
line = 41
target = phd_runner::fixtures
|
| 114 | 2026-10-06T00:10:40.684Z | INFO | phd-runner: [TEST - START]
file = phd-tests/tests/src/migrate.rs
line = 34
path = phd_tests::migrate::from_base::can_migrate_from_base
target = phd_tests::migrate::from_base
|
| 115 | 2026-10-06T00:10:40.684Z | DEBG | phd-runner: [TEST - EVENT] Verified artifact already exists
file = phd-tests/framework/src/artifacts/store.rs
line = 45
path = /phd-artifacts/740187046a7267d0de72d3455070333547dbc0ea023531471fb2b2a61effa448/OVMF_CODE.fd
target = phd_framework::artifacts::store
|
| 116 | 2026-10-06T00:10:40.684Z | DEBG | phd-runner: [TEST - EVENT] Verified artifact already exists
file = phd-tests/framework/src/artifacts/store.rs
line = 45
path = /phd-artifacts/ba8007f74f9b54fbae3b2520da577831b4834778a498d732f091260c61aa7ca1/alpine.iso
target = phd_framework::artifacts::store
|
| 117 | 2026-10-06T00:10:40.684Z | DEBG | phd-runner: [TEST - EVENT] Verified artifact already exists
file = phd-tests/framework/src/artifacts/store.rs
line = 45
path = /phd-artifacts/ba8007f74f9b54fbae3b2520da577831b4834778a498d732f091260c61aa7ca1/alpine.iso
target = phd_framework::artifacts::store
|
| 118 | 2026-10-06T00:10:40.684Z | DEBG | phd-runner: [TEST - EVENT] executing ZFS command
args = ["/phd-artifacts/ba8007f74f9b54fbae3b2520da577831b4834778a498d732f091260c61aa7ca1/alpine.iso"]
file = phd-tests/framework/src/zfs.rs
line = 304
path = phd_tests::migrate::from_base::can_migrate_from_base
target = phd_framework::zfs
verb = list
|
| 119 | 2026-10-06T00:10:40.695Z | DEBG | phd-runner: [TEST - EVENT] parsing zfs list output
file = phd-tests/framework/src/zfs.rs
line = 238
path = phd_tests::migrate::from_base::can_migrate_from_base
stdout = NAME USED AVAIL REFER MOUNTPOINT\nphd-artifacts 1.30G 25.3T 1.30G /phd-artifacts\n
target = phd_framework::zfs
|
| 120 | 2026-10-06T00:10:40.695Z | DEBG | phd-runner: [TEST - EVENT] executing ZFS command
args = ["phd-artifacts@phd-f6955288-dda9-4f08-a8bb-2535bd576f66"]
file = phd-tests/framework/src/zfs.rs
line = 304
path = phd_tests::migrate::from_base::can_migrate_from_base
target = phd_framework::zfs
verb = snapshot
|
| 121 | 2026-10-06T00:10:40.712Z | DEBG | phd-runner: [TEST - EVENT] executing ZFS command
args = ["phd-artifacts@phd-f6955288-dda9-4f08-a8bb-2535bd576f66", "phd-artifacts/phd-clone-b4623d6d-99bf-4cc8-90d4-e10e44231145"]
file = phd-tests/framework/src/zfs.rs
line = 304
path = phd_tests::migrate::from_base::can_migrate_from_base
target = phd_framework::zfs
verb = clone
|
| 122 | 2026-10-06T00:10:40.729Z | DEBG | phd-runner: [TEST - EVENT] executing ZFS command
args = ["phd-artifacts/phd-clone-b4623d6d-99bf-4cc8-90d4-e10e44231145"]
file = phd-tests/framework/src/zfs.rs
line = 304
path = phd_tests::migrate::from_base::can_migrate_from_base
target = phd_framework::zfs
verb = list
|
| 123 | 2026-10-06T00:10:40.740Z | DEBG | phd-runner: [TEST - EVENT] parsing zfs list output
file = phd-tests/framework/src/zfs.rs
line = 238
path = phd_tests::migrate::from_base::can_migrate_from_base
stdout = NAME USED AVAIL REFER MOUNTPOINT\nphd-artifacts/phd-clone-b4623d6d-99bf-4cc8-90d4-e10e44231145 0B 25.3T 1.30G /phd-artifacts/phd-clone-b4623d6d-99bf-4cc8-90d4-e10e44231145\n
target = phd_framework::zfs
|
| 124 | 2026-10-06T00:10:40.740Z | INFO | phd-runner: [NEW - START]
file = phd-tests/framework/src/test_vm/mod.rs
line = 300
path = phd_tests::migrate::from_base::can_migrate_from_base
target = phd_framework::test_vm
|
| 125 | 2026-10-06T00:10:40.741Z | INFO | phd-runner: [NEW - EVENT] phd_framework::test_vm
environment = EnvironmentSpec { location: Local, propolis_artifact: "__BASE_PROPOLIS", metrics: None }
file = phd-tests/framework/src/test_vm/mod.rs
guest_os_kind = Alpine
line = 318
path = phd_tests::migrate::from_base::can_migrate_from_base
target = phd_framework::test_vm
vm_name = migration_from_base
|
| 126 | 2026-10-06T00:10:40.741Z | DEBG | phd-runner: [NEW - EVENT] Verified artifact already exists
file = phd-tests/framework/src/artifacts/store.rs
line = 45
path = /phd-artifacts/4bf8fc6099e34afbdcfdef6b4e86494863090e3d681d8eb37a4e182353d1c2dd/propolis-server
target = phd_framework::artifacts::store
|
| 127 | 2026-10-06T00:10:40.741Z | INFO | phd-runner: [NEW - EVENT] Launching Propolis server
bootrom_path = "/phd-artifacts/740187046a7267d0de72d3455070333547dbc0ea023531471fb2b2a61effa448/OVMF_CODE.fd"
file = phd-tests/framework/src/test_vm/server.rs
line = 66
path = phd_tests::migrate::from_base::can_migrate_from_base
server_addr = 127.0.0.1:9000
server_path = "/phd-artifacts/4bf8fc6099e34afbdcfdef6b4e86494863090e3d681d8eb37a4e182353d1c2dd/propolis-server"
target = phd_framework::test_vm::server
|
| 128 | 2026-10-06T00:10:40.741Z | INFO | phd-runner: [NEW - EVENT] Opening server log files
file = phd-tests/framework/src/log_config.rs
line = 84
path = phd_tests::migrate::from_base::can_migrate_from_base
stderr_path = "/tmp/propolis-phd/phd_tests::migrate::from_base::can_migrate_from_base/migration_from_base.stderr.log"
stdout_path = "/tmp/propolis-phd/phd_tests::migrate::from_base::can_migrate_from_base/migration_from_base.stdout.log"
target = phd_framework::log_config
|
| 129 | 2026-10-06T00:10:40.785Z | INFO | phd-runner: [NEW - EVENT] Launched server with pid 927
file = phd-tests/framework/src/test_vm/server.rs
line = 127
path = phd_tests::migrate::from_base::can_migrate_from_base
target = phd_framework::test_vm::server
|
| 130 | 2026-10-06T00:10:40.799Z | INFO | phd-runner: [NEW - END]
elapsed_milliseconds = 58
file = phd-tests/framework/src/test_vm/mod.rs
line = 300
path = phd_tests::migrate::from_base::can_migrate_from_base
target = phd_framework::test_vm
|
| 131 | 2026-10-06T00:10:40.799Z | INFO | phd-runner: [INSTANCE_ENSURE_INTERNAL - START]
file = phd-tests/framework/src/test_vm/mod.rs
line = 412
path = phd_tests::migrate::from_base::can_migrate_from_base
target = phd_framework::test_vm
vm = migration_from_base
vm_id = 8958cad2-9f76-45ca-b2a9-a022e327bf62
|
| 132 | 2026-10-06T00:10:40.800Z | INFO | phd-runner: [INSTANCE_ENSURE_INTERNAL - EVENT] retriable error from instance_spec_ensure
e = Communication Error: error sending request for url (http://127.0.0.1:9000/instance)
file = phd-tests/framework/src/test_vm/mod.rs
line = 455
path = phd_tests::migrate::from_base::can_migrate_from_base
target = phd_framework::test_vm
vm = migration_from_base
vm_id = 8958cad2-9f76-45ca-b2a9-a022e327bf62
|
| 133 | 2026-10-06T00:10:41.331Z | INFO | phd-runner: [SERIAL CONSOLE TASK - START]
file = phd-tests/framework/src/serial/mod.rs
line = 200
target = phd_framework::serial
|
| 134 | 2026-10-06T00:10:41.332Z | INFO | phd-runner: [INSTANCE_ENSURE_INTERNAL - EVENT] Started instance
file = phd-tests/framework/src/test_vm/mod.rs
instance_description.instance = Instance { properties: InstanceProperties { id: 8958cad2-9f76-45ca-b2a9-a022e327bf62, name: "phd-vm-8958cad2-9f76-45ca-b2a9-a022e327bf62", description: "Pheidippides-managed VM", metadata: InstanceMetadata { silo_id: 106f953e-fa14-4702-9a6d-0aa9a16b5f24, project_id: 1661a95d-54f5-404b-ba0e-caebaf2af3b2, sled_id: e451a704-382b-4cb2-ba1f-642e0542b8d9, sled_serial: "e451a704-382b-4cb2-ba1f-642e0542b8d9", sled_revision: 1, sled_model: "pheidippes" } }, state: Creating }
line = 514
path = phd_tests::migrate::from_base::can_migrate_from_base
target = phd_framework::test_vm
vm = migration_from_base
vm_id = 8958cad2-9f76-45ca-b2a9-a022e327bf62
|
| 135 | 2026-10-06T00:10:41.332Z | INFO | phd-runner: [PUT_INSTANCE_STATE - START]
file = phd-tests/framework/src/test_vm/mod.rs
line = 575
path = phd_tests::migrate::from_base::can_migrate_from_base
target = phd_framework::test_vm
vm = migration_from_base
vm_id = 8958cad2-9f76-45ca-b2a9-a022e327bf62
|
| 136 | 2026-10-06T00:10:41.332Z | INFO | phd-runner: [PUT_INSTANCE_STATE - EVENT] Requesting instance state change
file = phd-tests/framework/src/test_vm/mod.rs
line = 580
path = phd_tests::migrate::from_base::can_migrate_from_base
state = Run
target = phd_framework::test_vm
vm = migration_from_base
vm_id = 8958cad2-9f76-45ca-b2a9-a022e327bf62
|
| 137 | 2026-10-06T00:10:41.333Z | INFO | phd-runner: [PUT_INSTANCE_STATE - END]
elapsed_milliseconds = 0
file = phd-tests/framework/src/test_vm/mod.rs
line = 575
path = phd_tests::migrate::from_base::can_migrate_from_base
target = phd_framework::test_vm
vm = migration_from_base
vm_id = 8958cad2-9f76-45ca-b2a9-a022e327bf62
|
| 138 | 2026-10-06T00:10:41.333Z | INFO | phd-runner: [WAIT_TO_BOOT - START]
file = phd-tests/framework/src/test_vm/mod.rs
line = 890
path = phd_tests::migrate::from_base::can_migrate_from_base
target = phd_framework::test_vm
|
| 139 | 2026-10-06T00:10:41.333Z | INFO | phd-runner: [WAIT_TO_BOOT - EVENT] waiting for guest to boot
file = phd-tests/framework/src/test_vm/mod.rs
line = 839
path = phd_tests::migrate::from_base::can_migrate_from_base
target = phd_framework::test_vm
timeout_duration = 300s
vm = migration_from_base
vm_id = 8958cad2-9f76-45ca-b2a9-a022e327bf62
|
| 140 | 2026-10-06T00:10:41.333Z | DEBG | phd-runner: [WAIT_TO_BOOT - EVENT] executing command in boot sequence
file = phd-tests/framework/src/test_vm/mod.rs
line = 847
path = phd_tests::migrate::from_base::can_migrate_from_base
step = WaitFor("localhost login: ")
target = phd_framework::test_vm
|
| 141 | 2026-10-06T00:10:41.333Z | INFO | phd-runner: [WAIT_FOR_SERIAL_OUTPUT - START]
file = phd-tests/framework/src/test_vm/mod.rs
line = 913
path = phd_tests::migrate::from_base::can_migrate_from_base
target = phd_framework::test_vm
vm = migration_from_base
vm_id = 8958cad2-9f76-45ca-b2a9-a022e327bf62
|
| 142 | 2026-10-06T00:10:41.333Z | INFO | phd-runner: [WAIT_FOR_SERIAL_OUTPUT - EVENT] Waiting for output on serial console
file = phd-tests/framework/src/test_vm/mod.rs
line = 920
path = phd_tests::migrate::from_base::can_migrate_from_base
target = phd_framework::test_vm
timeout_duration = CallerTimeout
vm = migration_from_base
vm_id = 8958cad2-9f76-45ca-b2a9-a022e327bf62
|
| 143 | 2026-10-06T00:10:45.953Z | INFO | phd-runner: [WAIT_FOR_SERIAL_OUTPUT - END]
elapsed_milliseconds = 4620
file = phd-tests/framework/src/test_vm/mod.rs
line = 913
path = phd_tests::migrate::from_base::can_migrate_from_base
target = phd_framework::test_vm
vm = migration_from_base
vm_id = 8958cad2-9f76-45ca-b2a9-a022e327bf62
|
| 144 | 2026-10-06T00:10:45.953Z | DEBG | phd-runner: [WAIT_TO_BOOT - EVENT] executing command in boot sequence
file = phd-tests/framework/src/test_vm/mod.rs
line = 847
path = phd_tests::migrate::from_base::can_migrate_from_base
step = WriteStr("root")
target = phd_framework::test_vm
|
| 145 | 2026-10-06T00:10:45.953Z | DEBG | phd-runner: [WAIT_TO_BOOT - EVENT] executing command in boot sequence
file = phd-tests/framework/src/test_vm/mod.rs
line = 847
path = phd_tests::migrate::from_base::can_migrate_from_base
step = WaitFor("localhost:~#")
target = phd_framework::test_vm
|
| 146 | 2026-10-06T00:10:45.953Z | INFO | phd-runner: [WAIT_FOR_SERIAL_OUTPUT - START]
file = phd-tests/framework/src/test_vm/mod.rs
line = 913
path = phd_tests::migrate::from_base::can_migrate_from_base
target = phd_framework::test_vm
vm = migration_from_base
vm_id = 8958cad2-9f76-45ca-b2a9-a022e327bf62
|
| 147 | 2026-10-06T00:10:45.953Z | INFO | phd-runner: [WAIT_FOR_SERIAL_OUTPUT - EVENT] Waiting for output on serial console
file = phd-tests/framework/src/test_vm/mod.rs
line = 920
path = phd_tests::migrate::from_base::can_migrate_from_base
target = phd_framework::test_vm
timeout_duration = CallerTimeout
vm = migration_from_base
vm_id = 8958cad2-9f76-45ca-b2a9-a022e327bf62
|
| 148 | 2026-10-06T00:10:45.971Z | INFO | phd-runner: [WAIT_FOR_SERIAL_OUTPUT - END]
elapsed_milliseconds = 17
file = phd-tests/framework/src/test_vm/mod.rs
line = 913
path = phd_tests::migrate::from_base::can_migrate_from_base
target = phd_framework::test_vm
vm = migration_from_base
vm_id = 8958cad2-9f76-45ca-b2a9-a022e327bf62
|
| 149 | 2026-10-06T00:10:45.971Z | DEBG | phd-runner: [WAIT_TO_BOOT - EVENT] executing command in boot sequence
file = phd-tests/framework/src/test_vm/mod.rs
line = 847
path = phd_tests::migrate::from_base::can_migrate_from_base
step = WriteStr("stty -F `tty` cols 9999")
target = phd_framework::test_vm
|
| 150 | 2026-10-06T00:10:45.972Z | DEBG | phd-runner: [WAIT_TO_BOOT - EVENT] executing command in boot sequence
file = phd-tests/framework/src/test_vm/mod.rs
line = 847
path = phd_tests::migrate::from_base::can_migrate_from_base
step = WaitFor("localhost:~#")
target = phd_framework::test_vm
|
| 151 | 2026-10-06T00:10:45.972Z | INFO | phd-runner: [WAIT_FOR_SERIAL_OUTPUT - START]
file = phd-tests/framework/src/test_vm/mod.rs
line = 913
path = phd_tests::migrate::from_base::can_migrate_from_base
target = phd_framework::test_vm
vm = migration_from_base
vm_id = 8958cad2-9f76-45ca-b2a9-a022e327bf62
|
| 152 | 2026-10-06T00:10:45.972Z | INFO | phd-runner: [WAIT_FOR_SERIAL_OUTPUT - EVENT] Waiting for output on serial console
file = phd-tests/framework/src/test_vm/mod.rs
line = 920
path = phd_tests::migrate::from_base::can_migrate_from_base
target = phd_framework::test_vm
timeout_duration = CallerTimeout
vm = migration_from_base
vm_id = 8958cad2-9f76-45ca-b2a9-a022e327bf62
|
| 153 | 2026-10-06T00:10:46.005Z | INFO | phd-runner: [WAIT_FOR_SERIAL_OUTPUT - END]
elapsed_milliseconds = 32
file = phd-tests/framework/src/test_vm/mod.rs
line = 913
path = phd_tests::migrate::from_base::can_migrate_from_base
target = phd_framework::test_vm
vm = migration_from_base
vm_id = 8958cad2-9f76-45ca-b2a9-a022e327bf62
|
| 154 | 2026-10-06T00:10:46.005Z | INFO | phd-runner: [WAIT_TO_BOOT - EVENT] Guest has booted
file = phd-tests/framework/src/test_vm/mod.rs
line = 887
path = phd_tests::migrate::from_base::can_migrate_from_base
target = phd_framework::test_vm
|
| 155 | 2026-10-06T00:10:46.005Z | INFO | phd-runner: [WAIT_TO_BOOT - END]
elapsed_milliseconds = 4672
file = phd-tests/framework/src/test_vm/mod.rs
line = 890
path = phd_tests::migrate::from_base::can_migrate_from_base
target = phd_framework::test_vm
|
| 156 | 2026-10-06T00:10:46.005Z | INFO | phd-runner: [WAIT_FOR_SERIAL_OUTPUT - START]
file = phd-tests/framework/src/test_vm/mod.rs
line = 913
path = phd_tests::migrate::from_base::can_migrate_from_base
target = phd_framework::test_vm
vm = migration_from_base
vm_id = 8958cad2-9f76-45ca-b2a9-a022e327bf62
|
| 157 | 2026-10-06T00:10:46.005Z | INFO | phd-runner: [WAIT_FOR_SERIAL_OUTPUT - EVENT] Waiting for output on serial console
file = phd-tests/framework/src/test_vm/mod.rs
line = 920
path = phd_tests::migrate::from_base::can_migrate_from_base
target = phd_framework::test_vm
timeout_duration = Explicit(15s)
vm = migration_from_base
vm_id = 8958cad2-9f76-45ca-b2a9-a022e327bf62
|
| 158 | 2026-10-06T00:10:46.016Z | INFO | phd-runner: [WAIT_FOR_SERIAL_OUTPUT - END]
elapsed_milliseconds = 10
file = phd-tests/framework/src/test_vm/mod.rs
line = 913
path = phd_tests::migrate::from_base::can_migrate_from_base
target = phd_framework::test_vm
vm = migration_from_base
vm_id = 8958cad2-9f76-45ca-b2a9-a022e327bf62
|
| 159 | 2026-10-06T00:10:46.016Z | INFO | phd-runner: [WAIT_FOR_SERIAL_OUTPUT - START]
file = phd-tests/framework/src/test_vm/mod.rs
line = 913
path = phd_tests::migrate::from_base::can_migrate_from_base
target = phd_framework::test_vm
vm = migration_from_base
vm_id = 8958cad2-9f76-45ca-b2a9-a022e327bf62
|
| 160 | 2026-10-06T00:10:46.016Z | INFO | phd-runner: [WAIT_FOR_SERIAL_OUTPUT - EVENT] Waiting for output on serial console
file = phd-tests/framework/src/test_vm/mod.rs
line = 920
path = phd_tests::migrate::from_base::can_migrate_from_base
target = phd_framework::test_vm
timeout_duration = Explicit(300s)
vm = migration_from_base
vm_id = 8958cad2-9f76-45ca-b2a9-a022e327bf62
|
| 161 | 2026-10-06T00:10:46.049Z | INFO | phd-runner: [WAIT_FOR_SERIAL_OUTPUT - END]
elapsed_milliseconds = 33
file = phd-tests/framework/src/test_vm/mod.rs
line = 913
path = phd_tests::migrate::from_base::can_migrate_from_base
target = phd_framework::test_vm
vm = migration_from_base
vm_id = 8958cad2-9f76-45ca-b2a9-a022e327bf62
|
| 162 | 2026-10-06T00:10:46.050Z | INFO | phd-runner: [WAIT_FOR_SERIAL_OUTPUT - START]
file = phd-tests/framework/src/test_vm/mod.rs
line = 913
path = phd_tests::migrate::from_base::can_migrate_from_base
target = phd_framework::test_vm
vm = migration_from_base
vm_id = 8958cad2-9f76-45ca-b2a9-a022e327bf62
|
| 163 | 2026-10-06T00:10:46.050Z | INFO | phd-runner: [WAIT_FOR_SERIAL_OUTPUT - EVENT] Waiting for output on serial console
file = phd-tests/framework/src/test_vm/mod.rs
line = 920
path = phd_tests::migrate::from_base::can_migrate_from_base
target = phd_framework::test_vm
timeout_duration = Explicit(15s)
vm = migration_from_base
vm_id = 8958cad2-9f76-45ca-b2a9-a022e327bf62
|
| 164 | 2026-10-06T00:10:46.060Z | INFO | phd-runner: [WAIT_FOR_SERIAL_OUTPUT - END]
elapsed_milliseconds = 9
file = phd-tests/framework/src/test_vm/mod.rs
line = 913
path = phd_tests::migrate::from_base::can_migrate_from_base
target = phd_framework::test_vm
vm = migration_from_base
vm_id = 8958cad2-9f76-45ca-b2a9-a022e327bf62
|
| 165 | 2026-10-06T00:10:46.060Z | INFO | phd-runner: [WAIT_FOR_SERIAL_OUTPUT - START]
file = phd-tests/framework/src/test_vm/mod.rs
line = 913
path = phd_tests::migrate::from_base::can_migrate_from_base
target = phd_framework::test_vm
vm = migration_from_base
vm_id = 8958cad2-9f76-45ca-b2a9-a022e327bf62
|
| 166 | 2026-10-06T00:10:46.060Z | INFO | phd-runner: [WAIT_FOR_SERIAL_OUTPUT - EVENT] Waiting for output on serial console
file = phd-tests/framework/src/test_vm/mod.rs
line = 920
path = phd_tests::migrate::from_base::can_migrate_from_base
target = phd_framework::test_vm
timeout_duration = Explicit(300s)
vm = migration_from_base
vm_id = 8958cad2-9f76-45ca-b2a9-a022e327bf62
|
| 167 | 2026-10-06T00:10:46.093Z | INFO | phd-runner: [WAIT_FOR_SERIAL_OUTPUT - END]
elapsed_milliseconds = 33
file = phd-tests/framework/src/test_vm/mod.rs
line = 913
path = phd_tests::migrate::from_base::can_migrate_from_base
target = phd_framework::test_vm
vm = migration_from_base
vm_id = 8958cad2-9f76-45ca-b2a9-a022e327bf62
|
| 168 | 2026-10-06T00:10:46.094Z | INFO | phd-runner: [WAIT_FOR_SERIAL_OUTPUT - START]
file = phd-tests/framework/src/test_vm/mod.rs
line = 913
path = phd_tests::migrate::from_base::can_migrate_from_base
target = phd_framework::test_vm
vm = migration_from_base
vm_id = 8958cad2-9f76-45ca-b2a9-a022e327bf62
|
| 169 | 2026-10-06T00:10:46.094Z | INFO | phd-runner: [WAIT_FOR_SERIAL_OUTPUT - EVENT] Waiting for output on serial console
file = phd-tests/framework/src/test_vm/mod.rs
line = 920
path = phd_tests::migrate::from_base::can_migrate_from_base
target = phd_framework::test_vm
timeout_duration = Explicit(15s)
vm = migration_from_base
vm_id = 8958cad2-9f76-45ca-b2a9-a022e327bf62
|
| 170 | 2026-10-06T00:10:46.105Z | INFO | phd-runner: [WAIT_FOR_SERIAL_OUTPUT - END]
elapsed_milliseconds = 10
file = phd-tests/framework/src/test_vm/mod.rs
line = 913
path = phd_tests::migrate::from_base::can_migrate_from_base
target = phd_framework::test_vm
vm = migration_from_base
vm_id = 8958cad2-9f76-45ca-b2a9-a022e327bf62
|
| 171 | 2026-10-06T00:10:46.105Z | INFO | phd-runner: [WAIT_FOR_SERIAL_OUTPUT - START]
file = phd-tests/framework/src/test_vm/mod.rs
line = 913
path = phd_tests::migrate::from_base::can_migrate_from_base
target = phd_framework::test_vm
vm = migration_from_base
vm_id = 8958cad2-9f76-45ca-b2a9-a022e327bf62
|
| 172 | 2026-10-06T00:10:46.105Z | INFO | phd-runner: [WAIT_FOR_SERIAL_OUTPUT - EVENT] Waiting for output on serial console
file = phd-tests/framework/src/test_vm/mod.rs
line = 920
path = phd_tests::migrate::from_base::can_migrate_from_base
target = phd_framework::test_vm
timeout_duration = Explicit(300s)
vm = migration_from_base
vm_id = 8958cad2-9f76-45ca-b2a9-a022e327bf62
|
| 173 | 2026-10-06T00:10:46.137Z | INFO | phd-runner: [WAIT_FOR_SERIAL_OUTPUT - END]
elapsed_milliseconds = 31
file = phd-tests/framework/src/test_vm/mod.rs
line = 913
path = phd_tests::migrate::from_base::can_migrate_from_base
target = phd_framework::test_vm
vm = migration_from_base
vm_id = 8958cad2-9f76-45ca-b2a9-a022e327bf62
|
| 174 | 2026-10-06T00:10:46.137Z | INFO | phd-runner: [WAIT_FOR_SERIAL_OUTPUT - START]
file = phd-tests/framework/src/test_vm/mod.rs
line = 913
path = phd_tests::migrate::from_base::can_migrate_from_base
target = phd_framework::test_vm
vm = migration_from_base
vm_id = 8958cad2-9f76-45ca-b2a9-a022e327bf62
|
| 175 | 2026-10-06T00:10:46.137Z | INFO | phd-runner: [WAIT_FOR_SERIAL_OUTPUT - EVENT] Waiting for output on serial console
file = phd-tests/framework/src/test_vm/mod.rs
line = 920
path = phd_tests::migrate::from_base::can_migrate_from_base
target = phd_framework::test_vm
timeout_duration = Explicit(15s)
vm = migration_from_base
vm_id = 8958cad2-9f76-45ca-b2a9-a022e327bf62
|
| 176 | 2026-10-06T00:10:46.148Z | INFO | phd-runner: [WAIT_FOR_SERIAL_OUTPUT - END]
elapsed_milliseconds = 10
file = phd-tests/framework/src/test_vm/mod.rs
line = 913
path = phd_tests::migrate::from_base::can_migrate_from_base
target = phd_framework::test_vm
vm = migration_from_base
vm_id = 8958cad2-9f76-45ca-b2a9-a022e327bf62
|
| 177 | 2026-10-06T00:10:46.148Z | INFO | phd-runner: [WAIT_FOR_SERIAL_OUTPUT - START]
file = phd-tests/framework/src/test_vm/mod.rs
line = 913
path = phd_tests::migrate::from_base::can_migrate_from_base
target = phd_framework::test_vm
vm = migration_from_base
vm_id = 8958cad2-9f76-45ca-b2a9-a022e327bf62
|
| 178 | 2026-10-06T00:10:46.148Z | INFO | phd-runner: [WAIT_FOR_SERIAL_OUTPUT - EVENT] Waiting for output on serial console
file = phd-tests/framework/src/test_vm/mod.rs
line = 920
path = phd_tests::migrate::from_base::can_migrate_from_base
target = phd_framework::test_vm
timeout_duration = Explicit(300s)
vm = migration_from_base
vm_id = 8958cad2-9f76-45ca-b2a9-a022e327bf62
|
| 179 | 2026-10-06T00:10:46.182Z | INFO | phd-runner: [WAIT_FOR_SERIAL_OUTPUT - END]
elapsed_milliseconds = 33
file = phd-tests/framework/src/test_vm/mod.rs
line = 913
path = phd_tests::migrate::from_base::can_migrate_from_base
target = phd_framework::test_vm
vm = migration_from_base
vm_id = 8958cad2-9f76-45ca-b2a9-a022e327bf62
|
| 180 | 2026-10-06T00:10:46.182Z | INFO | phd-runner: [WAIT_FOR_SERIAL_OUTPUT - START]
file = phd-tests/framework/src/test_vm/mod.rs
line = 913
path = phd_tests::migrate::from_base::can_migrate_from_base
target = phd_framework::test_vm
vm = migration_from_base
vm_id = 8958cad2-9f76-45ca-b2a9-a022e327bf62
|
| 181 | 2026-10-06T00:10:46.182Z | INFO | phd-runner: [WAIT_FOR_SERIAL_OUTPUT - EVENT] Waiting for output on serial console
file = phd-tests/framework/src/test_vm/mod.rs
line = 920
path = phd_tests::migrate::from_base::can_migrate_from_base
target = phd_framework::test_vm
timeout_duration = Explicit(15s)
vm = migration_from_base
vm_id = 8958cad2-9f76-45ca-b2a9-a022e327bf62
|
| 182 | 2026-10-06T00:10:46.193Z | INFO | phd-runner: [WAIT_FOR_SERIAL_OUTPUT - END]
elapsed_milliseconds = 10
file = phd-tests/framework/src/test_vm/mod.rs
line = 913
path = phd_tests::migrate::from_base::can_migrate_from_base
target = phd_framework::test_vm
vm = migration_from_base
vm_id = 8958cad2-9f76-45ca-b2a9-a022e327bf62
|
| 183 | 2026-10-06T00:10:46.193Z | INFO | phd-runner: [WAIT_FOR_SERIAL_OUTPUT - START]
file = phd-tests/framework/src/test_vm/mod.rs
line = 913
path = phd_tests::migrate::from_base::can_migrate_from_base
target = phd_framework::test_vm
vm = migration_from_base
vm_id = 8958cad2-9f76-45ca-b2a9-a022e327bf62
|
| 184 | 2026-10-06T00:10:46.194Z | INFO | phd-runner: [WAIT_FOR_SERIAL_OUTPUT - EVENT] Waiting for output on serial console
file = phd-tests/framework/src/test_vm/mod.rs
line = 920
path = phd_tests::migrate::from_base::can_migrate_from_base
target = phd_framework::test_vm
timeout_duration = Explicit(300s)
vm = migration_from_base
vm_id = 8958cad2-9f76-45ca-b2a9-a022e327bf62
|
| 185 | 2026-10-06T00:10:46.227Z | INFO | phd-runner: [WAIT_FOR_SERIAL_OUTPUT - END]
elapsed_milliseconds = 33
file = phd-tests/framework/src/test_vm/mod.rs
line = 913
path = phd_tests::migrate::from_base::can_migrate_from_base
target = phd_framework::test_vm
vm = migration_from_base
vm_id = 8958cad2-9f76-45ca-b2a9-a022e327bf62
|
| 186 | 2026-10-06T00:10:46.228Z | INFO | phd-runner: [WAIT_FOR_SERIAL_OUTPUT - START]
file = phd-tests/framework/src/test_vm/mod.rs
line = 913
path = phd_tests::migrate::from_base::can_migrate_from_base
target = phd_framework::test_vm
vm = migration_from_base
vm_id = 8958cad2-9f76-45ca-b2a9-a022e327bf62
|
| 187 | 2026-10-06T00:10:46.228Z | INFO | phd-runner: [WAIT_FOR_SERIAL_OUTPUT - EVENT] Waiting for output on serial console
file = phd-tests/framework/src/test_vm/mod.rs
line = 920
path = phd_tests::migrate::from_base::can_migrate_from_base
target = phd_framework::test_vm
timeout_duration = Explicit(15s)
vm = migration_from_base
vm_id = 8958cad2-9f76-45ca-b2a9-a022e327bf62
|
| 188 | 2026-10-06T00:10:46.238Z | INFO | phd-runner: [WAIT_FOR_SERIAL_OUTPUT - END]
elapsed_milliseconds = 9
file = phd-tests/framework/src/test_vm/mod.rs
line = 913
path = phd_tests::migrate::from_base::can_migrate_from_base
target = phd_framework::test_vm
vm = migration_from_base
vm_id = 8958cad2-9f76-45ca-b2a9-a022e327bf62
|
| 189 | 2026-10-06T00:10:46.238Z | INFO | phd-runner: [WAIT_FOR_SERIAL_OUTPUT - START]
file = phd-tests/framework/src/test_vm/mod.rs
line = 913
path = phd_tests::migrate::from_base::can_migrate_from_base
target = phd_framework::test_vm
vm = migration_from_base
vm_id = 8958cad2-9f76-45ca-b2a9-a022e327bf62
|
| 190 | 2026-10-06T00:10:46.238Z | INFO | phd-runner: [WAIT_FOR_SERIAL_OUTPUT - EVENT] Waiting for output on serial console
file = phd-tests/framework/src/test_vm/mod.rs
line = 920
path = phd_tests::migrate::from_base::can_migrate_from_base
target = phd_framework::test_vm
timeout_duration = Explicit(300s)
vm = migration_from_base
vm_id = 8958cad2-9f76-45ca-b2a9-a022e327bf62
|
| 191 | 2026-10-06T00:10:46.260Z | INFO | phd-runner: [WAIT_FOR_SERIAL_OUTPUT - END]
elapsed_milliseconds = 22
file = phd-tests/framework/src/test_vm/mod.rs
line = 913
path = phd_tests::migrate::from_base::can_migrate_from_base
target = phd_framework::test_vm
vm = migration_from_base
vm_id = 8958cad2-9f76-45ca-b2a9-a022e327bf62
|
| 192 | 2026-10-06T00:10:46.261Z | INFO | phd-runner: [TEST - EVENT] migrating to new Propolis artifact for lifecycle test
file = phd-tests/framework/src/lifecycle.rs
line = 73
path = phd_tests::migrate::from_base::can_migrate_from_base
propolis_artifact = __DEFAULT_PROPOLIS
target = phd_framework::lifecycle
vm_name = migration_from_base
|
| 193 | 2026-10-06T00:10:46.261Z | INFO | phd-runner: [NEW - START]
file = phd-tests/framework/src/test_vm/mod.rs
line = 300
path = phd_tests::migrate::from_base::can_migrate_from_base
target = phd_framework::test_vm
|
| 194 | 2026-10-06T00:10:46.261Z | INFO | phd-runner: [NEW - EVENT] phd_framework::test_vm
environment = EnvironmentSpec { location: Local, propolis_artifact: "__DEFAULT_PROPOLIS", metrics: None }
file = phd-tests/framework/src/test_vm/mod.rs
guest_os_kind = Alpine
line = 318
path = phd_tests::migrate::from_base::can_migrate_from_base
target = phd_framework::test_vm
vm_name = migration_from_base_lifecycle_0
|
| 195 | 2026-10-06T00:10:46.261Z | DEBG | phd-runner: [NEW - EVENT] Verified artifact already exists
file = phd-tests/framework/src/artifacts/store.rs
line = 45
path = /work/phd-test/propolis-server
target = phd_framework::artifacts::store
|
| 196 | 2026-10-06T00:10:46.261Z | INFO | phd-runner: [NEW - EVENT] Launching Propolis server
bootrom_path = "/phd-artifacts/740187046a7267d0de72d3455070333547dbc0ea023531471fb2b2a61effa448/OVMF_CODE.fd"
file = phd-tests/framework/src/test_vm/server.rs
line = 66
path = phd_tests::migrate::from_base::can_migrate_from_base
server_addr = 127.0.0.1:9002
server_path = "/work/phd-test/propolis-server"
target = phd_framework::test_vm::server
|
| 197 | 2026-10-06T00:10:46.261Z | INFO | phd-runner: [NEW - EVENT] Opening server log files
file = phd-tests/framework/src/log_config.rs
line = 84
path = phd_tests::migrate::from_base::can_migrate_from_base
stderr_path = "/tmp/propolis-phd/phd_tests::migrate::from_base::can_migrate_from_base/migration_from_base_lifecycle_0.stderr.log"
stdout_path = "/tmp/propolis-phd/phd_tests::migrate::from_base::can_migrate_from_base/migration_from_base_lifecycle_0.stdout.log"
target = phd_framework::log_config
|
| 198 | 2026-10-06T00:10:46.303Z | INFO | phd-runner: [NEW - EVENT] Launched server with pid 928
file = phd-tests/framework/src/test_vm/server.rs
line = 127
path = phd_tests::migrate::from_base::can_migrate_from_base
target = phd_framework::test_vm::server
|
| 199 | 2026-10-06T00:10:46.316Z | INFO | phd-runner: [NEW - END]
elapsed_milliseconds = 54
file = phd-tests/framework/src/test_vm/mod.rs
line = 300
path = phd_tests::migrate::from_base::can_migrate_from_base
target = phd_framework::test_vm
|
| 200 | 2026-10-06T00:10:46.316Z | INFO | phd-runner: [MIGRATE_FROM - START]
file = phd-tests/framework/src/test_vm/mod.rs
line = 609
path = phd_tests::migrate::from_base::can_migrate_from_base
source = migration_from_base
source_id = 8958cad2-9f76-45ca-b2a9-a022e327bf62
target = phd_framework::test_vm
target_id = 9b4e0b07-fd07-49b1-9c6f-315884b5019c
|
| 201 | 2026-10-06T00:10:46.316Z | INFO | phd-runner: [MIGRATE_FROM - EVENT] Migrating from source at address 127.0.0.1:9000
file = phd-tests/framework/src/test_vm/mod.rs
line = 642
migration_id = 14f7e0de-a1f8-4c65-bbd8-08c960bc470a
path = phd_tests::migrate::from_base::can_migrate_from_base
source = migration_from_base
source_id = 8958cad2-9f76-45ca-b2a9-a022e327bf62
target = phd_framework::test_vm
target_id = 9b4e0b07-fd07-49b1-9c6f-315884b5019c
timeout_duration = 45s
|
| 202 | 2026-10-06T00:10:46.316Z | INFO | phd-runner: [INSTANCE_ENSURE_INTERNAL - START]
file = phd-tests/framework/src/test_vm/mod.rs
line = 412
path = phd_tests::migrate::from_base::can_migrate_from_base
source = migration_from_base
source_id = 8958cad2-9f76-45ca-b2a9-a022e327bf62
target = phd_framework::test_vm
target_id = 9b4e0b07-fd07-49b1-9c6f-315884b5019c
vm = migration_from_base_lifecycle_0
vm_id = 9b4e0b07-fd07-49b1-9c6f-315884b5019c
|
| 203 | 2026-10-06T00:10:46.317Z | INFO | phd-runner: [INSTANCE_ENSURE_INTERNAL - EVENT] retriable error from instance_spec_ensure
e = Communication Error: error sending request for url (http://127.0.0.1:9002/instance)
file = phd-tests/framework/src/test_vm/mod.rs
line = 455
path = phd_tests::migrate::from_base::can_migrate_from_base
source = migration_from_base
source_id = 8958cad2-9f76-45ca-b2a9-a022e327bf62
target = phd_framework::test_vm
target_id = 9b4e0b07-fd07-49b1-9c6f-315884b5019c
vm = migration_from_base_lifecycle_0
vm_id = 9b4e0b07-fd07-49b1-9c6f-315884b5019c
|
| 204 | 2026-10-06T00:10:46.834Z | INFO | phd-runner: [INSTANCE_ENSURE_INTERNAL - EVENT] Started instance
file = phd-tests/framework/src/test_vm/mod.rs
instance_description.instance = Instance { properties: InstanceProperties { id: 9b4e0b07-fd07-49b1-9c6f-315884b5019c, name: "phd-vm-9b4e0b07-fd07-49b1-9c6f-315884b5019c", description: "Pheidippides-managed VM", metadata: InstanceMetadata { silo_id: 106f953e-fa14-4702-9a6d-0aa9a16b5f24, project_id: 1661a95d-54f5-404b-ba0e-caebaf2af3b2, sled_id: b61fe4e1-8788-46cb-a7f9-dc2e8767248b, sled_serial: "b61fe4e1-8788-46cb-a7f9-dc2e8767248b", sled_revision: 1, sled_model: "pheidippes" } }, state: Migrating }
line = 514
path = phd_tests::migrate::from_base::can_migrate_from_base
source = migration_from_base
source_id = 8958cad2-9f76-45ca-b2a9-a022e327bf62
target = phd_framework::test_vm
target_id = 9b4e0b07-fd07-49b1-9c6f-315884b5019c
vm = migration_from_base_lifecycle_0
vm_id = 9b4e0b07-fd07-49b1-9c6f-315884b5019c
|
| 205 | 2026-10-06T00:10:46.834Z | INFO | phd-runner: [MIGRATE - START]
file = phd-tests/framework/src/test_vm/mod.rs
line = 663
migration_id = 14f7e0de-a1f8-4c65-bbd8-08c960bc470a
path = phd_tests::migrate::from_base::can_migrate_from_base
source = migration_from_base
source_id = 8958cad2-9f76-45ca-b2a9-a022e327bf62
target = phd_framework::test_vm
target_id = 9b4e0b07-fd07-49b1-9c6f-315884b5019c
|
| 206 | 2026-10-06T00:10:49.390Z | INFO | phd-runner: [SERIAL CONSOLE TASK - EVENT] serial socket control message
file = phd-tests/framework/src/serial/mod.rs
line = 275
s = {"Migrating":{"destination":"127.0.0.1:9002","from_start":7847}}
target = phd_framework::serial
|
| 207 | 2026-10-06T00:10:51.325Z | INFO | phd-runner: [MIGRATE_FROM - EVENT] Migration completed successfully
file = phd-tests/framework/src/test_vm/mod.rs
line = 676
path = phd_tests::migrate::from_base::can_migrate_from_base
source = migration_from_base
source_id = 8958cad2-9f76-45ca-b2a9-a022e327bf62
target = phd_framework::test_vm
target_id = 9b4e0b07-fd07-49b1-9c6f-315884b5019c
|
| 208 | 2026-10-06T00:10:51.325Z | INFO | phd-runner: [MIGRATE - END]
elapsed_milliseconds = 4490
file = phd-tests/framework/src/test_vm/mod.rs
line = 663
migration_id = 14f7e0de-a1f8-4c65-bbd8-08c960bc470a
path = phd_tests::migrate::from_base::can_migrate_from_base
source = migration_from_base
source_id = 8958cad2-9f76-45ca-b2a9-a022e327bf62
target = phd_framework::test_vm
target_id = 9b4e0b07-fd07-49b1-9c6f-315884b5019c
|
| 209 | 2026-10-06T00:10:51.327Z | INFO | phd-runner: [VM CLEANUP - START]
file = phd-tests/framework/src/test_vm/mod.rs
line = 1172
path = phd_tests::migrate::from_base::can_migrate_from_base
target = phd_framework::test_vm
vm = migration_from_base
vm_id = 8958cad2-9f76-45ca-b2a9-a022e327bf62
|
| 210 | 2026-10-06T00:10:51.327Z | INFO | phd-runner: [WAIT_FOR_SERIAL_OUTPUT - START]
file = phd-tests/framework/src/test_vm/mod.rs
line = 913
path = phd_tests::migrate::from_base::can_migrate_from_base
target = phd_framework::test_vm
vm = migration_from_base_lifecycle_0
vm_id = 9b4e0b07-fd07-49b1-9c6f-315884b5019c
|
| 211 | 2026-10-06T00:10:51.327Z | INFO | phd-runner: [WAIT_FOR_SERIAL_OUTPUT - EVENT] Waiting for output on serial console
file = phd-tests/framework/src/test_vm/mod.rs
line = 920
path = phd_tests::migrate::from_base::can_migrate_from_base
target = phd_framework::test_vm
timeout_duration = Explicit(15s)
vm = migration_from_base_lifecycle_0
vm_id = 9b4e0b07-fd07-49b1-9c6f-315884b5019c
|
| 212 | 2026-10-06T00:10:51.329Z | DEBG | phd-runner: [VM CLEANUP - EVENT] Killing Propolis server process
file = phd-tests/framework/src/test_vm/server.rs
line = 177
path = phd_tests::migrate::from_base::can_migrate_from_base
self.address = 127.0.0.1:9000
target = phd_framework::test_vm::server
vm = migration_from_base
vm_id = 8958cad2-9f76-45ca-b2a9-a022e327bf62
|
| 213 | 2026-10-06T00:10:51.413Z | INFO | phd-runner: [VM CLEANUP - END]
elapsed_milliseconds = 85
file = phd-tests/framework/src/test_vm/mod.rs
line = 1172
path = phd_tests::migrate::from_base::can_migrate_from_base
target = phd_framework::test_vm
vm = migration_from_base
vm_id = 8958cad2-9f76-45ca-b2a9-a022e327bf62
|
| 214 | 2026-10-06T00:10:51.413Z | INFO | phd-runner: [INSTANCE_ENSURE_INTERNAL - END]
elapsed_milliseconds = 10614
file = phd-tests/framework/src/test_vm/mod.rs
line = 412
path = phd_tests::migrate::from_base::can_migrate_from_base
target = phd_framework::test_vm
vm = migration_from_base
vm_id = 8958cad2-9f76-45ca-b2a9-a022e327bf62
|
| 215 | 2026-10-06T00:10:51.413Z | INFO | phd-runner: [WAIT_FOR_SERIAL_OUTPUT - END]
elapsed_milliseconds = 85
file = phd-tests/framework/src/test_vm/mod.rs
line = 913
path = phd_tests::migrate::from_base::can_migrate_from_base
target = phd_framework::test_vm
vm = migration_from_base_lifecycle_0
vm_id = 9b4e0b07-fd07-49b1-9c6f-315884b5019c
|
| 216 | 2026-10-06T00:10:51.414Z | INFO | phd-runner: [WAIT_FOR_SERIAL_OUTPUT - START]
file = phd-tests/framework/src/test_vm/mod.rs
line = 913
path = phd_tests::migrate::from_base::can_migrate_from_base
target = phd_framework::test_vm
vm = migration_from_base_lifecycle_0
vm_id = 9b4e0b07-fd07-49b1-9c6f-315884b5019c
|
| 217 | 2026-10-06T00:10:51.414Z | INFO | phd-runner: [WAIT_FOR_SERIAL_OUTPUT - EVENT] Waiting for output on serial console
file = phd-tests/framework/src/test_vm/mod.rs
line = 920
path = phd_tests::migrate::from_base::can_migrate_from_base
target = phd_framework::test_vm
timeout_duration = Explicit(300s)
vm = migration_from_base_lifecycle_0
vm_id = 9b4e0b07-fd07-49b1-9c6f-315884b5019c
|
| 218 | 2026-10-06T00:10:51.451Z | INFO | phd-runner: [WAIT_FOR_SERIAL_OUTPUT - END]
elapsed_milliseconds = 37
file = phd-tests/framework/src/test_vm/mod.rs
line = 913
path = phd_tests::migrate::from_base::can_migrate_from_base
target = phd_framework::test_vm
vm = migration_from_base_lifecycle_0
vm_id = 9b4e0b07-fd07-49b1-9c6f-315884b5019c
|
| 219 | 2026-10-06T00:10:51.452Z | INFO | phd-runner: [WAIT_FOR_SERIAL_OUTPUT - START]
file = phd-tests/framework/src/test_vm/mod.rs
line = 913
path = phd_tests::migrate::from_base::can_migrate_from_base
target = phd_framework::test_vm
vm = migration_from_base_lifecycle_0
vm_id = 9b4e0b07-fd07-49b1-9c6f-315884b5019c
|
| 220 | 2026-10-06T00:10:51.452Z | INFO | phd-runner: [WAIT_FOR_SERIAL_OUTPUT - EVENT] Waiting for output on serial console
file = phd-tests/framework/src/test_vm/mod.rs
line = 920
path = phd_tests::migrate::from_base::can_migrate_from_base
target = phd_framework::test_vm
timeout_duration = Explicit(15s)
vm = migration_from_base_lifecycle_0
vm_id = 9b4e0b07-fd07-49b1-9c6f-315884b5019c
|
| 221 | 2026-10-06T00:10:51.462Z | INFO | phd-runner: [WAIT_FOR_SERIAL_OUTPUT - END]
elapsed_milliseconds = 10
file = phd-tests/framework/src/test_vm/mod.rs
line = 913
path = phd_tests::migrate::from_base::can_migrate_from_base
target = phd_framework::test_vm
vm = migration_from_base_lifecycle_0
vm_id = 9b4e0b07-fd07-49b1-9c6f-315884b5019c
|
| 222 | 2026-10-06T00:10:51.462Z | INFO | phd-runner: [WAIT_FOR_SERIAL_OUTPUT - START]
file = phd-tests/framework/src/test_vm/mod.rs
line = 913
path = phd_tests::migrate::from_base::can_migrate_from_base
target = phd_framework::test_vm
vm = migration_from_base_lifecycle_0
vm_id = 9b4e0b07-fd07-49b1-9c6f-315884b5019c
|
| 223 | 2026-10-06T00:10:51.463Z | INFO | phd-runner: [WAIT_FOR_SERIAL_OUTPUT - EVENT] Waiting for output on serial console
file = phd-tests/framework/src/test_vm/mod.rs
line = 920
path = phd_tests::migrate::from_base::can_migrate_from_base
target = phd_framework::test_vm
timeout_duration = Explicit(300s)
vm = migration_from_base_lifecycle_0
vm_id = 9b4e0b07-fd07-49b1-9c6f-315884b5019c
|
| 224 | 2026-10-06T00:10:51.495Z | INFO | phd-runner: [WAIT_FOR_SERIAL_OUTPUT - END]
elapsed_milliseconds = 32
file = phd-tests/framework/src/test_vm/mod.rs
line = 913
path = phd_tests::migrate::from_base::can_migrate_from_base
target = phd_framework::test_vm
vm = migration_from_base_lifecycle_0
vm_id = 9b4e0b07-fd07-49b1-9c6f-315884b5019c
|
| 225 | 2026-10-06T00:10:51.496Z | INFO | phd-runner: [WAIT_FOR_SERIAL_OUTPUT - START]
file = phd-tests/framework/src/test_vm/mod.rs
line = 913
path = phd_tests::migrate::from_base::can_migrate_from_base
target = phd_framework::test_vm
vm = migration_from_base_lifecycle_0
vm_id = 9b4e0b07-fd07-49b1-9c6f-315884b5019c
|
| 226 | 2026-10-06T00:10:51.496Z | INFO | phd-runner: [WAIT_FOR_SERIAL_OUTPUT - EVENT] Waiting for output on serial console
file = phd-tests/framework/src/test_vm/mod.rs
line = 920
path = phd_tests::migrate::from_base::can_migrate_from_base
target = phd_framework::test_vm
timeout_duration = Explicit(15s)
vm = migration_from_base_lifecycle_0
vm_id = 9b4e0b07-fd07-49b1-9c6f-315884b5019c
|
| 227 | 2026-10-06T00:10:51.507Z | INFO | phd-runner: [WAIT_FOR_SERIAL_OUTPUT - END]
elapsed_milliseconds = 11
file = phd-tests/framework/src/test_vm/mod.rs
line = 913
path = phd_tests::migrate::from_base::can_migrate_from_base
target = phd_framework::test_vm
vm = migration_from_base_lifecycle_0
vm_id = 9b4e0b07-fd07-49b1-9c6f-315884b5019c
|
| 228 | 2026-10-06T00:10:51.507Z | INFO | phd-runner: [WAIT_FOR_SERIAL_OUTPUT - START]
file = phd-tests/framework/src/test_vm/mod.rs
line = 913
path = phd_tests::migrate::from_base::can_migrate_from_base
target = phd_framework::test_vm
vm = migration_from_base_lifecycle_0
vm_id = 9b4e0b07-fd07-49b1-9c6f-315884b5019c
|
| 229 | 2026-10-06T00:10:51.508Z | INFO | phd-runner: [WAIT_FOR_SERIAL_OUTPUT - EVENT] Waiting for output on serial console
file = phd-tests/framework/src/test_vm/mod.rs
line = 920
path = phd_tests::migrate::from_base::can_migrate_from_base
target = phd_framework::test_vm
timeout_duration = Explicit(300s)
vm = migration_from_base_lifecycle_0
vm_id = 9b4e0b07-fd07-49b1-9c6f-315884b5019c
|
| 230 | 2026-10-06T00:10:51.540Z | INFO | phd-runner: [WAIT_FOR_SERIAL_OUTPUT - END]
elapsed_milliseconds = 32
file = phd-tests/framework/src/test_vm/mod.rs
line = 913
path = phd_tests::migrate::from_base::can_migrate_from_base
target = phd_framework::test_vm
vm = migration_from_base_lifecycle_0
vm_id = 9b4e0b07-fd07-49b1-9c6f-315884b5019c
|
| 231 | 2026-10-06T00:10:51.540Z | INFO | phd-runner: [WAIT_FOR_SERIAL_OUTPUT - START]
file = phd-tests/framework/src/test_vm/mod.rs
line = 913
path = phd_tests::migrate::from_base::can_migrate_from_base
target = phd_framework::test_vm
vm = migration_from_base_lifecycle_0
vm_id = 9b4e0b07-fd07-49b1-9c6f-315884b5019c
|
| 232 | 2026-10-06T00:10:51.541Z | INFO | phd-runner: [WAIT_FOR_SERIAL_OUTPUT - EVENT] Waiting for output on serial console
file = phd-tests/framework/src/test_vm/mod.rs
line = 920
path = phd_tests::migrate::from_base::can_migrate_from_base
target = phd_framework::test_vm
timeout_duration = Explicit(15s)
vm = migration_from_base_lifecycle_0
vm_id = 9b4e0b07-fd07-49b1-9c6f-315884b5019c
|
| 233 | 2026-10-06T00:10:51.551Z | INFO | phd-runner: [WAIT_FOR_SERIAL_OUTPUT - END]
elapsed_milliseconds = 10
file = phd-tests/framework/src/test_vm/mod.rs
line = 913
path = phd_tests::migrate::from_base::can_migrate_from_base
target = phd_framework::test_vm
vm = migration_from_base_lifecycle_0
vm_id = 9b4e0b07-fd07-49b1-9c6f-315884b5019c
|
| 234 | 2026-10-06T00:10:51.551Z | INFO | phd-runner: [WAIT_FOR_SERIAL_OUTPUT - START]
file = phd-tests/framework/src/test_vm/mod.rs
line = 913
path = phd_tests::migrate::from_base::can_migrate_from_base
target = phd_framework::test_vm
vm = migration_from_base_lifecycle_0
vm_id = 9b4e0b07-fd07-49b1-9c6f-315884b5019c
|
| 235 | 2026-10-06T00:10:51.551Z | INFO | phd-runner: [WAIT_FOR_SERIAL_OUTPUT - EVENT] Waiting for output on serial console
file = phd-tests/framework/src/test_vm/mod.rs
line = 920
path = phd_tests::migrate::from_base::can_migrate_from_base
target = phd_framework::test_vm
timeout_duration = Explicit(300s)
vm = migration_from_base_lifecycle_0
vm_id = 9b4e0b07-fd07-49b1-9c6f-315884b5019c
|
| 236 | 2026-10-06T00:10:51.584Z | INFO | phd-runner: [WAIT_FOR_SERIAL_OUTPUT - END]
elapsed_milliseconds = 32
file = phd-tests/framework/src/test_vm/mod.rs
line = 913
path = phd_tests::migrate::from_base::can_migrate_from_base
target = phd_framework::test_vm
vm = migration_from_base_lifecycle_0
vm_id = 9b4e0b07-fd07-49b1-9c6f-315884b5019c
|
| 237 | 2026-10-06T00:10:51.584Z | INFO | phd-runner: [WAIT_FOR_SERIAL_OUTPUT - START]
file = phd-tests/framework/src/test_vm/mod.rs
line = 913
path = phd_tests::migrate::from_base::can_migrate_from_base
target = phd_framework::test_vm
vm = migration_from_base_lifecycle_0
vm_id = 9b4e0b07-fd07-49b1-9c6f-315884b5019c
|
| 238 | 2026-10-06T00:10:51.584Z | INFO | phd-runner: [WAIT_FOR_SERIAL_OUTPUT - EVENT] Waiting for output on serial console
file = phd-tests/framework/src/test_vm/mod.rs
line = 920
path = phd_tests::migrate::from_base::can_migrate_from_base
target = phd_framework::test_vm
timeout_duration = Explicit(15s)
vm = migration_from_base_lifecycle_0
vm_id = 9b4e0b07-fd07-49b1-9c6f-315884b5019c
|
| 239 | 2026-10-06T00:10:51.595Z | INFO | phd-runner: [WAIT_FOR_SERIAL_OUTPUT - END]
elapsed_milliseconds = 10
file = phd-tests/framework/src/test_vm/mod.rs
line = 913
path = phd_tests::migrate::from_base::can_migrate_from_base
target = phd_framework::test_vm
vm = migration_from_base_lifecycle_0
vm_id = 9b4e0b07-fd07-49b1-9c6f-315884b5019c
|
| 240 | 2026-10-06T00:10:51.595Z | INFO | phd-runner: [WAIT_FOR_SERIAL_OUTPUT - START]
file = phd-tests/framework/src/test_vm/mod.rs
line = 913
path = phd_tests::migrate::from_base::can_migrate_from_base
target = phd_framework::test_vm
vm = migration_from_base_lifecycle_0
vm_id = 9b4e0b07-fd07-49b1-9c6f-315884b5019c
|
| 241 | 2026-10-06T00:10:51.595Z | INFO | phd-runner: [WAIT_FOR_SERIAL_OUTPUT - EVENT] Waiting for output on serial console
file = phd-tests/framework/src/test_vm/mod.rs
line = 920
path = phd_tests::migrate::from_base::can_migrate_from_base
target = phd_framework::test_vm
timeout_duration = Explicit(300s)
vm = migration_from_base_lifecycle_0
vm_id = 9b4e0b07-fd07-49b1-9c6f-315884b5019c
|
| 242 | 2026-10-06T00:10:51.639Z | INFO | phd-runner: [WAIT_FOR_SERIAL_OUTPUT - END]
elapsed_milliseconds = 44
file = phd-tests/framework/src/test_vm/mod.rs
line = 913
path = phd_tests::migrate::from_base::can_migrate_from_base
target = phd_framework::test_vm
vm = migration_from_base_lifecycle_0
vm_id = 9b4e0b07-fd07-49b1-9c6f-315884b5019c
|
| 243 | 2026-10-06T00:10:51.640Z | INFO | phd-runner: [WAIT_FOR_SERIAL_OUTPUT - START]
file = phd-tests/framework/src/test_vm/mod.rs
line = 913
path = phd_tests::migrate::from_base::can_migrate_from_base
target = phd_framework::test_vm
vm = migration_from_base_lifecycle_0
vm_id = 9b4e0b07-fd07-49b1-9c6f-315884b5019c
|
| 244 | 2026-10-06T00:10:51.640Z | INFO | phd-runner: [WAIT_FOR_SERIAL_OUTPUT - EVENT] Waiting for output on serial console
file = phd-tests/framework/src/test_vm/mod.rs
line = 920
path = phd_tests::migrate::from_base::can_migrate_from_base
target = phd_framework::test_vm
timeout_duration = Explicit(15s)
vm = migration_from_base_lifecycle_0
vm_id = 9b4e0b07-fd07-49b1-9c6f-315884b5019c
|
| 245 | 2026-10-06T00:10:51.650Z | INFO | phd-runner: [WAIT_FOR_SERIAL_OUTPUT - END]
elapsed_milliseconds = 10
file = phd-tests/framework/src/test_vm/mod.rs
line = 913
path = phd_tests::migrate::from_base::can_migrate_from_base
target = phd_framework::test_vm
vm = migration_from_base_lifecycle_0
vm_id = 9b4e0b07-fd07-49b1-9c6f-315884b5019c
|
| 246 | 2026-10-06T00:10:51.651Z | INFO | phd-runner: [WAIT_FOR_SERIAL_OUTPUT - START]
file = phd-tests/framework/src/test_vm/mod.rs
line = 913
path = phd_tests::migrate::from_base::can_migrate_from_base
target = phd_framework::test_vm
vm = migration_from_base_lifecycle_0
vm_id = 9b4e0b07-fd07-49b1-9c6f-315884b5019c
|
| 247 | 2026-10-06T00:10:51.651Z | INFO | phd-runner: [WAIT_FOR_SERIAL_OUTPUT - EVENT] Waiting for output on serial console
file = phd-tests/framework/src/test_vm/mod.rs
line = 920
path = phd_tests::migrate::from_base::can_migrate_from_base
target = phd_framework::test_vm
timeout_duration = Explicit(300s)
vm = migration_from_base_lifecycle_0
vm_id = 9b4e0b07-fd07-49b1-9c6f-315884b5019c
|
| 248 | 2026-10-06T00:10:51.682Z | INFO | phd-runner: [WAIT_FOR_SERIAL_OUTPUT - END]
elapsed_milliseconds = 31
file = phd-tests/framework/src/test_vm/mod.rs
line = 913
path = phd_tests::migrate::from_base::can_migrate_from_base
target = phd_framework::test_vm
vm = migration_from_base_lifecycle_0
vm_id = 9b4e0b07-fd07-49b1-9c6f-315884b5019c
|
| 249 | 2026-10-06T00:10:51.683Z | INFO | phd-runner: [WAIT_FOR_SERIAL_OUTPUT - START]
file = phd-tests/framework/src/test_vm/mod.rs
line = 913
path = phd_tests::migrate::from_base::can_migrate_from_base
target = phd_framework::test_vm
vm = migration_from_base_lifecycle_0
vm_id = 9b4e0b07-fd07-49b1-9c6f-315884b5019c
|
| 250 | 2026-10-06T00:10:51.683Z | INFO | phd-runner: [WAIT_FOR_SERIAL_OUTPUT - EVENT] Waiting for output on serial console
file = phd-tests/framework/src/test_vm/mod.rs
line = 920
path = phd_tests::migrate::from_base::can_migrate_from_base
target = phd_framework::test_vm
timeout_duration = Explicit(15s)
vm = migration_from_base_lifecycle_0
vm_id = 9b4e0b07-fd07-49b1-9c6f-315884b5019c
|
| 251 | 2026-10-06T00:10:51.694Z | INFO | phd-runner: [WAIT_FOR_SERIAL_OUTPUT - END]
elapsed_milliseconds = 11
file = phd-tests/framework/src/test_vm/mod.rs
line = 913
path = phd_tests::migrate::from_base::can_migrate_from_base
target = phd_framework::test_vm
vm = migration_from_base_lifecycle_0
vm_id = 9b4e0b07-fd07-49b1-9c6f-315884b5019c
|
| 252 | 2026-10-06T00:10:51.694Z | INFO | phd-runner: [WAIT_FOR_SERIAL_OUTPUT - START]
file = phd-tests/framework/src/test_vm/mod.rs
line = 913
path = phd_tests::migrate::from_base::can_migrate_from_base
target = phd_framework::test_vm
vm = migration_from_base_lifecycle_0
vm_id = 9b4e0b07-fd07-49b1-9c6f-315884b5019c
|
| 253 | 2026-10-06T00:10:51.695Z | INFO | phd-runner: [WAIT_FOR_SERIAL_OUTPUT - EVENT] Waiting for output on serial console
file = phd-tests/framework/src/test_vm/mod.rs
line = 920
path = phd_tests::migrate::from_base::can_migrate_from_base
target = phd_framework::test_vm
timeout_duration = Explicit(300s)
vm = migration_from_base_lifecycle_0
vm_id = 9b4e0b07-fd07-49b1-9c6f-315884b5019c
|
| 254 | 2026-10-06T00:10:51.727Z | INFO | phd-runner: [WAIT_FOR_SERIAL_OUTPUT - END]
elapsed_milliseconds = 32
file = phd-tests/framework/src/test_vm/mod.rs
line = 913
path = phd_tests::migrate::from_base::can_migrate_from_base
target = phd_framework::test_vm
vm = migration_from_base_lifecycle_0
vm_id = 9b4e0b07-fd07-49b1-9c6f-315884b5019c
|
| 255 | 2026-10-06T00:10:51.728Z | INFO | phd-runner: [WAIT_FOR_SERIAL_OUTPUT - START]
file = phd-tests/framework/src/test_vm/mod.rs
line = 913
path = phd_tests::migrate::from_base::can_migrate_from_base
target = phd_framework::test_vm
vm = migration_from_base_lifecycle_0
vm_id = 9b4e0b07-fd07-49b1-9c6f-315884b5019c
|
| 256 | 2026-10-06T00:10:51.728Z | INFO | phd-runner: [WAIT_FOR_SERIAL_OUTPUT - EVENT] Waiting for output on serial console
file = phd-tests/framework/src/test_vm/mod.rs
line = 920
path = phd_tests::migrate::from_base::can_migrate_from_base
target = phd_framework::test_vm
timeout_duration = Explicit(15s)
vm = migration_from_base_lifecycle_0
vm_id = 9b4e0b07-fd07-49b1-9c6f-315884b5019c
|
| 257 | 2026-10-06T00:10:51.738Z | INFO | phd-runner: [WAIT_FOR_SERIAL_OUTPUT - END]
elapsed_milliseconds = 10
file = phd-tests/framework/src/test_vm/mod.rs
line = 913
path = phd_tests::migrate::from_base::can_migrate_from_base
target = phd_framework::test_vm
vm = migration_from_base_lifecycle_0
vm_id = 9b4e0b07-fd07-49b1-9c6f-315884b5019c
|
| 258 | 2026-10-06T00:10:51.738Z | INFO | phd-runner: [WAIT_FOR_SERIAL_OUTPUT - START]
file = phd-tests/framework/src/test_vm/mod.rs
line = 913
path = phd_tests::migrate::from_base::can_migrate_from_base
target = phd_framework::test_vm
vm = migration_from_base_lifecycle_0
vm_id = 9b4e0b07-fd07-49b1-9c6f-315884b5019c
|
| 259 | 2026-10-06T00:10:51.739Z | INFO | phd-runner: [WAIT_FOR_SERIAL_OUTPUT - EVENT] Waiting for output on serial console
file = phd-tests/framework/src/test_vm/mod.rs
line = 920
path = phd_tests::migrate::from_base::can_migrate_from_base
target = phd_framework::test_vm
timeout_duration = Explicit(300s)
vm = migration_from_base_lifecycle_0
vm_id = 9b4e0b07-fd07-49b1-9c6f-315884b5019c
|
| 260 | 2026-10-06T00:10:51.771Z | INFO | phd-runner: [WAIT_FOR_SERIAL_OUTPUT - END]
elapsed_milliseconds = 32
file = phd-tests/framework/src/test_vm/mod.rs
line = 913
path = phd_tests::migrate::from_base::can_migrate_from_base
target = phd_framework::test_vm
vm = migration_from_base_lifecycle_0
vm_id = 9b4e0b07-fd07-49b1-9c6f-315884b5019c
|
| 261 | 2026-10-06T00:10:51.772Z | INFO | phd-runner: [VM CLEANUP - START]
file = phd-tests/framework/src/test_vm/mod.rs
line = 1172
path = phd_tests::migrate::from_base::can_migrate_from_base
target = phd_framework::test_vm
vm = migration_from_base_lifecycle_0
vm_id = 9b4e0b07-fd07-49b1-9c6f-315884b5019c
|
| 262 | 2026-10-06T00:10:51.772Z | DEBG | phd-runner: [SERIAL CONSOLE TASK - EVENT] serial console command channel was closed
file = phd-tests/framework/src/serial/mod.rs
line = 213
target = phd_framework::serial
|
| 263 | 2026-10-06T00:10:51.772Z | INFO | phd-runner: test phd_tests::migrate::from_base::can_migrate_from_base ... ok
file = phd-tests/runner/src/execute.rs
line = 141
target = phd_runner::execute
|
| 264 | 2026-10-06T00:10:51.772Z | INFO | phd-runner: [TEST_CLEANUP - START]
file = phd-tests/runner/src/fixtures.rs
line = 51
target = phd_runner::fixtures
|
| 265 | 2026-10-06T00:10:51.772Z | INFO | phd-runner: [SERIAL CONSOLE TASK - END]
elapsed_milliseconds = 10441
file = phd-tests/framework/src/serial/mod.rs
line = 200
target = phd_framework::serial
|
| 266 | 2026-10-06T00:10:51.773Z | DEBG | phd-runner: [VM CLEANUP - EVENT] trying to ensure Propolis server VM is destroyed
file = phd-tests/framework/src/test_vm/mod.rs
line = 1195
path = phd_tests::migrate::from_base::can_migrate_from_base
target = phd_framework::test_vm
vm = migration_from_base_lifecycle_0
vm_id = 9b4e0b07-fd07-49b1-9c6f-315884b5019c
|
| 267 | 2026-10-06T00:10:52.246Z | DEBG | phd-runner: [VM CLEANUP - EVENT] Killing Propolis server process
file = phd-tests/framework/src/test_vm/server.rs
line = 177
path = phd_tests::migrate::from_base::can_migrate_from_base
self.address = 127.0.0.1:9002
target = phd_framework::test_vm::server
vm = migration_from_base_lifecycle_0
vm_id = 9b4e0b07-fd07-49b1-9c6f-315884b5019c
|
| 268 | 2026-10-06T00:10:52.331Z | DEBG | phd-runner: [VM CLEANUP - EVENT] zfs clone dropped
file = phd-tests/framework/src/zfs.rs
line = 83
path = phd_tests::migrate::from_base::can_migrate_from_base
target = phd_framework::zfs
vm = migration_from_base_lifecycle_0
vm_id = 9b4e0b07-fd07-49b1-9c6f-315884b5019c
|
| 269 | 2026-10-06T00:10:52.331Z | DEBG | phd-runner: [VM CLEANUP - EVENT] executing ZFS command
args = ["phd-artifacts/phd-clone-b4623d6d-99bf-4cc8-90d4-e10e44231145"]
file = phd-tests/framework/src/zfs.rs
line = 304
path = phd_tests::migrate::from_base::can_migrate_from_base
target = phd_framework::zfs
verb = destroy
vm = migration_from_base_lifecycle_0
vm_id = 9b4e0b07-fd07-49b1-9c6f-315884b5019c
|
| 270 | 2026-10-06T00:10:52.357Z | DEBG | phd-runner: [VM CLEANUP - EVENT] zfs snapshot dropped
file = phd-tests/framework/src/zfs.rs
line = 57
path = phd_tests::migrate::from_base::can_migrate_from_base
target = phd_framework::zfs
vm = migration_from_base_lifecycle_0
vm_id = 9b4e0b07-fd07-49b1-9c6f-315884b5019c
|
| 271 | 2026-10-06T00:10:52.357Z | DEBG | phd-runner: [VM CLEANUP - EVENT] executing ZFS command
args = ["phd-artifacts@phd-f6955288-dda9-4f08-a8bb-2535bd576f66"]
file = phd-tests/framework/src/zfs.rs
line = 304
path = phd_tests::migrate::from_base::can_migrate_from_base
target = phd_framework::zfs
verb = destroy
vm = migration_from_base_lifecycle_0
vm_id = 9b4e0b07-fd07-49b1-9c6f-315884b5019c
|
| 272 | 2026-10-06T00:10:52.375Z | INFO | phd-runner: [VM CLEANUP - END]
elapsed_milliseconds = 603
file = phd-tests/framework/src/test_vm/mod.rs
line = 1172
path = phd_tests::migrate::from_base::can_migrate_from_base
target = phd_framework::test_vm
vm = migration_from_base_lifecycle_0
vm_id = 9b4e0b07-fd07-49b1-9c6f-315884b5019c
|
| 273 | 2026-10-06T00:10:52.375Z | INFO | phd-runner: [INSTANCE_ENSURE_INTERNAL - END]
elapsed_milliseconds = 6059
file = phd-tests/framework/src/test_vm/mod.rs
line = 412
path = phd_tests::migrate::from_base::can_migrate_from_base
source = migration_from_base
source_id = 8958cad2-9f76-45ca-b2a9-a022e327bf62
target = phd_framework::test_vm
target_id = 9b4e0b07-fd07-49b1-9c6f-315884b5019c
vm = migration_from_base_lifecycle_0
vm_id = 9b4e0b07-fd07-49b1-9c6f-315884b5019c
|
| 274 | 2026-10-06T00:10:52.375Z | INFO | phd-runner: [TEST_CLEANUP - END]
elapsed_milliseconds = 603
file = phd-tests/runner/src/fixtures.rs
line = 51
target = phd_runner::fixtures
|
| 275 | 2026-10-06T00:10:52.375Z | INFO | phd-runner: [MIGRATE_FROM - END]
elapsed_milliseconds = 6059
file = phd-tests/framework/src/test_vm/mod.rs
line = 609
path = phd_tests::migrate::from_base::can_migrate_from_base
source = migration_from_base
source_id = 8958cad2-9f76-45ca-b2a9-a022e327bf62
target = phd_framework::test_vm
target_id = 9b4e0b07-fd07-49b1-9c6f-315884b5019c
|
| 276 | 2026-10-06T00:10:52.375Z | INFO | phd-runner: Starting test phd_tests::migrate::from_base::migration_from_base_and_back
file = phd-tests/runner/src/execute.rs
line = 91
target = phd_runner::execute
|
| 277 | 2026-10-06T00:10:52.375Z | INFO | phd-runner: [TEST - END]
elapsed_milliseconds = 11691
file = phd-tests/tests/src/migrate.rs
line = 34
path = phd_tests::migrate::from_base::can_migrate_from_base
target = phd_tests::migrate::from_base
|
| 278 | 2026-10-06T00:10:52.375Z | INFO | phd-runner: [TEST_SETUP - START]
file = phd-tests/runner/src/fixtures.rs
line = 41
target = phd_runner::fixtures
|
| 279 | 2026-10-06T00:10:52.375Z | INFO | phd-runner: [TEST_SETUP - END]
elapsed_milliseconds = 0
file = phd-tests/runner/src/fixtures.rs
line = 41
target = phd_runner::fixtures
|
| 280 | 2026-10-06T00:10:52.376Z | INFO | phd-runner: [TEST - START]
file = phd-tests/tests/src/migrate.rs
line = 52
path = phd_tests::migrate::from_base::migration_from_base_and_back
target = phd_tests::migrate::from_base
|
| 281 | 2026-10-06T00:10:52.376Z | DEBG | phd-runner: [TEST - EVENT] Verified artifact already exists
file = phd-tests/framework/src/artifacts/store.rs
line = 45
path = /phd-artifacts/740187046a7267d0de72d3455070333547dbc0ea023531471fb2b2a61effa448/OVMF_CODE.fd
target = phd_framework::artifacts::store
|
| 282 | 2026-10-06T00:10:52.376Z | DEBG | phd-runner: [TEST - EVENT] Verified artifact already exists
file = phd-tests/framework/src/artifacts/store.rs
line = 45
path = /phd-artifacts/ba8007f74f9b54fbae3b2520da577831b4834778a498d732f091260c61aa7ca1/alpine.iso
target = phd_framework::artifacts::store
|
| 283 | 2026-10-06T00:10:52.376Z | DEBG | phd-runner: [TEST - EVENT] Verified artifact already exists
file = phd-tests/framework/src/artifacts/store.rs
line = 45
path = /phd-artifacts/ba8007f74f9b54fbae3b2520da577831b4834778a498d732f091260c61aa7ca1/alpine.iso
target = phd_framework::artifacts::store
|
| 284 | 2026-10-06T00:10:52.376Z | DEBG | phd-runner: [TEST - EVENT] executing ZFS command
args = ["/phd-artifacts/ba8007f74f9b54fbae3b2520da577831b4834778a498d732f091260c61aa7ca1/alpine.iso"]
file = phd-tests/framework/src/zfs.rs
line = 304
path = phd_tests::migrate::from_base::migration_from_base_and_back
target = phd_framework::zfs
verb = list
|
| 285 | 2026-10-06T00:10:52.387Z | DEBG | phd-runner: [TEST - EVENT] parsing zfs list output
file = phd-tests/framework/src/zfs.rs
line = 238
path = phd_tests::migrate::from_base::migration_from_base_and_back
stdout = NAME USED AVAIL REFER MOUNTPOINT\nphd-artifacts 1.30G 25.3T 1.30G /phd-artifacts\n
target = phd_framework::zfs
|
| 286 | 2026-10-06T00:10:52.388Z | DEBG | phd-runner: [TEST - EVENT] executing ZFS command
args = ["phd-artifacts@phd-5a99ad08-9765-4dde-8fc3-f23610d1fb3d"]
file = phd-tests/framework/src/zfs.rs
line = 304
path = phd_tests::migrate::from_base::migration_from_base_and_back
target = phd_framework::zfs
verb = snapshot
|
| 287 | 2026-10-06T00:10:52.405Z | DEBG | phd-runner: [TEST - EVENT] executing ZFS command
args = ["phd-artifacts@phd-5a99ad08-9765-4dde-8fc3-f23610d1fb3d", "phd-artifacts/phd-clone-1c4c4b95-cd28-4cdd-8e98-2a81e45ae84c"]
file = phd-tests/framework/src/zfs.rs
line = 304
path = phd_tests::migrate::from_base::migration_from_base_and_back
target = phd_framework::zfs
verb = clone
|
| 288 | 2026-10-06T00:10:52.426Z | DEBG | phd-runner: [TEST - EVENT] executing ZFS command
args = ["phd-artifacts/phd-clone-1c4c4b95-cd28-4cdd-8e98-2a81e45ae84c"]
file = phd-tests/framework/src/zfs.rs
line = 304
path = phd_tests::migrate::from_base::migration_from_base_and_back
target = phd_framework::zfs
verb = list
|
| 289 | 2026-10-06T00:10:52.438Z | DEBG | phd-runner: [TEST - EVENT] parsing zfs list output
file = phd-tests/framework/src/zfs.rs
line = 238
path = phd_tests::migrate::from_base::migration_from_base_and_back
stdout = NAME USED AVAIL REFER MOUNTPOINT\nphd-artifacts/phd-clone-1c4c4b95-cd28-4cdd-8e98-2a81e45ae84c 0B 25.3T 1.30G /phd-artifacts/phd-clone-1c4c4b95-cd28-4cdd-8e98-2a81e45ae84c\n
target = phd_framework::zfs
|
| 290 | 2026-10-06T00:10:52.438Z | INFO | phd-runner: [NEW - START]
file = phd-tests/framework/src/test_vm/mod.rs
line = 300
path = phd_tests::migrate::from_base::migration_from_base_and_back
target = phd_framework::test_vm
|
| 291 | 2026-10-06T00:10:52.439Z | INFO | phd-runner: [NEW - EVENT] phd_framework::test_vm
environment = EnvironmentSpec { location: Local, propolis_artifact: "__BASE_PROPOLIS", metrics: None }
file = phd-tests/framework/src/test_vm/mod.rs
guest_os_kind = Alpine
line = 318
path = phd_tests::migrate::from_base::migration_from_base_and_back
target = phd_framework::test_vm
vm_name = migration_from_base_and_back
|
| 292 | 2026-10-06T00:10:52.439Z | DEBG | phd-runner: [NEW - EVENT] Verified artifact already exists
file = phd-tests/framework/src/artifacts/store.rs
line = 45
path = /phd-artifacts/4bf8fc6099e34afbdcfdef6b4e86494863090e3d681d8eb37a4e182353d1c2dd/propolis-server
target = phd_framework::artifacts::store
|
| 293 | 2026-10-06T00:10:52.439Z | INFO | phd-runner: [NEW - EVENT] Launching Propolis server
bootrom_path = "/phd-artifacts/740187046a7267d0de72d3455070333547dbc0ea023531471fb2b2a61effa448/OVMF_CODE.fd"
file = phd-tests/framework/src/test_vm/server.rs
line = 66
path = phd_tests::migrate::from_base::migration_from_base_and_back
server_addr = 127.0.0.1:9000
server_path = "/phd-artifacts/4bf8fc6099e34afbdcfdef6b4e86494863090e3d681d8eb37a4e182353d1c2dd/propolis-server"
target = phd_framework::test_vm::server
|
| 294 | 2026-10-06T00:10:52.439Z | INFO | phd-runner: [NEW - EVENT] Opening server log files
file = phd-tests/framework/src/log_config.rs
line = 84
path = phd_tests::migrate::from_base::migration_from_base_and_back
stderr_path = "/tmp/propolis-phd/phd_tests::migrate::from_base::migration_from_base_and_back/migration_from_base_and_back.stderr.log"
stdout_path = "/tmp/propolis-phd/phd_tests::migrate::from_base::migration_from_base_and_back/migration_from_base_and_back.stdout.log"
target = phd_framework::log_config
|
| 295 | 2026-10-06T00:10:52.485Z | INFO | phd-runner: [NEW - EVENT] Launched server with pid 937
file = phd-tests/framework/src/test_vm/server.rs
line = 127
path = phd_tests::migrate::from_base::migration_from_base_and_back
target = phd_framework::test_vm::server
|
| 296 | 2026-10-06T00:10:52.499Z | INFO | phd-runner: [NEW - END]
elapsed_milliseconds = 60
file = phd-tests/framework/src/test_vm/mod.rs
line = 300
path = phd_tests::migrate::from_base::migration_from_base_and_back
target = phd_framework::test_vm
|
| 297 | 2026-10-06T00:10:52.500Z | INFO | phd-runner: [INSTANCE_ENSURE_INTERNAL - START]
file = phd-tests/framework/src/test_vm/mod.rs
line = 412
path = phd_tests::migrate::from_base::migration_from_base_and_back
target = phd_framework::test_vm
vm = migration_from_base_and_back
vm_id = 83cce87f-e41a-4b3d-b92d-e9e33b4623e8
|
| 298 | 2026-10-06T00:10:52.500Z | INFO | phd-runner: [INSTANCE_ENSURE_INTERNAL - EVENT] retriable error from instance_spec_ensure
e = Communication Error: error sending request for url (http://127.0.0.1:9000/instance)
file = phd-tests/framework/src/test_vm/mod.rs
line = 455
path = phd_tests::migrate::from_base::migration_from_base_and_back
target = phd_framework::test_vm
vm = migration_from_base_and_back
vm_id = 83cce87f-e41a-4b3d-b92d-e9e33b4623e8
|
| 299 | 2026-10-06T00:10:53.172Z | INFO | phd-runner: [SERIAL CONSOLE TASK - START]
file = phd-tests/framework/src/serial/mod.rs
line = 200
target = phd_framework::serial
|
| 300 | 2026-10-06T00:10:53.173Z | INFO | phd-runner: [INSTANCE_ENSURE_INTERNAL - EVENT] Started instance
file = phd-tests/framework/src/test_vm/mod.rs
instance_description.instance = Instance { properties: InstanceProperties { id: 83cce87f-e41a-4b3d-b92d-e9e33b4623e8, name: "phd-vm-83cce87f-e41a-4b3d-b92d-e9e33b4623e8", description: "Pheidippides-managed VM", metadata: InstanceMetadata { silo_id: c8b6148c-57fd-4e78-9e44-1d20465a17ff, project_id: 05227fdf-48a1-4783-bd4f-439aead1bbe0, sled_id: e929a60e-ed3b-485a-8201-389bd3a94d0a, sled_serial: "e929a60e-ed3b-485a-8201-389bd3a94d0a", sled_revision: 1, sled_model: "pheidippes" } }, state: Creating }
line = 514
path = phd_tests::migrate::from_base::migration_from_base_and_back
target = phd_framework::test_vm
vm = migration_from_base_and_back
vm_id = 83cce87f-e41a-4b3d-b92d-e9e33b4623e8
|
| 301 | 2026-10-06T00:10:53.173Z | INFO | phd-runner: [PUT_INSTANCE_STATE - START]
file = phd-tests/framework/src/test_vm/mod.rs
line = 575
path = phd_tests::migrate::from_base::migration_from_base_and_back
target = phd_framework::test_vm
vm = migration_from_base_and_back
vm_id = 83cce87f-e41a-4b3d-b92d-e9e33b4623e8
|
| 302 | 2026-10-06T00:10:53.173Z | INFO | phd-runner: [PUT_INSTANCE_STATE - EVENT] Requesting instance state change
file = phd-tests/framework/src/test_vm/mod.rs
line = 580
path = phd_tests::migrate::from_base::migration_from_base_and_back
state = Run
target = phd_framework::test_vm
vm = migration_from_base_and_back
vm_id = 83cce87f-e41a-4b3d-b92d-e9e33b4623e8
|
| 303 | 2026-10-06T00:10:53.174Z | INFO | phd-runner: [PUT_INSTANCE_STATE - END]
elapsed_milliseconds = 1
file = phd-tests/framework/src/test_vm/mod.rs
line = 575
path = phd_tests::migrate::from_base::migration_from_base_and_back
target = phd_framework::test_vm
vm = migration_from_base_and_back
vm_id = 83cce87f-e41a-4b3d-b92d-e9e33b4623e8
|
| 304 | 2026-10-06T00:10:53.174Z | INFO | phd-runner: [WAIT_TO_BOOT - START]
file = phd-tests/framework/src/test_vm/mod.rs
line = 890
path = phd_tests::migrate::from_base::migration_from_base_and_back
target = phd_framework::test_vm
|
| 305 | 2026-10-06T00:10:53.174Z | INFO | phd-runner: [WAIT_TO_BOOT - EVENT] waiting for guest to boot
file = phd-tests/framework/src/test_vm/mod.rs
line = 839
path = phd_tests::migrate::from_base::migration_from_base_and_back
target = phd_framework::test_vm
timeout_duration = 300s
vm = migration_from_base_and_back
vm_id = 83cce87f-e41a-4b3d-b92d-e9e33b4623e8
|
| 306 | 2026-10-06T00:10:53.174Z | DEBG | phd-runner: [WAIT_TO_BOOT - EVENT] executing command in boot sequence
file = phd-tests/framework/src/test_vm/mod.rs
line = 847
path = phd_tests::migrate::from_base::migration_from_base_and_back
step = WaitFor("localhost login: ")
target = phd_framework::test_vm
|
| 307 | 2026-10-06T00:10:53.175Z | INFO | phd-runner: [WAIT_FOR_SERIAL_OUTPUT - START]
file = phd-tests/framework/src/test_vm/mod.rs
line = 913
path = phd_tests::migrate::from_base::migration_from_base_and_back
target = phd_framework::test_vm
vm = migration_from_base_and_back
vm_id = 83cce87f-e41a-4b3d-b92d-e9e33b4623e8
|
| 308 | 2026-10-06T00:10:53.175Z | INFO | phd-runner: [WAIT_FOR_SERIAL_OUTPUT - EVENT] Waiting for output on serial console
file = phd-tests/framework/src/test_vm/mod.rs
line = 920
path = phd_tests::migrate::from_base::migration_from_base_and_back
target = phd_framework::test_vm
timeout_duration = CallerTimeout
vm = migration_from_base_and_back
vm_id = 83cce87f-e41a-4b3d-b92d-e9e33b4623e8
|
| 309 | 2026-10-06T00:10:57.782Z | INFO | phd-runner: [WAIT_FOR_SERIAL_OUTPUT - END]
elapsed_milliseconds = 4607
file = phd-tests/framework/src/test_vm/mod.rs
line = 913
path = phd_tests::migrate::from_base::migration_from_base_and_back
target = phd_framework::test_vm
vm = migration_from_base_and_back
vm_id = 83cce87f-e41a-4b3d-b92d-e9e33b4623e8
|
| 310 | 2026-10-06T00:10:57.782Z | DEBG | phd-runner: [WAIT_TO_BOOT - EVENT] executing command in boot sequence
file = phd-tests/framework/src/test_vm/mod.rs
line = 847
path = phd_tests::migrate::from_base::migration_from_base_and_back
step = WriteStr("root")
target = phd_framework::test_vm
|
| 311 | 2026-10-06T00:10:57.782Z | DEBG | phd-runner: [WAIT_TO_BOOT - EVENT] executing command in boot sequence
file = phd-tests/framework/src/test_vm/mod.rs
line = 847
path = phd_tests::migrate::from_base::migration_from_base_and_back
step = WaitFor("localhost:~#")
target = phd_framework::test_vm
|
| 312 | 2026-10-06T00:10:57.782Z | INFO | phd-runner: [WAIT_FOR_SERIAL_OUTPUT - START]
file = phd-tests/framework/src/test_vm/mod.rs
line = 913
path = phd_tests::migrate::from_base::migration_from_base_and_back
target = phd_framework::test_vm
vm = migration_from_base_and_back
vm_id = 83cce87f-e41a-4b3d-b92d-e9e33b4623e8
|
| 313 | 2026-10-06T00:10:57.782Z | INFO | phd-runner: [WAIT_FOR_SERIAL_OUTPUT - EVENT] Waiting for output on serial console
file = phd-tests/framework/src/test_vm/mod.rs
line = 920
path = phd_tests::migrate::from_base::migration_from_base_and_back
target = phd_framework::test_vm
timeout_duration = CallerTimeout
vm = migration_from_base_and_back
vm_id = 83cce87f-e41a-4b3d-b92d-e9e33b4623e8
|
| 314 | 2026-10-06T00:10:57.802Z | INFO | phd-runner: [WAIT_FOR_SERIAL_OUTPUT - END]
elapsed_milliseconds = 19
file = phd-tests/framework/src/test_vm/mod.rs
line = 913
path = phd_tests::migrate::from_base::migration_from_base_and_back
target = phd_framework::test_vm
vm = migration_from_base_and_back
vm_id = 83cce87f-e41a-4b3d-b92d-e9e33b4623e8
|
| 315 | 2026-10-06T00:10:57.802Z | DEBG | phd-runner: [WAIT_TO_BOOT - EVENT] executing command in boot sequence
file = phd-tests/framework/src/test_vm/mod.rs
line = 847
path = phd_tests::migrate::from_base::migration_from_base_and_back
step = WriteStr("stty -F `tty` cols 9999")
target = phd_framework::test_vm
|
| 316 | 2026-10-06T00:10:57.802Z | DEBG | phd-runner: [WAIT_TO_BOOT - EVENT] executing command in boot sequence
file = phd-tests/framework/src/test_vm/mod.rs
line = 847
path = phd_tests::migrate::from_base::migration_from_base_and_back
step = WaitFor("localhost:~#")
target = phd_framework::test_vm
|
| 317 | 2026-10-06T00:10:57.802Z | INFO | phd-runner: [WAIT_FOR_SERIAL_OUTPUT - START]
file = phd-tests/framework/src/test_vm/mod.rs
line = 913
path = phd_tests::migrate::from_base::migration_from_base_and_back
target = phd_framework::test_vm
vm = migration_from_base_and_back
vm_id = 83cce87f-e41a-4b3d-b92d-e9e33b4623e8
|
| 318 | 2026-10-06T00:10:57.802Z | INFO | phd-runner: [WAIT_FOR_SERIAL_OUTPUT - EVENT] Waiting for output on serial console
file = phd-tests/framework/src/test_vm/mod.rs
line = 920
path = phd_tests::migrate::from_base::migration_from_base_and_back
target = phd_framework::test_vm
timeout_duration = CallerTimeout
vm = migration_from_base_and_back
vm_id = 83cce87f-e41a-4b3d-b92d-e9e33b4623e8
|
| 319 | 2026-10-06T00:10:57.835Z | INFO | phd-runner: [WAIT_FOR_SERIAL_OUTPUT - END]
elapsed_milliseconds = 33
file = phd-tests/framework/src/test_vm/mod.rs
line = 913
path = phd_tests::migrate::from_base::migration_from_base_and_back
target = phd_framework::test_vm
vm = migration_from_base_and_back
vm_id = 83cce87f-e41a-4b3d-b92d-e9e33b4623e8
|
| 320 | 2026-10-06T00:10:57.835Z | INFO | phd-runner: [WAIT_TO_BOOT - EVENT] Guest has booted
file = phd-tests/framework/src/test_vm/mod.rs
line = 887
path = phd_tests::migrate::from_base::migration_from_base_and_back
target = phd_framework::test_vm
|
| 321 | 2026-10-06T00:10:57.835Z | INFO | phd-runner: [WAIT_TO_BOOT - END]
elapsed_milliseconds = 4660
file = phd-tests/framework/src/test_vm/mod.rs
line = 890
path = phd_tests::migrate::from_base::migration_from_base_and_back
target = phd_framework::test_vm
|
| 322 | 2026-10-06T00:10:57.836Z | INFO | phd-runner: [WAIT_FOR_SERIAL_OUTPUT - START]
file = phd-tests/framework/src/test_vm/mod.rs
line = 913
path = phd_tests::migrate::from_base::migration_from_base_and_back
target = phd_framework::test_vm
vm = migration_from_base_and_back
vm_id = 83cce87f-e41a-4b3d-b92d-e9e33b4623e8
|
| 323 | 2026-10-06T00:10:57.836Z | INFO | phd-runner: [WAIT_FOR_SERIAL_OUTPUT - EVENT] Waiting for output on serial console
file = phd-tests/framework/src/test_vm/mod.rs
line = 920
path = phd_tests::migrate::from_base::migration_from_base_and_back
target = phd_framework::test_vm
timeout_duration = Explicit(15s)
vm = migration_from_base_and_back
vm_id = 83cce87f-e41a-4b3d-b92d-e9e33b4623e8
|
| 324 | 2026-10-06T00:10:57.846Z | INFO | phd-runner: [WAIT_FOR_SERIAL_OUTPUT - END]
elapsed_milliseconds = 10
file = phd-tests/framework/src/test_vm/mod.rs
line = 913
path = phd_tests::migrate::from_base::migration_from_base_and_back
target = phd_framework::test_vm
vm = migration_from_base_and_back
vm_id = 83cce87f-e41a-4b3d-b92d-e9e33b4623e8
|
| 325 | 2026-10-06T00:10:57.847Z | INFO | phd-runner: [WAIT_FOR_SERIAL_OUTPUT - START]
file = phd-tests/framework/src/test_vm/mod.rs
line = 913
path = phd_tests::migrate::from_base::migration_from_base_and_back
target = phd_framework::test_vm
vm = migration_from_base_and_back
vm_id = 83cce87f-e41a-4b3d-b92d-e9e33b4623e8
|
| 326 | 2026-10-06T00:10:57.847Z | INFO | phd-runner: [WAIT_FOR_SERIAL_OUTPUT - EVENT] Waiting for output on serial console
file = phd-tests/framework/src/test_vm/mod.rs
line = 920
path = phd_tests::migrate::from_base::migration_from_base_and_back
target = phd_framework::test_vm
timeout_duration = Explicit(300s)
vm = migration_from_base_and_back
vm_id = 83cce87f-e41a-4b3d-b92d-e9e33b4623e8
|
| 327 | 2026-10-06T00:10:57.880Z | INFO | phd-runner: [WAIT_FOR_SERIAL_OUTPUT - END]
elapsed_milliseconds = 33
file = phd-tests/framework/src/test_vm/mod.rs
line = 913
path = phd_tests::migrate::from_base::migration_from_base_and_back
target = phd_framework::test_vm
vm = migration_from_base_and_back
vm_id = 83cce87f-e41a-4b3d-b92d-e9e33b4623e8
|
| 328 | 2026-10-06T00:10:57.880Z | INFO | phd-runner: [WAIT_FOR_SERIAL_OUTPUT - START]
file = phd-tests/framework/src/test_vm/mod.rs
line = 913
path = phd_tests::migrate::from_base::migration_from_base_and_back
target = phd_framework::test_vm
vm = migration_from_base_and_back
vm_id = 83cce87f-e41a-4b3d-b92d-e9e33b4623e8
|
| 329 | 2026-10-06T00:10:57.880Z | INFO | phd-runner: [WAIT_FOR_SERIAL_OUTPUT - EVENT] Waiting for output on serial console
file = phd-tests/framework/src/test_vm/mod.rs
line = 920
path = phd_tests::migrate::from_base::migration_from_base_and_back
target = phd_framework::test_vm
timeout_duration = Explicit(15s)
vm = migration_from_base_and_back
vm_id = 83cce87f-e41a-4b3d-b92d-e9e33b4623e8
|
| 330 | 2026-10-06T00:10:57.891Z | INFO | phd-runner: [WAIT_FOR_SERIAL_OUTPUT - END]
elapsed_milliseconds = 10
file = phd-tests/framework/src/test_vm/mod.rs
line = 913
path = phd_tests::migrate::from_base::migration_from_base_and_back
target = phd_framework::test_vm
vm = migration_from_base_and_back
vm_id = 83cce87f-e41a-4b3d-b92d-e9e33b4623e8
|
| 331 | 2026-10-06T00:10:57.891Z | INFO | phd-runner: [WAIT_FOR_SERIAL_OUTPUT - START]
file = phd-tests/framework/src/test_vm/mod.rs
line = 913
path = phd_tests::migrate::from_base::migration_from_base_and_back
target = phd_framework::test_vm
vm = migration_from_base_and_back
vm_id = 83cce87f-e41a-4b3d-b92d-e9e33b4623e8
|
| 332 | 2026-10-06T00:10:57.891Z | INFO | phd-runner: [WAIT_FOR_SERIAL_OUTPUT - EVENT] Waiting for output on serial console
file = phd-tests/framework/src/test_vm/mod.rs
line = 920
path = phd_tests::migrate::from_base::migration_from_base_and_back
target = phd_framework::test_vm
timeout_duration = Explicit(300s)
vm = migration_from_base_and_back
vm_id = 83cce87f-e41a-4b3d-b92d-e9e33b4623e8
|
| 333 | 2026-10-06T00:10:57.924Z | INFO | phd-runner: [WAIT_FOR_SERIAL_OUTPUT - END]
elapsed_milliseconds = 32
file = phd-tests/framework/src/test_vm/mod.rs
line = 913
path = phd_tests::migrate::from_base::migration_from_base_and_back
target = phd_framework::test_vm
vm = migration_from_base_and_back
vm_id = 83cce87f-e41a-4b3d-b92d-e9e33b4623e8
|
| 334 | 2026-10-06T00:10:57.924Z | INFO | phd-runner: [WAIT_FOR_SERIAL_OUTPUT - START]
file = phd-tests/framework/src/test_vm/mod.rs
line = 913
path = phd_tests::migrate::from_base::migration_from_base_and_back
target = phd_framework::test_vm
vm = migration_from_base_and_back
vm_id = 83cce87f-e41a-4b3d-b92d-e9e33b4623e8
|
| 335 | 2026-10-06T00:10:57.924Z | INFO | phd-runner: [WAIT_FOR_SERIAL_OUTPUT - EVENT] Waiting for output on serial console
file = phd-tests/framework/src/test_vm/mod.rs
line = 920
path = phd_tests::migrate::from_base::migration_from_base_and_back
target = phd_framework::test_vm
timeout_duration = Explicit(15s)
vm = migration_from_base_and_back
vm_id = 83cce87f-e41a-4b3d-b92d-e9e33b4623e8
|
| 336 | 2026-10-06T00:10:57.935Z | INFO | phd-runner: [WAIT_FOR_SERIAL_OUTPUT - END]
elapsed_milliseconds = 10
file = phd-tests/framework/src/test_vm/mod.rs
line = 913
path = phd_tests::migrate::from_base::migration_from_base_and_back
target = phd_framework::test_vm
vm = migration_from_base_and_back
vm_id = 83cce87f-e41a-4b3d-b92d-e9e33b4623e8
|
| 337 | 2026-10-06T00:10:57.935Z | INFO | phd-runner: [WAIT_FOR_SERIAL_OUTPUT - START]
file = phd-tests/framework/src/test_vm/mod.rs
line = 913
path = phd_tests::migrate::from_base::migration_from_base_and_back
target = phd_framework::test_vm
vm = migration_from_base_and_back
vm_id = 83cce87f-e41a-4b3d-b92d-e9e33b4623e8
|
| 338 | 2026-10-06T00:10:57.935Z | INFO | phd-runner: [WAIT_FOR_SERIAL_OUTPUT - EVENT] Waiting for output on serial console
file = phd-tests/framework/src/test_vm/mod.rs
line = 920
path = phd_tests::migrate::from_base::migration_from_base_and_back
target = phd_framework::test_vm
timeout_duration = Explicit(300s)
vm = migration_from_base_and_back
vm_id = 83cce87f-e41a-4b3d-b92d-e9e33b4623e8
|
| 339 | 2026-10-06T00:10:57.967Z | INFO | phd-runner: [WAIT_FOR_SERIAL_OUTPUT - END]
elapsed_milliseconds = 32
file = phd-tests/framework/src/test_vm/mod.rs
line = 913
path = phd_tests::migrate::from_base::migration_from_base_and_back
target = phd_framework::test_vm
vm = migration_from_base_and_back
vm_id = 83cce87f-e41a-4b3d-b92d-e9e33b4623e8
|
| 340 | 2026-10-06T00:10:57.968Z | INFO | phd-runner: [WAIT_FOR_SERIAL_OUTPUT - START]
file = phd-tests/framework/src/test_vm/mod.rs
line = 913
path = phd_tests::migrate::from_base::migration_from_base_and_back
target = phd_framework::test_vm
vm = migration_from_base_and_back
vm_id = 83cce87f-e41a-4b3d-b92d-e9e33b4623e8
|
| 341 | 2026-10-06T00:10:57.968Z | INFO | phd-runner: [WAIT_FOR_SERIAL_OUTPUT - EVENT] Waiting for output on serial console
file = phd-tests/framework/src/test_vm/mod.rs
line = 920
path = phd_tests::migrate::from_base::migration_from_base_and_back
target = phd_framework::test_vm
timeout_duration = Explicit(15s)
vm = migration_from_base_and_back
vm_id = 83cce87f-e41a-4b3d-b92d-e9e33b4623e8
|
| 342 | 2026-10-06T00:10:57.978Z | INFO | phd-runner: [WAIT_FOR_SERIAL_OUTPUT - END]
elapsed_milliseconds = 10
file = phd-tests/framework/src/test_vm/mod.rs
line = 913
path = phd_tests::migrate::from_base::migration_from_base_and_back
target = phd_framework::test_vm
vm = migration_from_base_and_back
vm_id = 83cce87f-e41a-4b3d-b92d-e9e33b4623e8
|
| 343 | 2026-10-06T00:10:57.979Z | INFO | phd-runner: [WAIT_FOR_SERIAL_OUTPUT - START]
file = phd-tests/framework/src/test_vm/mod.rs
line = 913
path = phd_tests::migrate::from_base::migration_from_base_and_back
target = phd_framework::test_vm
vm = migration_from_base_and_back
vm_id = 83cce87f-e41a-4b3d-b92d-e9e33b4623e8
|
| 344 | 2026-10-06T00:10:57.979Z | INFO | phd-runner: [WAIT_FOR_SERIAL_OUTPUT - EVENT] Waiting for output on serial console
file = phd-tests/framework/src/test_vm/mod.rs
line = 920
path = phd_tests::migrate::from_base::migration_from_base_and_back
target = phd_framework::test_vm
timeout_duration = Explicit(300s)
vm = migration_from_base_and_back
vm_id = 83cce87f-e41a-4b3d-b92d-e9e33b4623e8
|
| 345 | 2026-10-06T00:10:58.012Z | INFO | phd-runner: [WAIT_FOR_SERIAL_OUTPUT - END]
elapsed_milliseconds = 33
file = phd-tests/framework/src/test_vm/mod.rs
line = 913
path = phd_tests::migrate::from_base::migration_from_base_and_back
target = phd_framework::test_vm
vm = migration_from_base_and_back
vm_id = 83cce87f-e41a-4b3d-b92d-e9e33b4623e8
|
| 346 | 2026-10-06T00:10:58.012Z | INFO | phd-runner: [WAIT_FOR_SERIAL_OUTPUT - START]
file = phd-tests/framework/src/test_vm/mod.rs
line = 913
path = phd_tests::migrate::from_base::migration_from_base_and_back
target = phd_framework::test_vm
vm = migration_from_base_and_back
vm_id = 83cce87f-e41a-4b3d-b92d-e9e33b4623e8
|
| 347 | 2026-10-06T00:10:58.012Z | INFO | phd-runner: [WAIT_FOR_SERIAL_OUTPUT - EVENT] Waiting for output on serial console
file = phd-tests/framework/src/test_vm/mod.rs
line = 920
path = phd_tests::migrate::from_base::migration_from_base_and_back
target = phd_framework::test_vm
timeout_duration = Explicit(15s)
vm = migration_from_base_and_back
vm_id = 83cce87f-e41a-4b3d-b92d-e9e33b4623e8
|
| 348 | 2026-10-06T00:10:58.023Z | INFO | phd-runner: [WAIT_FOR_SERIAL_OUTPUT - END]
elapsed_milliseconds = 10
file = phd-tests/framework/src/test_vm/mod.rs
line = 913
path = phd_tests::migrate::from_base::migration_from_base_and_back
target = phd_framework::test_vm
vm = migration_from_base_and_back
vm_id = 83cce87f-e41a-4b3d-b92d-e9e33b4623e8
|
| 349 | 2026-10-06T00:10:58.023Z | INFO | phd-runner: [WAIT_FOR_SERIAL_OUTPUT - START]
file = phd-tests/framework/src/test_vm/mod.rs
line = 913
path = phd_tests::migrate::from_base::migration_from_base_and_back
target = phd_framework::test_vm
vm = migration_from_base_and_back
vm_id = 83cce87f-e41a-4b3d-b92d-e9e33b4623e8
|
| 350 | 2026-10-06T00:10:58.023Z | INFO | phd-runner: [WAIT_FOR_SERIAL_OUTPUT - EVENT] Waiting for output on serial console
file = phd-tests/framework/src/test_vm/mod.rs
line = 920
path = phd_tests::migrate::from_base::migration_from_base_and_back
target = phd_framework::test_vm
timeout_duration = Explicit(300s)
vm = migration_from_base_and_back
vm_id = 83cce87f-e41a-4b3d-b92d-e9e33b4623e8
|
| 351 | 2026-10-06T00:10:58.055Z | INFO | phd-runner: [WAIT_FOR_SERIAL_OUTPUT - END]
elapsed_milliseconds = 32
file = phd-tests/framework/src/test_vm/mod.rs
line = 913
path = phd_tests::migrate::from_base::migration_from_base_and_back
target = phd_framework::test_vm
vm = migration_from_base_and_back
vm_id = 83cce87f-e41a-4b3d-b92d-e9e33b4623e8
|
| 352 | 2026-10-06T00:10:58.056Z | INFO | phd-runner: [WAIT_FOR_SERIAL_OUTPUT - START]
file = phd-tests/framework/src/test_vm/mod.rs
line = 913
path = phd_tests::migrate::from_base::migration_from_base_and_back
target = phd_framework::test_vm
vm = migration_from_base_and_back
vm_id = 83cce87f-e41a-4b3d-b92d-e9e33b4623e8
|
| 353 | 2026-10-06T00:10:58.056Z | INFO | phd-runner: [WAIT_FOR_SERIAL_OUTPUT - EVENT] Waiting for output on serial console
file = phd-tests/framework/src/test_vm/mod.rs
line = 920
path = phd_tests::migrate::from_base::migration_from_base_and_back
target = phd_framework::test_vm
timeout_duration = Explicit(15s)
vm = migration_from_base_and_back
vm_id = 83cce87f-e41a-4b3d-b92d-e9e33b4623e8
|
| 354 | 2026-10-06T00:10:58.066Z | INFO | phd-runner: [WAIT_FOR_SERIAL_OUTPUT - END]
elapsed_milliseconds = 10
file = phd-tests/framework/src/test_vm/mod.rs
line = 913
path = phd_tests::migrate::from_base::migration_from_base_and_back
target = phd_framework::test_vm
vm = migration_from_base_and_back
vm_id = 83cce87f-e41a-4b3d-b92d-e9e33b4623e8
|
| 355 | 2026-10-06T00:10:58.067Z | INFO | phd-runner: [WAIT_FOR_SERIAL_OUTPUT - START]
file = phd-tests/framework/src/test_vm/mod.rs
line = 913
path = phd_tests::migrate::from_base::migration_from_base_and_back
target = phd_framework::test_vm
vm = migration_from_base_and_back
vm_id = 83cce87f-e41a-4b3d-b92d-e9e33b4623e8
|
| 356 | 2026-10-06T00:10:58.067Z | INFO | phd-runner: [WAIT_FOR_SERIAL_OUTPUT - EVENT] Waiting for output on serial console
file = phd-tests/framework/src/test_vm/mod.rs
line = 920
path = phd_tests::migrate::from_base::migration_from_base_and_back
target = phd_framework::test_vm
timeout_duration = Explicit(300s)
vm = migration_from_base_and_back
vm_id = 83cce87f-e41a-4b3d-b92d-e9e33b4623e8
|
| 357 | 2026-10-06T00:10:58.100Z | INFO | phd-runner: [WAIT_FOR_SERIAL_OUTPUT - END]
elapsed_milliseconds = 33
file = phd-tests/framework/src/test_vm/mod.rs
line = 913
path = phd_tests::migrate::from_base::migration_from_base_and_back
target = phd_framework::test_vm
vm = migration_from_base_and_back
vm_id = 83cce87f-e41a-4b3d-b92d-e9e33b4623e8
|
| 358 | 2026-10-06T00:10:58.100Z | INFO | phd-runner: [TEST - EVENT] migrating to new Propolis artifact for lifecycle test
file = phd-tests/framework/src/lifecycle.rs
line = 73
path = phd_tests::migrate::from_base::migration_from_base_and_back
propolis_artifact = __DEFAULT_PROPOLIS
target = phd_framework::lifecycle
vm_name = migration_from_base_and_back
|
| 359 | 2026-10-06T00:10:58.101Z | INFO | phd-runner: [NEW - START]
file = phd-tests/framework/src/test_vm/mod.rs
line = 300
path = phd_tests::migrate::from_base::migration_from_base_and_back
target = phd_framework::test_vm
|
| 360 | 2026-10-06T00:10:58.101Z | INFO | phd-runner: [NEW - EVENT] phd_framework::test_vm
environment = EnvironmentSpec { location: Local, propolis_artifact: "__DEFAULT_PROPOLIS", metrics: None }
file = phd-tests/framework/src/test_vm/mod.rs
guest_os_kind = Alpine
line = 318
path = phd_tests::migrate::from_base::migration_from_base_and_back
target = phd_framework::test_vm
vm_name = migration_from_base_and_back_lifecycle_0
|
| 361 | 2026-10-06T00:10:58.101Z | DEBG | phd-runner: [NEW - EVENT] Verified artifact already exists
file = phd-tests/framework/src/artifacts/store.rs
line = 45
path = /work/phd-test/propolis-server
target = phd_framework::artifacts::store
|
| 362 | 2026-10-06T00:10:58.101Z | INFO | phd-runner: [NEW - EVENT] Launching Propolis server
bootrom_path = "/phd-artifacts/740187046a7267d0de72d3455070333547dbc0ea023531471fb2b2a61effa448/OVMF_CODE.fd"
file = phd-tests/framework/src/test_vm/server.rs
line = 66
path = phd_tests::migrate::from_base::migration_from_base_and_back
server_addr = 127.0.0.1:9002
server_path = "/work/phd-test/propolis-server"
target = phd_framework::test_vm::server
|
| 363 | 2026-10-06T00:10:58.101Z | INFO | phd-runner: [NEW - EVENT] Opening server log files
file = phd-tests/framework/src/log_config.rs
line = 84
path = phd_tests::migrate::from_base::migration_from_base_and_back
stderr_path = "/tmp/propolis-phd/phd_tests::migrate::from_base::migration_from_base_and_back/migration_from_base_and_back_lifecycle_0.stderr.log"
stdout_path = "/tmp/propolis-phd/phd_tests::migrate::from_base::migration_from_base_and_back/migration_from_base_and_back_lifecycle_0.stdout.log"
target = phd_framework::log_config
|
| 364 | 2026-10-06T00:10:58.145Z | INFO | phd-runner: [NEW - EVENT] Launched server with pid 938
file = phd-tests/framework/src/test_vm/server.rs
line = 127
path = phd_tests::migrate::from_base::migration_from_base_and_back
target = phd_framework::test_vm::server
|
| 365 | 2026-10-06T00:10:58.158Z | INFO | phd-runner: [NEW - END]
elapsed_milliseconds = 57
file = phd-tests/framework/src/test_vm/mod.rs
line = 300
path = phd_tests::migrate::from_base::migration_from_base_and_back
target = phd_framework::test_vm
|
| 366 | 2026-10-06T00:10:58.158Z | INFO | phd-runner: [MIGRATE_FROM - START]
file = phd-tests/framework/src/test_vm/mod.rs
line = 609
path = phd_tests::migrate::from_base::migration_from_base_and_back
source = migration_from_base_and_back
source_id = 83cce87f-e41a-4b3d-b92d-e9e33b4623e8
target = phd_framework::test_vm
target_id = 09f415e7-31bc-4241-8e94-119a39e5c09c
|
| 367 | 2026-10-06T00:10:58.158Z | INFO | phd-runner: [MIGRATE_FROM - EVENT] Migrating from source at address 127.0.0.1:9000
file = phd-tests/framework/src/test_vm/mod.rs
line = 642
migration_id = 69003d2d-9b40-43ee-bbf9-6191edf42842
path = phd_tests::migrate::from_base::migration_from_base_and_back
source = migration_from_base_and_back
source_id = 83cce87f-e41a-4b3d-b92d-e9e33b4623e8
target = phd_framework::test_vm
target_id = 09f415e7-31bc-4241-8e94-119a39e5c09c
timeout_duration = 45s
|
| 368 | 2026-10-06T00:10:58.158Z | INFO | phd-runner: [INSTANCE_ENSURE_INTERNAL - START]
file = phd-tests/framework/src/test_vm/mod.rs
line = 412
path = phd_tests::migrate::from_base::migration_from_base_and_back
source = migration_from_base_and_back
source_id = 83cce87f-e41a-4b3d-b92d-e9e33b4623e8
target = phd_framework::test_vm
target_id = 09f415e7-31bc-4241-8e94-119a39e5c09c
vm = migration_from_base_and_back_lifecycle_0
vm_id = 09f415e7-31bc-4241-8e94-119a39e5c09c
|
| 369 | 2026-10-06T00:10:58.159Z | INFO | phd-runner: [INSTANCE_ENSURE_INTERNAL - EVENT] retriable error from instance_spec_ensure
e = Communication Error: error sending request for url (http://127.0.0.1:9002/instance)
file = phd-tests/framework/src/test_vm/mod.rs
line = 455
path = phd_tests::migrate::from_base::migration_from_base_and_back
source = migration_from_base_and_back
source_id = 83cce87f-e41a-4b3d-b92d-e9e33b4623e8
target = phd_framework::test_vm
target_id = 09f415e7-31bc-4241-8e94-119a39e5c09c
vm = migration_from_base_and_back_lifecycle_0
vm_id = 09f415e7-31bc-4241-8e94-119a39e5c09c
|
| 370 | 2026-10-06T00:10:58.994Z | INFO | phd-runner: [INSTANCE_ENSURE_INTERNAL - EVENT] Started instance
file = phd-tests/framework/src/test_vm/mod.rs
instance_description.instance = Instance { properties: InstanceProperties { id: 09f415e7-31bc-4241-8e94-119a39e5c09c, name: "phd-vm-09f415e7-31bc-4241-8e94-119a39e5c09c", description: "Pheidippides-managed VM", metadata: InstanceMetadata { silo_id: c8b6148c-57fd-4e78-9e44-1d20465a17ff, project_id: 05227fdf-48a1-4783-bd4f-439aead1bbe0, sled_id: 7a86bfd0-0040-4505-aacf-4391fbeb28cb, sled_serial: "7a86bfd0-0040-4505-aacf-4391fbeb28cb", sled_revision: 1, sled_model: "pheidippes" } }, state: Migrating }
line = 514
path = phd_tests::migrate::from_base::migration_from_base_and_back
source = migration_from_base_and_back
source_id = 83cce87f-e41a-4b3d-b92d-e9e33b4623e8
target = phd_framework::test_vm
target_id = 09f415e7-31bc-4241-8e94-119a39e5c09c
vm = migration_from_base_and_back_lifecycle_0
vm_id = 09f415e7-31bc-4241-8e94-119a39e5c09c
|
| 371 | 2026-10-06T00:10:58.994Z | INFO | phd-runner: [MIGRATE - START]
file = phd-tests/framework/src/test_vm/mod.rs
line = 663
migration_id = 69003d2d-9b40-43ee-bbf9-6191edf42842
path = phd_tests::migrate::from_base::migration_from_base_and_back
source = migration_from_base_and_back
source_id = 83cce87f-e41a-4b3d-b92d-e9e33b4623e8
target = phd_framework::test_vm
target_id = 09f415e7-31bc-4241-8e94-119a39e5c09c
|
| 372 | 2026-10-06T00:11:01.547Z | INFO | phd-runner: [SERIAL CONSOLE TASK - EVENT] serial socket control message
file = phd-tests/framework/src/serial/mod.rs
line = 275
s = {"Migrating":{"destination":"127.0.0.1:9002","from_start":7847}}
target = phd_framework::serial
|
| 373 | 2026-10-06T00:11:02.492Z | INFO | phd-runner: [MIGRATE_FROM - EVENT] Migration completed successfully
file = phd-tests/framework/src/test_vm/mod.rs
line = 676
path = phd_tests::migrate::from_base::migration_from_base_and_back
source = migration_from_base_and_back
source_id = 83cce87f-e41a-4b3d-b92d-e9e33b4623e8
target = phd_framework::test_vm
target_id = 09f415e7-31bc-4241-8e94-119a39e5c09c
|
| 374 | 2026-10-06T00:11:02.492Z | INFO | phd-runner: [MIGRATE - END]
elapsed_milliseconds = 3498
file = phd-tests/framework/src/test_vm/mod.rs
line = 663
migration_id = 69003d2d-9b40-43ee-bbf9-6191edf42842
path = phd_tests::migrate::from_base::migration_from_base_and_back
source = migration_from_base_and_back
source_id = 83cce87f-e41a-4b3d-b92d-e9e33b4623e8
target = phd_framework::test_vm
target_id = 09f415e7-31bc-4241-8e94-119a39e5c09c
|
| 375 | 2026-10-06T00:11:02.495Z | INFO | phd-runner: [VM CLEANUP - START]
file = phd-tests/framework/src/test_vm/mod.rs
line = 1172
path = phd_tests::migrate::from_base::migration_from_base_and_back
target = phd_framework::test_vm
vm = migration_from_base_and_back
vm_id = 83cce87f-e41a-4b3d-b92d-e9e33b4623e8
|
| 376 | 2026-10-06T00:11:02.496Z | INFO | phd-runner: [WAIT_FOR_SERIAL_OUTPUT - START]
file = phd-tests/framework/src/test_vm/mod.rs
line = 913
path = phd_tests::migrate::from_base::migration_from_base_and_back
target = phd_framework::test_vm
vm = migration_from_base_and_back_lifecycle_0
vm_id = 09f415e7-31bc-4241-8e94-119a39e5c09c
|
| 377 | 2026-10-06T00:11:02.496Z | INFO | phd-runner: [WAIT_FOR_SERIAL_OUTPUT - EVENT] Waiting for output on serial console
file = phd-tests/framework/src/test_vm/mod.rs
line = 920
path = phd_tests::migrate::from_base::migration_from_base_and_back
target = phd_framework::test_vm
timeout_duration = Explicit(15s)
vm = migration_from_base_and_back_lifecycle_0
vm_id = 09f415e7-31bc-4241-8e94-119a39e5c09c
|
| 378 | 2026-10-06T00:11:02.497Z | DEBG | phd-runner: [VM CLEANUP - EVENT] Killing Propolis server process
file = phd-tests/framework/src/test_vm/server.rs
line = 177
path = phd_tests::migrate::from_base::migration_from_base_and_back
self.address = 127.0.0.1:9000
target = phd_framework::test_vm::server
vm = migration_from_base_and_back
vm_id = 83cce87f-e41a-4b3d-b92d-e9e33b4623e8
|
| 379 | 2026-10-06T00:11:02.579Z | INFO | phd-runner: [VM CLEANUP - END]
elapsed_milliseconds = 83
file = phd-tests/framework/src/test_vm/mod.rs
line = 1172
path = phd_tests::migrate::from_base::migration_from_base_and_back
target = phd_framework::test_vm
vm = migration_from_base_and_back
vm_id = 83cce87f-e41a-4b3d-b92d-e9e33b4623e8
|
| 380 | 2026-10-06T00:11:02.579Z | INFO | phd-runner: [INSTANCE_ENSURE_INTERNAL - END]
elapsed_milliseconds = 10079
file = phd-tests/framework/src/test_vm/mod.rs
line = 412
path = phd_tests::migrate::from_base::migration_from_base_and_back
target = phd_framework::test_vm
vm = migration_from_base_and_back
vm_id = 83cce87f-e41a-4b3d-b92d-e9e33b4623e8
|
| 381 | 2026-10-06T00:11:02.579Z | INFO | phd-runner: [WAIT_FOR_SERIAL_OUTPUT - END]
elapsed_milliseconds = 83
file = phd-tests/framework/src/test_vm/mod.rs
line = 913
path = phd_tests::migrate::from_base::migration_from_base_and_back
target = phd_framework::test_vm
vm = migration_from_base_and_back_lifecycle_0
vm_id = 09f415e7-31bc-4241-8e94-119a39e5c09c
|
| 382 | 2026-10-06T00:11:02.579Z | INFO | phd-runner: [WAIT_FOR_SERIAL_OUTPUT - START]
file = phd-tests/framework/src/test_vm/mod.rs
line = 913
path = phd_tests::migrate::from_base::migration_from_base_and_back
target = phd_framework::test_vm
vm = migration_from_base_and_back_lifecycle_0
vm_id = 09f415e7-31bc-4241-8e94-119a39e5c09c
|
| 383 | 2026-10-06T00:11:02.579Z | INFO | phd-runner: [WAIT_FOR_SERIAL_OUTPUT - EVENT] Waiting for output on serial console
file = phd-tests/framework/src/test_vm/mod.rs
line = 920
path = phd_tests::migrate::from_base::migration_from_base_and_back
target = phd_framework::test_vm
timeout_duration = Explicit(300s)
vm = migration_from_base_and_back_lifecycle_0
vm_id = 09f415e7-31bc-4241-8e94-119a39e5c09c
|
| 384 | 2026-10-06T00:11:02.607Z | INFO | phd-runner: [WAIT_FOR_SERIAL_OUTPUT - END]
elapsed_milliseconds = 27
file = phd-tests/framework/src/test_vm/mod.rs
line = 913
path = phd_tests::migrate::from_base::migration_from_base_and_back
target = phd_framework::test_vm
vm = migration_from_base_and_back_lifecycle_0
vm_id = 09f415e7-31bc-4241-8e94-119a39e5c09c
|
| 385 | 2026-10-06T00:11:02.607Z | INFO | phd-runner: [TEST - EVENT] migrating to new Propolis artifact for lifecycle test
file = phd-tests/framework/src/lifecycle.rs
line = 73
path = phd_tests::migrate::from_base::migration_from_base_and_back
propolis_artifact = __BASE_PROPOLIS
target = phd_framework::lifecycle
vm_name = migration_from_base_and_back
|
| 386 | 2026-10-06T00:11:02.607Z | INFO | phd-runner: [NEW - START]
file = phd-tests/framework/src/test_vm/mod.rs
line = 300
path = phd_tests::migrate::from_base::migration_from_base_and_back
target = phd_framework::test_vm
|
| 387 | 2026-10-06T00:11:02.607Z | INFO | phd-runner: [NEW - EVENT] phd_framework::test_vm
environment = EnvironmentSpec { location: Local, propolis_artifact: "__BASE_PROPOLIS", metrics: None }
file = phd-tests/framework/src/test_vm/mod.rs
guest_os_kind = Alpine
line = 318
path = phd_tests::migrate::from_base::migration_from_base_and_back
target = phd_framework::test_vm
vm_name = migration_from_base_and_back_lifecycle_1
|
| 388 | 2026-10-06T00:11:02.607Z | DEBG | phd-runner: [NEW - EVENT] Verified artifact already exists
file = phd-tests/framework/src/artifacts/store.rs
line = 45
path = /phd-artifacts/4bf8fc6099e34afbdcfdef6b4e86494863090e3d681d8eb37a4e182353d1c2dd/propolis-server
target = phd_framework::artifacts::store
|
| 389 | 2026-10-06T00:11:02.607Z | INFO | phd-runner: [NEW - EVENT] Launching Propolis server
bootrom_path = "/phd-artifacts/740187046a7267d0de72d3455070333547dbc0ea023531471fb2b2a61effa448/OVMF_CODE.fd"
file = phd-tests/framework/src/test_vm/server.rs
line = 66
path = phd_tests::migrate::from_base::migration_from_base_and_back
server_addr = 127.0.0.1:9004
server_path = "/phd-artifacts/4bf8fc6099e34afbdcfdef6b4e86494863090e3d681d8eb37a4e182353d1c2dd/propolis-server"
target = phd_framework::test_vm::server
|
| 390 | 2026-10-06T00:11:02.607Z | INFO | phd-runner: [NEW - EVENT] Opening server log files
file = phd-tests/framework/src/log_config.rs
line = 84
path = phd_tests::migrate::from_base::migration_from_base_and_back
stderr_path = "/tmp/propolis-phd/phd_tests::migrate::from_base::migration_from_base_and_back/migration_from_base_and_back_lifecycle_1.stderr.log"
stdout_path = "/tmp/propolis-phd/phd_tests::migrate::from_base::migration_from_base_and_back/migration_from_base_and_back_lifecycle_1.stdout.log"
target = phd_framework::log_config
|
| 391 | 2026-10-06T00:11:02.653Z | INFO | phd-runner: [NEW - EVENT] Launched server with pid 940
file = phd-tests/framework/src/test_vm/server.rs
line = 127
path = phd_tests::migrate::from_base::migration_from_base_and_back
target = phd_framework::test_vm::server
|
| 392 | 2026-10-06T00:11:02.667Z | INFO | phd-runner: [NEW - END]
elapsed_milliseconds = 59
file = phd-tests/framework/src/test_vm/mod.rs
line = 300
path = phd_tests::migrate::from_base::migration_from_base_and_back
target = phd_framework::test_vm
|
| 393 | 2026-10-06T00:11:02.667Z | INFO | phd-runner: [MIGRATE_FROM - START]
file = phd-tests/framework/src/test_vm/mod.rs
line = 609
path = phd_tests::migrate::from_base::migration_from_base_and_back
source = migration_from_base_and_back_lifecycle_0
source_id = 09f415e7-31bc-4241-8e94-119a39e5c09c
target = phd_framework::test_vm
target_id = 5dc3d82c-ff27-486c-8d07-9b986fbba421
|
| 394 | 2026-10-06T00:11:02.667Z | INFO | phd-runner: [MIGRATE_FROM - EVENT] Migrating from source at address 127.0.0.1:9002
file = phd-tests/framework/src/test_vm/mod.rs
line = 642
migration_id = 24885384-3f6c-4f16-9e86-938449aa77a1
path = phd_tests::migrate::from_base::migration_from_base_and_back
source = migration_from_base_and_back_lifecycle_0
source_id = 09f415e7-31bc-4241-8e94-119a39e5c09c
target = phd_framework::test_vm
target_id = 5dc3d82c-ff27-486c-8d07-9b986fbba421
timeout_duration = 45s
|
| 395 | 2026-10-06T00:11:02.667Z | INFO | phd-runner: [INSTANCE_ENSURE_INTERNAL - START]
file = phd-tests/framework/src/test_vm/mod.rs
line = 412
path = phd_tests::migrate::from_base::migration_from_base_and_back
source = migration_from_base_and_back_lifecycle_0
source_id = 09f415e7-31bc-4241-8e94-119a39e5c09c
target = phd_framework::test_vm
target_id = 5dc3d82c-ff27-486c-8d07-9b986fbba421
vm = migration_from_base_and_back_lifecycle_1
vm_id = 5dc3d82c-ff27-486c-8d07-9b986fbba421
|
| 396 | 2026-10-06T00:11:02.668Z | INFO | phd-runner: [INSTANCE_ENSURE_INTERNAL - EVENT] retriable error from instance_spec_ensure
e = Communication Error: error sending request for url (http://127.0.0.1:9004/instance)
file = phd-tests/framework/src/test_vm/mod.rs
line = 455
path = phd_tests::migrate::from_base::migration_from_base_and_back
source = migration_from_base_and_back_lifecycle_0
source_id = 09f415e7-31bc-4241-8e94-119a39e5c09c
target = phd_framework::test_vm
target_id = 5dc3d82c-ff27-486c-8d07-9b986fbba421
vm = migration_from_base_and_back_lifecycle_1
vm_id = 5dc3d82c-ff27-486c-8d07-9b986fbba421
|
| 397 | 2026-10-06T00:11:03.251Z | INFO | phd-runner: [INSTANCE_ENSURE_INTERNAL - EVENT] Started instance
file = phd-tests/framework/src/test_vm/mod.rs
instance_description.instance = Instance { properties: InstanceProperties { id: 5dc3d82c-ff27-486c-8d07-9b986fbba421, name: "phd-vm-5dc3d82c-ff27-486c-8d07-9b986fbba421", description: "Pheidippides-managed VM", metadata: InstanceMetadata { silo_id: c8b6148c-57fd-4e78-9e44-1d20465a17ff, project_id: 05227fdf-48a1-4783-bd4f-439aead1bbe0, sled_id: 31dc86a0-9c92-4b87-8572-04e9513e4321, sled_serial: "31dc86a0-9c92-4b87-8572-04e9513e4321", sled_revision: 1, sled_model: "pheidippes" } }, state: Migrating }
line = 514
path = phd_tests::migrate::from_base::migration_from_base_and_back
source = migration_from_base_and_back_lifecycle_0
source_id = 09f415e7-31bc-4241-8e94-119a39e5c09c
target = phd_framework::test_vm
target_id = 5dc3d82c-ff27-486c-8d07-9b986fbba421
vm = migration_from_base_and_back_lifecycle_1
vm_id = 5dc3d82c-ff27-486c-8d07-9b986fbba421
|
| 398 | 2026-10-06T00:11:03.251Z | INFO | phd-runner: [MIGRATE - START]
file = phd-tests/framework/src/test_vm/mod.rs
line = 663
migration_id = 24885384-3f6c-4f16-9e86-938449aa77a1
path = phd_tests::migrate::from_base::migration_from_base_and_back
source = migration_from_base_and_back_lifecycle_0
source_id = 09f415e7-31bc-4241-8e94-119a39e5c09c
target = phd_framework::test_vm
target_id = 5dc3d82c-ff27-486c-8d07-9b986fbba421
|
| 399 | 2026-10-06T00:11:05.791Z | INFO | phd-runner: [SERIAL CONSOLE TASK - EVENT] serial socket control message
file = phd-tests/framework/src/serial/mod.rs
line = 275
s = {"Migrating":{"destination":"127.0.0.1:9004","from_start":7894}}
target = phd_framework::serial
|
| 400 | 2026-10-06T00:11:06.819Z | INFO | phd-runner: [MIGRATE_FROM - EVENT] Migration completed successfully
file = phd-tests/framework/src/test_vm/mod.rs
line = 676
path = phd_tests::migrate::from_base::migration_from_base_and_back
source = migration_from_base_and_back_lifecycle_0
source_id = 09f415e7-31bc-4241-8e94-119a39e5c09c
target = phd_framework::test_vm
target_id = 5dc3d82c-ff27-486c-8d07-9b986fbba421
|
| 401 | 2026-10-06T00:11:06.819Z | INFO | phd-runner: [MIGRATE - END]
elapsed_milliseconds = 3568
file = phd-tests/framework/src/test_vm/mod.rs
line = 663
migration_id = 24885384-3f6c-4f16-9e86-938449aa77a1
path = phd_tests::migrate::from_base::migration_from_base_and_back
source = migration_from_base_and_back_lifecycle_0
source_id = 09f415e7-31bc-4241-8e94-119a39e5c09c
target = phd_framework::test_vm
target_id = 5dc3d82c-ff27-486c-8d07-9b986fbba421
|
| 402 | 2026-10-06T00:11:06.823Z | INFO | phd-runner: [VM CLEANUP - START]
file = phd-tests/framework/src/test_vm/mod.rs
line = 1172
path = phd_tests::migrate::from_base::migration_from_base_and_back
target = phd_framework::test_vm
vm = migration_from_base_and_back_lifecycle_0
vm_id = 09f415e7-31bc-4241-8e94-119a39e5c09c
|
| 403 | 2026-10-06T00:11:06.823Z | INFO | phd-runner: [WAIT_FOR_SERIAL_OUTPUT - START]
file = phd-tests/framework/src/test_vm/mod.rs
line = 913
path = phd_tests::migrate::from_base::migration_from_base_and_back
target = phd_framework::test_vm
vm = migration_from_base_and_back_lifecycle_1
vm_id = 5dc3d82c-ff27-486c-8d07-9b986fbba421
|
| 404 | 2026-10-06T00:11:06.823Z | INFO | phd-runner: [WAIT_FOR_SERIAL_OUTPUT - EVENT] Waiting for output on serial console
file = phd-tests/framework/src/test_vm/mod.rs
line = 920
path = phd_tests::migrate::from_base::migration_from_base_and_back
target = phd_framework::test_vm
timeout_duration = Explicit(15s)
vm = migration_from_base_and_back_lifecycle_1
vm_id = 5dc3d82c-ff27-486c-8d07-9b986fbba421
|
| 405 | 2026-10-06T00:11:06.824Z | DEBG | phd-runner: [VM CLEANUP - EVENT] Killing Propolis server process
file = phd-tests/framework/src/test_vm/server.rs
line = 177
path = phd_tests::migrate::from_base::migration_from_base_and_back
self.address = 127.0.0.1:9002
target = phd_framework::test_vm::server
vm = migration_from_base_and_back_lifecycle_0
vm_id = 09f415e7-31bc-4241-8e94-119a39e5c09c
|
| 406 | 2026-10-06T00:11:06.909Z | INFO | phd-runner: [VM CLEANUP - END]
elapsed_milliseconds = 86
file = phd-tests/framework/src/test_vm/mod.rs
line = 1172
path = phd_tests::migrate::from_base::migration_from_base_and_back
target = phd_framework::test_vm
vm = migration_from_base_and_back_lifecycle_0
vm_id = 09f415e7-31bc-4241-8e94-119a39e5c09c
|
| 407 | 2026-10-06T00:11:06.910Z | INFO | phd-runner: [INSTANCE_ENSURE_INTERNAL - END]
elapsed_milliseconds = 8751
file = phd-tests/framework/src/test_vm/mod.rs
line = 412
path = phd_tests::migrate::from_base::migration_from_base_and_back
source = migration_from_base_and_back
source_id = 83cce87f-e41a-4b3d-b92d-e9e33b4623e8
target = phd_framework::test_vm
target_id = 09f415e7-31bc-4241-8e94-119a39e5c09c
vm = migration_from_base_and_back_lifecycle_0
vm_id = 09f415e7-31bc-4241-8e94-119a39e5c09c
|
| 408 | 2026-10-06T00:11:06.910Z | INFO | phd-runner: [MIGRATE_FROM - END]
elapsed_milliseconds = 8751
file = phd-tests/framework/src/test_vm/mod.rs
line = 609
path = phd_tests::migrate::from_base::migration_from_base_and_back
source = migration_from_base_and_back
source_id = 83cce87f-e41a-4b3d-b92d-e9e33b4623e8
target = phd_framework::test_vm
target_id = 09f415e7-31bc-4241-8e94-119a39e5c09c
|
| 409 | 2026-10-06T00:11:07.936Z | INFO | phd-runner: [WAIT_FOR_SERIAL_OUTPUT - END]
elapsed_milliseconds = 1113
file = phd-tests/framework/src/test_vm/mod.rs
line = 913
path = phd_tests::migrate::from_base::migration_from_base_and_back
target = phd_framework::test_vm
vm = migration_from_base_and_back_lifecycle_1
vm_id = 5dc3d82c-ff27-486c-8d07-9b986fbba421
|
| 410 | 2026-10-06T00:11:07.937Z | INFO | phd-runner: [WAIT_FOR_SERIAL_OUTPUT - START]
file = phd-tests/framework/src/test_vm/mod.rs
line = 913
path = phd_tests::migrate::from_base::migration_from_base_and_back
target = phd_framework::test_vm
vm = migration_from_base_and_back_lifecycle_1
vm_id = 5dc3d82c-ff27-486c-8d07-9b986fbba421
|
| 411 | 2026-10-06T00:11:07.937Z | INFO | phd-runner: [WAIT_FOR_SERIAL_OUTPUT - EVENT] Waiting for output on serial console
file = phd-tests/framework/src/test_vm/mod.rs
line = 920
path = phd_tests::migrate::from_base::migration_from_base_and_back
target = phd_framework::test_vm
timeout_duration = Explicit(300s)
vm = migration_from_base_and_back_lifecycle_1
vm_id = 5dc3d82c-ff27-486c-8d07-9b986fbba421
|
| 412 | 2026-10-06T00:11:07.970Z | INFO | phd-runner: [WAIT_FOR_SERIAL_OUTPUT - END]
elapsed_milliseconds = 33
file = phd-tests/framework/src/test_vm/mod.rs
line = 913
path = phd_tests::migrate::from_base::migration_from_base_and_back
target = phd_framework::test_vm
vm = migration_from_base_and_back_lifecycle_1
vm_id = 5dc3d82c-ff27-486c-8d07-9b986fbba421
|
| 413 | 2026-10-06T00:11:07.971Z | INFO | phd-runner: [TEST - EVENT] migrating to new Propolis artifact for lifecycle test
file = phd-tests/framework/src/lifecycle.rs
line = 73
path = phd_tests::migrate::from_base::migration_from_base_and_back
propolis_artifact = __DEFAULT_PROPOLIS
target = phd_framework::lifecycle
vm_name = migration_from_base_and_back
|
| 414 | 2026-10-06T00:11:07.971Z | INFO | phd-runner: [NEW - START]
file = phd-tests/framework/src/test_vm/mod.rs
line = 300
path = phd_tests::migrate::from_base::migration_from_base_and_back
target = phd_framework::test_vm
|
| 415 | 2026-10-06T00:11:07.971Z | INFO | phd-runner: [NEW - EVENT] phd_framework::test_vm
environment = EnvironmentSpec { location: Local, propolis_artifact: "__DEFAULT_PROPOLIS", metrics: None }
file = phd-tests/framework/src/test_vm/mod.rs
guest_os_kind = Alpine
line = 318
path = phd_tests::migrate::from_base::migration_from_base_and_back
target = phd_framework::test_vm
vm_name = migration_from_base_and_back_lifecycle_2
|
| 416 | 2026-10-06T00:11:07.971Z | DEBG | phd-runner: [NEW - EVENT] Verified artifact already exists
file = phd-tests/framework/src/artifacts/store.rs
line = 45
path = /work/phd-test/propolis-server
target = phd_framework::artifacts::store
|
| 417 | 2026-10-06T00:11:07.971Z | INFO | phd-runner: [NEW - EVENT] Launching Propolis server
bootrom_path = "/phd-artifacts/740187046a7267d0de72d3455070333547dbc0ea023531471fb2b2a61effa448/OVMF_CODE.fd"
file = phd-tests/framework/src/test_vm/server.rs
line = 66
path = phd_tests::migrate::from_base::migration_from_base_and_back
server_addr = 127.0.0.1:9006
server_path = "/work/phd-test/propolis-server"
target = phd_framework::test_vm::server
|
| 418 | 2026-10-06T00:11:07.971Z | INFO | phd-runner: [NEW - EVENT] Opening server log files
file = phd-tests/framework/src/log_config.rs
line = 84
path = phd_tests::migrate::from_base::migration_from_base_and_back
stderr_path = "/tmp/propolis-phd/phd_tests::migrate::from_base::migration_from_base_and_back/migration_from_base_and_back_lifecycle_2.stderr.log"
stdout_path = "/tmp/propolis-phd/phd_tests::migrate::from_base::migration_from_base_and_back/migration_from_base_and_back_lifecycle_2.stdout.log"
target = phd_framework::log_config
|
| 419 | 2026-10-06T00:11:08.017Z | INFO | phd-runner: [NEW - EVENT] Launched server with pid 942
file = phd-tests/framework/src/test_vm/server.rs
line = 127
path = phd_tests::migrate::from_base::migration_from_base_and_back
target = phd_framework::test_vm::server
|
| 420 | 2026-10-06T00:11:08.031Z | INFO | phd-runner: [NEW - END]
elapsed_milliseconds = 60
file = phd-tests/framework/src/test_vm/mod.rs
line = 300
path = phd_tests::migrate::from_base::migration_from_base_and_back
target = phd_framework::test_vm
|
| 421 | 2026-10-06T00:11:08.031Z | INFO | phd-runner: [MIGRATE_FROM - START]
file = phd-tests/framework/src/test_vm/mod.rs
line = 609
path = phd_tests::migrate::from_base::migration_from_base_and_back
source = migration_from_base_and_back_lifecycle_1
source_id = 5dc3d82c-ff27-486c-8d07-9b986fbba421
target = phd_framework::test_vm
target_id = 0d8bc8f8-6712-497f-8d9b-676f55fa8a45
|
| 422 | 2026-10-06T00:11:08.031Z | INFO | phd-runner: [MIGRATE_FROM - EVENT] Migrating from source at address 127.0.0.1:9004
file = phd-tests/framework/src/test_vm/mod.rs
line = 642
migration_id = eb79e425-ddd0-4e4d-b251-6258dcd21a1d
path = phd_tests::migrate::from_base::migration_from_base_and_back
source = migration_from_base_and_back_lifecycle_1
source_id = 5dc3d82c-ff27-486c-8d07-9b986fbba421
target = phd_framework::test_vm
target_id = 0d8bc8f8-6712-497f-8d9b-676f55fa8a45
timeout_duration = 45s
|
| 423 | 2026-10-06T00:11:08.031Z | INFO | phd-runner: [INSTANCE_ENSURE_INTERNAL - START]
file = phd-tests/framework/src/test_vm/mod.rs
line = 412
path = phd_tests::migrate::from_base::migration_from_base_and_back
source = migration_from_base_and_back_lifecycle_1
source_id = 5dc3d82c-ff27-486c-8d07-9b986fbba421
target = phd_framework::test_vm
target_id = 0d8bc8f8-6712-497f-8d9b-676f55fa8a45
vm = migration_from_base_and_back_lifecycle_2
vm_id = 0d8bc8f8-6712-497f-8d9b-676f55fa8a45
|
| 424 | 2026-10-06T00:11:08.032Z | INFO | phd-runner: [INSTANCE_ENSURE_INTERNAL - EVENT] retriable error from instance_spec_ensure
e = Communication Error: error sending request for url (http://127.0.0.1:9006/instance)
file = phd-tests/framework/src/test_vm/mod.rs
line = 455
path = phd_tests::migrate::from_base::migration_from_base_and_back
source = migration_from_base_and_back_lifecycle_1
source_id = 5dc3d82c-ff27-486c-8d07-9b986fbba421
target = phd_framework::test_vm
target_id = 0d8bc8f8-6712-497f-8d9b-676f55fa8a45
vm = migration_from_base_and_back_lifecycle_2
vm_id = 0d8bc8f8-6712-497f-8d9b-676f55fa8a45
|
| 425 | 2026-10-06T00:11:08.755Z | INFO | phd-runner: [INSTANCE_ENSURE_INTERNAL - EVENT] Started instance
file = phd-tests/framework/src/test_vm/mod.rs
instance_description.instance = Instance { properties: InstanceProperties { id: 0d8bc8f8-6712-497f-8d9b-676f55fa8a45, name: "phd-vm-0d8bc8f8-6712-497f-8d9b-676f55fa8a45", description: "Pheidippides-managed VM", metadata: InstanceMetadata { silo_id: c8b6148c-57fd-4e78-9e44-1d20465a17ff, project_id: 05227fdf-48a1-4783-bd4f-439aead1bbe0, sled_id: c9a9f71b-a48f-4ef5-8b30-7945e2d213d9, sled_serial: "c9a9f71b-a48f-4ef5-8b30-7945e2d213d9", sled_revision: 1, sled_model: "pheidippes" } }, state: Migrating }
line = 514
path = phd_tests::migrate::from_base::migration_from_base_and_back
source = migration_from_base_and_back_lifecycle_1
source_id = 5dc3d82c-ff27-486c-8d07-9b986fbba421
target = phd_framework::test_vm
target_id = 0d8bc8f8-6712-497f-8d9b-676f55fa8a45
vm = migration_from_base_and_back_lifecycle_2
vm_id = 0d8bc8f8-6712-497f-8d9b-676f55fa8a45
|
| 426 | 2026-10-06T00:11:08.755Z | INFO | phd-runner: [MIGRATE - START]
file = phd-tests/framework/src/test_vm/mod.rs
line = 663
migration_id = eb79e425-ddd0-4e4d-b251-6258dcd21a1d
path = phd_tests::migrate::from_base::migration_from_base_and_back
source = migration_from_base_and_back_lifecycle_1
source_id = 5dc3d82c-ff27-486c-8d07-9b986fbba421
target = phd_framework::test_vm
target_id = 0d8bc8f8-6712-497f-8d9b-676f55fa8a45
|
| 427 | 2026-10-06T00:11:11.300Z | INFO | phd-runner: [SERIAL CONSOLE TASK - EVENT] serial socket control message
file = phd-tests/framework/src/serial/mod.rs
line = 275
s = {"Migrating":{"destination":"127.0.0.1:9006","from_start":7941}}
target = phd_framework::serial
|
| 428 | 2026-10-06T00:11:13.407Z | INFO | phd-runner: [MIGRATE_FROM - EVENT] Migration completed successfully
file = phd-tests/framework/src/test_vm/mod.rs
line = 676
path = phd_tests::migrate::from_base::migration_from_base_and_back
source = migration_from_base_and_back_lifecycle_1
source_id = 5dc3d82c-ff27-486c-8d07-9b986fbba421
target = phd_framework::test_vm
target_id = 0d8bc8f8-6712-497f-8d9b-676f55fa8a45
|
| 429 | 2026-10-06T00:11:13.407Z | INFO | phd-runner: [MIGRATE - END]
elapsed_milliseconds = 4651
file = phd-tests/framework/src/test_vm/mod.rs
line = 663
migration_id = eb79e425-ddd0-4e4d-b251-6258dcd21a1d
path = phd_tests::migrate::from_base::migration_from_base_and_back
source = migration_from_base_and_back_lifecycle_1
source_id = 5dc3d82c-ff27-486c-8d07-9b986fbba421
target = phd_framework::test_vm
target_id = 0d8bc8f8-6712-497f-8d9b-676f55fa8a45
|
| 430 | 2026-10-06T00:11:13.410Z | INFO | phd-runner: [VM CLEANUP - START]
file = phd-tests/framework/src/test_vm/mod.rs
line = 1172
path = phd_tests::migrate::from_base::migration_from_base_and_back
target = phd_framework::test_vm
vm = migration_from_base_and_back_lifecycle_1
vm_id = 5dc3d82c-ff27-486c-8d07-9b986fbba421
|
| 431 | 2026-10-06T00:11:13.410Z | INFO | phd-runner: [WAIT_FOR_SERIAL_OUTPUT - START]
file = phd-tests/framework/src/test_vm/mod.rs
line = 913
path = phd_tests::migrate::from_base::migration_from_base_and_back
target = phd_framework::test_vm
vm = migration_from_base_and_back_lifecycle_2
vm_id = 0d8bc8f8-6712-497f-8d9b-676f55fa8a45
|
| 432 | 2026-10-06T00:11:13.410Z | INFO | phd-runner: [WAIT_FOR_SERIAL_OUTPUT - EVENT] Waiting for output on serial console
file = phd-tests/framework/src/test_vm/mod.rs
line = 920
path = phd_tests::migrate::from_base::migration_from_base_and_back
target = phd_framework::test_vm
timeout_duration = Explicit(15s)
vm = migration_from_base_and_back_lifecycle_2
vm_id = 0d8bc8f8-6712-497f-8d9b-676f55fa8a45
|
| 433 | 2026-10-06T00:11:13.412Z | DEBG | phd-runner: [VM CLEANUP - EVENT] Killing Propolis server process
file = phd-tests/framework/src/test_vm/server.rs
line = 177
path = phd_tests::migrate::from_base::migration_from_base_and_back
self.address = 127.0.0.1:9004
target = phd_framework::test_vm::server
vm = migration_from_base_and_back_lifecycle_1
vm_id = 5dc3d82c-ff27-486c-8d07-9b986fbba421
|
| 434 | 2026-10-06T00:11:13.490Z | INFO | phd-runner: [VM CLEANUP - END]
elapsed_milliseconds = 79
file = phd-tests/framework/src/test_vm/mod.rs
line = 1172
path = phd_tests::migrate::from_base::migration_from_base_and_back
target = phd_framework::test_vm
vm = migration_from_base_and_back_lifecycle_1
vm_id = 5dc3d82c-ff27-486c-8d07-9b986fbba421
|
| 435 | 2026-10-06T00:11:13.490Z | INFO | phd-runner: [WAIT_FOR_SERIAL_OUTPUT - END]
elapsed_milliseconds = 80
file = phd-tests/framework/src/test_vm/mod.rs
line = 913
path = phd_tests::migrate::from_base::migration_from_base_and_back
target = phd_framework::test_vm
vm = migration_from_base_and_back_lifecycle_2
vm_id = 0d8bc8f8-6712-497f-8d9b-676f55fa8a45
|
| 436 | 2026-10-06T00:11:13.490Z | INFO | phd-runner: [INSTANCE_ENSURE_INTERNAL - END]
elapsed_milliseconds = 10823
file = phd-tests/framework/src/test_vm/mod.rs
line = 412
path = phd_tests::migrate::from_base::migration_from_base_and_back
source = migration_from_base_and_back_lifecycle_0
source_id = 09f415e7-31bc-4241-8e94-119a39e5c09c
target = phd_framework::test_vm
target_id = 5dc3d82c-ff27-486c-8d07-9b986fbba421
vm = migration_from_base_and_back_lifecycle_1
vm_id = 5dc3d82c-ff27-486c-8d07-9b986fbba421
|
| 437 | 2026-10-06T00:11:13.491Z | INFO | phd-runner: [WAIT_FOR_SERIAL_OUTPUT - START]
file = phd-tests/framework/src/test_vm/mod.rs
line = 913
path = phd_tests::migrate::from_base::migration_from_base_and_back
target = phd_framework::test_vm
vm = migration_from_base_and_back_lifecycle_2
vm_id = 0d8bc8f8-6712-497f-8d9b-676f55fa8a45
|
| 438 | 2026-10-06T00:11:13.491Z | INFO | phd-runner: [MIGRATE_FROM - END]
elapsed_milliseconds = 10823
file = phd-tests/framework/src/test_vm/mod.rs
line = 609
path = phd_tests::migrate::from_base::migration_from_base_and_back
source = migration_from_base_and_back_lifecycle_0
source_id = 09f415e7-31bc-4241-8e94-119a39e5c09c
target = phd_framework::test_vm
target_id = 5dc3d82c-ff27-486c-8d07-9b986fbba421
|
| 439 | 2026-10-06T00:11:13.491Z | INFO | phd-runner: [WAIT_FOR_SERIAL_OUTPUT - EVENT] Waiting for output on serial console
file = phd-tests/framework/src/test_vm/mod.rs
line = 920
path = phd_tests::migrate::from_base::migration_from_base_and_back
target = phd_framework::test_vm
timeout_duration = Explicit(300s)
vm = migration_from_base_and_back_lifecycle_2
vm_id = 0d8bc8f8-6712-497f-8d9b-676f55fa8a45
|
| 440 | 2026-10-06T00:11:13.521Z | INFO | phd-runner: [WAIT_FOR_SERIAL_OUTPUT - END]
elapsed_milliseconds = 30
file = phd-tests/framework/src/test_vm/mod.rs
line = 913
path = phd_tests::migrate::from_base::migration_from_base_and_back
target = phd_framework::test_vm
vm = migration_from_base_and_back_lifecycle_2
vm_id = 0d8bc8f8-6712-497f-8d9b-676f55fa8a45
|
| 441 | 2026-10-06T00:11:13.521Z | INFO | phd-runner: [VM CLEANUP - START]
file = phd-tests/framework/src/test_vm/mod.rs
line = 1172
path = phd_tests::migrate::from_base::migration_from_base_and_back
target = phd_framework::test_vm
vm = migration_from_base_and_back_lifecycle_2
vm_id = 0d8bc8f8-6712-497f-8d9b-676f55fa8a45
|
| 442 | 2026-10-06T00:11:13.521Z | DEBG | phd-runner: [SERIAL CONSOLE TASK - EVENT] serial console command channel was closed
file = phd-tests/framework/src/serial/mod.rs
line = 213
target = phd_framework::serial
|
| 443 | 2026-10-06T00:11:13.521Z | INFO | phd-runner: [SERIAL CONSOLE TASK - END]
elapsed_milliseconds = 20349
file = phd-tests/framework/src/serial/mod.rs
line = 200
target = phd_framework::serial
|
| 444 | 2026-10-06T00:11:13.522Z | INFO | phd-runner: test phd_tests::migrate::from_base::migration_from_base_and_back ... ok
file = phd-tests/runner/src/execute.rs
line = 141
target = phd_runner::execute
|
| 445 | 2026-10-06T00:11:13.522Z | INFO | phd-runner: [TEST_CLEANUP - START]
file = phd-tests/runner/src/fixtures.rs
line = 51
target = phd_runner::fixtures
|
| 446 | 2026-10-06T00:11:13.523Z | DEBG | phd-runner: [VM CLEANUP - EVENT] trying to ensure Propolis server VM is destroyed
file = phd-tests/framework/src/test_vm/mod.rs
line = 1195
path = phd_tests::migrate::from_base::migration_from_base_and_back
target = phd_framework::test_vm
vm = migration_from_base_and_back_lifecycle_2
vm_id = 0d8bc8f8-6712-497f-8d9b-676f55fa8a45
|
| 447 | 2026-10-06T00:11:14.268Z | DEBG | phd-runner: [VM CLEANUP - EVENT] Killing Propolis server process
file = phd-tests/framework/src/test_vm/server.rs
line = 177
path = phd_tests::migrate::from_base::migration_from_base_and_back
self.address = 127.0.0.1:9006
target = phd_framework::test_vm::server
vm = migration_from_base_and_back_lifecycle_2
vm_id = 0d8bc8f8-6712-497f-8d9b-676f55fa8a45
|
| 448 | 2026-10-06T00:11:14.359Z | DEBG | phd-runner: [VM CLEANUP - EVENT] zfs clone dropped
file = phd-tests/framework/src/zfs.rs
line = 83
path = phd_tests::migrate::from_base::migration_from_base_and_back
target = phd_framework::zfs
vm = migration_from_base_and_back_lifecycle_2
vm_id = 0d8bc8f8-6712-497f-8d9b-676f55fa8a45
|
| 449 | 2026-10-06T00:11:14.359Z | DEBG | phd-runner: [VM CLEANUP - EVENT] executing ZFS command
args = ["phd-artifacts/phd-clone-1c4c4b95-cd28-4cdd-8e98-2a81e45ae84c"]
file = phd-tests/framework/src/zfs.rs
line = 304
path = phd_tests::migrate::from_base::migration_from_base_and_back
target = phd_framework::zfs
verb = destroy
vm = migration_from_base_and_back_lifecycle_2
vm_id = 0d8bc8f8-6712-497f-8d9b-676f55fa8a45
|
| 450 | 2026-10-06T00:11:14.387Z | DEBG | phd-runner: [VM CLEANUP - EVENT] zfs snapshot dropped
file = phd-tests/framework/src/zfs.rs
line = 57
path = phd_tests::migrate::from_base::migration_from_base_and_back
target = phd_framework::zfs
vm = migration_from_base_and_back_lifecycle_2
vm_id = 0d8bc8f8-6712-497f-8d9b-676f55fa8a45
|
| 451 | 2026-10-06T00:11:14.387Z | DEBG | phd-runner: [VM CLEANUP - EVENT] executing ZFS command
args = ["phd-artifacts@phd-5a99ad08-9765-4dde-8fc3-f23610d1fb3d"]
file = phd-tests/framework/src/zfs.rs
line = 304
path = phd_tests::migrate::from_base::migration_from_base_and_back
target = phd_framework::zfs
verb = destroy
vm = migration_from_base_and_back_lifecycle_2
vm_id = 0d8bc8f8-6712-497f-8d9b-676f55fa8a45
|
| 452 | 2026-10-06T00:11:14.406Z | INFO | phd-runner: [VM CLEANUP - END]
elapsed_milliseconds = 884
file = phd-tests/framework/src/test_vm/mod.rs
line = 1172
path = phd_tests::migrate::from_base::migration_from_base_and_back
target = phd_framework::test_vm
vm = migration_from_base_and_back_lifecycle_2
vm_id = 0d8bc8f8-6712-497f-8d9b-676f55fa8a45
|
| 453 | 2026-10-06T00:11:14.406Z | INFO | phd-runner: [TEST_CLEANUP - END]
elapsed_milliseconds = 884
file = phd-tests/runner/src/fixtures.rs
line = 51
target = phd_runner::fixtures
|
| 454 | 2026-10-06T00:11:14.406Z | INFO | phd-runner: [INSTANCE_ENSURE_INTERNAL - END]
elapsed_milliseconds = 6375
file = phd-tests/framework/src/test_vm/mod.rs
line = 412
path = phd_tests::migrate::from_base::migration_from_base_and_back
source = migration_from_base_and_back_lifecycle_1
source_id = 5dc3d82c-ff27-486c-8d07-9b986fbba421
target = phd_framework::test_vm
target_id = 0d8bc8f8-6712-497f-8d9b-676f55fa8a45
vm = migration_from_base_and_back_lifecycle_2
vm_id = 0d8bc8f8-6712-497f-8d9b-676f55fa8a45
|
| 455 | 2026-10-06T00:11:14.407Z | INFO | phd-runner: [EXECUTION_CLEANUP - START]
file = phd-tests/runner/src/fixtures.rs
line = 35
target = phd_runner::fixtures
|
| 456 | 2026-10-06T00:11:14.407Z | INFO | phd-runner: [MIGRATE_FROM - END]
elapsed_milliseconds = 6375
file = phd-tests/framework/src/test_vm/mod.rs
line = 609
path = phd_tests::migrate::from_base::migration_from_base_and_back
source = migration_from_base_and_back_lifecycle_1
source_id = 5dc3d82c-ff27-486c-8d07-9b986fbba421
target = phd_framework::test_vm
target_id = 0d8bc8f8-6712-497f-8d9b-676f55fa8a45
|
| 457 | 2026-10-06T00:11:14.407Z | INFO | phd-runner: [EXECUTION_CLEANUP - END]
elapsed_milliseconds = 0
file = phd-tests/runner/src/fixtures.rs
line = 35
target = phd_runner::fixtures
|
| 458 | 2026-10-06T00:11:14.407Z | INFO | phd-runner: [TEST - END]
elapsed_milliseconds = 22030
file = phd-tests/tests/src/migrate.rs
line = 52
path = phd_tests::migrate::from_base::migration_from_base_and_back
target = phd_tests::migrate::from_base
|
| 459 | | test result: ok. 3 passed; 0 failed; 0 skipped; 0 not run; finished in 93.06s |
| 460 | | |
| 461 | 2026-10-06T00:11:14.408Z | DEBG | phd-runner: phd_runner
exit_code = 0
file = phd-tests/runner/src/main.rs
line = 41
target = phd_runner
|