Max level shown:
12026-10-08T20:47:06.682ZINFOphd-runner: phd_runner file = phd-tests/runner/src/main.rs line = 36 runner_args = ProcessArgs { command: Run(RunOptions { propolis_server_cmd: "/work/phd-test/propolis-server", base_propolis_branch: Some("master"), base_propolis_commit: None, base_propolis_cmd: None, crucible_downstairs_cmd: None, crucible_downstairs_commit: Some(Auto), tmp_directory: "/tmp/propolis-phd", artifact_directory: Some("/phd-artifacts"), output_mode: TmpFile, default_guest_cpus: 2, default_guest_memory_mib: 512, artifact_toml_path: "/work/phd-test/artifacts.toml", default_guest_artifact: "alpine", default_bootrom_artifact: "ovmf", include_filter: ["phd_tests::migrate::from_base"], exclude_filter: [], max_buildomat_wait_secs: 1200, manual_stop_on_failure: false }), disable_ansi: false, emit_bunyan: true } target = phd_runner
22026-10-08T20:47:06.708ZDEBGphd-runner: Created new artifact store from manifest file = phd-tests/framework/src/artifacts/store.rs line = 219 store = Store { local_dir: "/phd-artifacts", artifacts: {"alpine": Mutex { data: StoredArtifact { description: Artifact { filename: "alpine.iso", kind: GuestOs(Alpine), source: RemoteServer { sha256: "ba8007f74f9b54fbae3b2520da577831b4834778a498d732f091260c61aa7ca1" }, untar: None }, cached_path: None } }, "ovmf": Mutex { data: StoredArtifact { description: Artifact { filename: "OVMF_CODE.fd", kind: Bootrom, source: Buildomat(BuildomatArtifact { repo: Repo("oxidecomputer/edk2"), series: Series("image_debug"), commit: Commit("bf64f45b1a58e69d126a3c6ca1e4512c88668132"), sha256: "740187046a7267d0de72d3455070333547dbc0ea023531471fb2b2a61effa448" }), untar: None }, cached_path: None } }}, downloader: DownloadConfig { timeout: 600s, buildomat_backoff: ExponentialBackoff { current_interval: 1s, initial_interval: 1s, randomization_factor: 0.5, multiplier: 1.5, max_interval: 60s, start_time: Instant { tv_sec: 252, tv_nsec: 872207369 }, max_elapsed_time: Some(1200s), clock: SystemClock }, remote_server_uris: ["https://oxide-omicron-build.s3.amazonaws.com"] } } target = phd_framework::artifacts::store
32026-10-08T20:47:06.709ZINFOphd-runner: Adding Propolis server from local command file = phd-tests/framework/src/artifacts/store.rs line = 227 propolis_server_cmd = /work/phd-test/propolis-server target = phd_framework::artifacts::store
42026-10-08T20:47:06.710ZINFOphd-runner: Adding crucible-downstairs from Buildomat Git revision commit = bd62980710dd3d6d3524aa7f6617127942b75002 file = phd-tests/framework/src/artifacts/store.rs line = 311 target = phd_framework::artifacts::store
52026-10-08T20:47:06.716ZDEBGphd-runner: Downloading file from Buildomat... file = phd-tests/framework/src/artifacts/buildomat.rs line = 215 target = phd_framework::artifacts::buildomat timeout = 600s uri = https://buildomat.eng.oxide.computer/public/file/oxidecomputer/crucible/nightly-image/bd62980710dd3d6d3524aa7f6617127942b75002/crucible-nightly.sha256.txt
62026-10-08T20:47:07.020ZINFOphd-runner: Adding 'current' Propolis server from Buildomat Git branch 'master' file = phd-tests/framework/src/artifacts/store.rs line = 248 target = phd_framework::artifacts::store
72026-10-08T20:47:07.756ZDEBGphd-runner: Downloading file from Buildomat... file = phd-tests/framework/src/artifacts/buildomat.rs line = 215 target = phd_framework::artifacts::buildomat timeout = 600s uri = https://buildomat.eng.oxide.computer/public/file/oxidecomputer/propolis/phd_build/deb9b5a9f3e586aee361b5e138fca0fa463c26c7/propolis-server.sha256.txt
82026-10-08T20:47:07.923ZINFOphd-runner: [EXECUTION_SETUP - START] file = phd-tests/runner/src/fixtures.rs line = 25 target = phd_runner::fixtures
92026-10-08T20:47:07.924ZINFOphd-runner: [EXECUTION_SETUP - END] elapsed_milliseconds = 0 file = phd-tests/runner/src/fixtures.rs line = 25 target = phd_runner::fixtures
102026-10-08T20:47:07.926ZINFOphd-runner: Running 3 test(s) file = phd-tests/runner/src/execute.rs line = 83 target = phd_runner::execute
112026-10-08T20:47:07.927ZINFOphd-runner: Starting test phd_tests::migrate::from_base::serial_history file = phd-tests/runner/src/execute.rs line = 91 target = phd_runner::execute
122026-10-08T20:47:07.927ZINFOphd-runner: [TEST_SETUP - START] file = phd-tests/runner/src/fixtures.rs line = 41 target = phd_runner::fixtures
132026-10-08T20:47:07.927ZINFOphd-runner: [TEST_SETUP - END] elapsed_milliseconds = 0 file = phd-tests/runner/src/fixtures.rs line = 41 target = phd_runner::fixtures
142026-10-08T20:47:07.929ZINFOphd-runner: [TEST - START] file = phd-tests/tests/src/migrate.rs line = 40 path = phd_tests::migrate::from_base::serial_history target = phd_tests::migrate::from_base
152026-10-08T20:47:07.931ZDEBGphd-runner: [TEST - EVENT] checking for existing copy of artifact file = phd-tests/framework/src/artifacts/store.rs line = 89 maybe_path = /phd-artifacts/740187046a7267d0de72d3455070333547dbc0ea023531471fb2b2a61effa448/OVMF_CODE.fd path = phd_tests::migrate::from_base::serial_history target = phd_framework::artifacts::store
162026-10-08T20:47:07.933ZDEBGphd-runner: [TEST - EVENT] Downloading file from Buildomat... file = phd-tests/framework/src/artifacts/buildomat.rs line = 215 path = phd_tests::migrate::from_base::serial_history target = phd_framework::artifacts::buildomat timeout = 600s uri = https://buildomat.eng.oxide.computer/public/file/oxidecomputer/edk2/image_debug/bf64f45b1a58e69d126a3c6ca1e4512c88668132/OVMF_CODE.fd
172026-10-08T20:47:08.442ZDEBGphd-runner: [TEST - EVENT] checking for existing copy of artifact file = phd-tests/framework/src/artifacts/store.rs line = 89 maybe_path = /phd-artifacts/ba8007f74f9b54fbae3b2520da577831b4834778a498d732f091260c61aa7ca1/alpine.iso path = phd_tests::migrate::from_base::serial_history target = phd_framework::artifacts::store
182026-10-08T20:47:08.455ZDEBGphd-runner: [TEST - EVENT] Downloading alpine.iso from https://oxide-omicron-build.s3.amazonaws.com/alpine.iso file = phd-tests/framework/src/artifacts/store.rs line = 614 path = phd_tests::migrate::from_base::serial_history target = phd_framework::artifacts::store timeout = 600s
192026-10-08T20:47:15.217ZDEBGphd-runner: [TEST - EVENT] Verified artifact already exists file = phd-tests/framework/src/artifacts/store.rs line = 45 path = /phd-artifacts/ba8007f74f9b54fbae3b2520da577831b4834778a498d732f091260c61aa7ca1/alpine.iso target = phd_framework::artifacts::store
202026-10-08T20:47:15.217ZDEBGphd-runner: [TEST - EVENT] executing ZFS command args = ["/phd-artifacts/ba8007f74f9b54fbae3b2520da577831b4834778a498d732f091260c61aa7ca1/alpine.iso"] file = phd-tests/framework/src/zfs.rs line = 304 path = phd_tests::migrate::from_base::serial_history target = phd_framework::zfs verb = list
212026-10-08T20:47:15.233ZDEBGphd-runner: [TEST - EVENT] parsing zfs list output file = phd-tests/framework/src/zfs.rs line = 238 path = phd_tests::migrate::from_base::serial_history stdout = NAME USED AVAIL REFER MOUNTPOINT\nphd-artifacts 3.90M 25.3T 2M /phd-artifacts\n target = phd_framework::zfs
222026-10-08T20:47:15.235ZDEBGphd-runner: [TEST - EVENT] executing ZFS command args = ["phd-artifacts@phd-8ae3c52a-4b40-4373-a143-bc445fc5f461"] file = phd-tests/framework/src/zfs.rs line = 304 path = phd_tests::migrate::from_base::serial_history target = phd_framework::zfs verb = snapshot
232026-10-08T20:47:15.256ZDEBGphd-runner: [TEST - EVENT] executing ZFS command args = ["phd-artifacts@phd-8ae3c52a-4b40-4373-a143-bc445fc5f461", "phd-artifacts/phd-clone-ab71c805-56cf-42ce-bcbb-e1713b73edc1"] file = phd-tests/framework/src/zfs.rs line = 304 path = phd_tests::migrate::from_base::serial_history target = phd_framework::zfs verb = clone
242026-10-08T20:47:15.273ZDEBGphd-runner: [TEST - EVENT] executing ZFS command args = ["phd-artifacts/phd-clone-ab71c805-56cf-42ce-bcbb-e1713b73edc1"] file = phd-tests/framework/src/zfs.rs line = 304 path = phd_tests::migrate::from_base::serial_history target = phd_framework::zfs verb = list
252026-10-08T20:47:15.284ZDEBGphd-runner: [TEST - EVENT] parsing zfs list output file = phd-tests/framework/src/zfs.rs line = 238 path = phd_tests::migrate::from_base::serial_history stdout = NAME USED AVAIL REFER MOUNTPOINT\nphd-artifacts/phd-clone-ab71c805-56cf-42ce-bcbb-e1713b73edc1 0B 25.3T 49.0M /phd-artifacts/phd-clone-ab71c805-56cf-42ce-bcbb-e1713b73edc1\n target = phd_framework::zfs
262026-10-08T20:47:15.288ZINFOphd-runner: [NEW - START] file = phd-tests/framework/src/test_vm/mod.rs line = 300 path = phd_tests::migrate::from_base::serial_history target = phd_framework::test_vm
272026-10-08T20:47:15.288ZINFOphd-runner: [NEW - EVENT] phd_framework::test_vm environment = EnvironmentSpec { location: Local, propolis_artifact: "__BASE_PROPOLIS", metrics: None } file = phd-tests/framework/src/test_vm/mod.rs guest_os_kind = Alpine line = 318 path = phd_tests::migrate::from_base::serial_history target = phd_framework::test_vm vm_name = migration_serial_history_base
282026-10-08T20:47:15.288ZDEBGphd-runner: [NEW - EVENT] checking for existing copy of artifact file = phd-tests/framework/src/artifacts/store.rs line = 89 maybe_path = /phd-artifacts/2e53bb834cc515fdddd791c8f4568062337ca5510331c876aadb4499858bd931/propolis-server.tar.gz path = phd_tests::migrate::from_base::serial_history target = phd_framework::artifacts::store
292026-10-08T20:47:15.288ZDEBGphd-runner: [NEW - EVENT] Downloading file from Buildomat... file = phd-tests/framework/src/artifacts/buildomat.rs line = 215 path = phd_tests::migrate::from_base::serial_history target = phd_framework::artifacts::buildomat timeout = 600s uri = https://buildomat.eng.oxide.computer/public/file/oxidecomputer/propolis/phd_build/deb9b5a9f3e586aee361b5e138fca0fa463c26c7/propolis-server.tar.gz
302026-10-08T20:47:29.136ZDEBGphd-runner: [NEW - EVENT] Extracting artifact from tarball extracted_path = /phd-artifacts/2e53bb834cc515fdddd791c8f4568062337ca5510331c876aadb4499858bd931/propolis-server file = phd-tests/framework/src/artifacts/store.rs line = 160 path = phd_tests::migrate::from_base::serial_history target = phd_framework::artifacts::store untar_path = propolis-server
312026-10-08T20:47:29.136ZDEBGphd-runner: [NEW - EVENT] Extracting gzipped tarball... file = phd-tests/framework/src/artifacts/store.rs line = 514 path = phd_tests::migrate::from_base::serial_history target = phd_framework::artifacts::store
322026-10-08T20:47:54.377ZINFOphd-runner: [NEW - EVENT] Launching Propolis server bootrom_path = "/phd-artifacts/740187046a7267d0de72d3455070333547dbc0ea023531471fb2b2a61effa448/OVMF_CODE.fd" file = phd-tests/framework/src/test_vm/server.rs line = 66 path = phd_tests::migrate::from_base::serial_history server_addr = 127.0.0.1:9000 server_path = "/phd-artifacts/2e53bb834cc515fdddd791c8f4568062337ca5510331c876aadb4499858bd931/propolis-server" target = phd_framework::test_vm::server
332026-10-08T20:47:54.377ZINFOphd-runner: [NEW - EVENT] Opening server log files file = phd-tests/framework/src/log_config.rs line = 84 path = phd_tests::migrate::from_base::serial_history stderr_path = "/tmp/propolis-phd/phd_tests::migrate::from_base::serial_history/migration_serial_history_base.stderr.log" stdout_path = "/tmp/propolis-phd/phd_tests::migrate::from_base::serial_history/migration_serial_history_base.stdout.log" target = phd_framework::log_config
342026-10-08T20:47:54.497ZINFOphd-runner: [NEW - EVENT] Launched server with pid 924 file = phd-tests/framework/src/test_vm/server.rs line = 127 path = phd_tests::migrate::from_base::serial_history target = phd_framework::test_vm::server
352026-10-08T20:47:54.512ZINFOphd-runner: [INSTANCE_ENSURE_INTERNAL - START] file = phd-tests/framework/src/test_vm/mod.rs line = 412 path = phd_tests::migrate::from_base::serial_history target = phd_framework::test_vm vm = migration_serial_history_base vm_id = b5add4af-8383-4090-b3e3-3f354a8859b8
362026-10-08T20:47:54.522ZINFOphd-runner: [INSTANCE_ENSURE_INTERNAL - EVENT] retriable error from instance_spec_ensure e = Communication Error: error sending request for url (http://127.0.0.1:9000/instance) file = phd-tests/framework/src/test_vm/mod.rs line = 455 path = phd_tests::migrate::from_base::serial_history target = phd_framework::test_vm vm = migration_serial_history_base vm_id = b5add4af-8383-4090-b3e3-3f354a8859b8
372026-10-08T20:47:54.527ZINFOphd-runner: [NEW - END] elapsed_milliseconds = 39234 file = phd-tests/framework/src/test_vm/mod.rs line = 300 path = phd_tests::migrate::from_base::serial_history target = phd_framework::test_vm
382026-10-08T20:47:55.395ZINFOphd-runner: [SERIAL CONSOLE TASK - START] file = phd-tests/framework/src/serial/mod.rs line = 200 target = phd_framework::serial
392026-10-08T20:47:55.402ZINFOphd-runner: [INSTANCE_ENSURE_INTERNAL - EVENT] Started instance file = phd-tests/framework/src/test_vm/mod.rs instance_description.instance = Instance { properties: InstanceProperties { id: b5add4af-8383-4090-b3e3-3f354a8859b8, name: "phd-vm-b5add4af-8383-4090-b3e3-3f354a8859b8", description: "Pheidippides-managed VM", metadata: InstanceMetadata { silo_id: 07ff424f-e6b8-45e5-9226-befe29d8955c, project_id: 5ca7e12f-dcb5-44f2-a821-56a92b7b36bb, sled_id: ae9ac852-ac37-40c5-88b7-a8188dd614b6, sled_serial: "ae9ac852-ac37-40c5-88b7-a8188dd614b6", sled_revision: 1, sled_model: "pheidippes" } }, state: Creating } line = 514 path = phd_tests::migrate::from_base::serial_history target = phd_framework::test_vm vm = migration_serial_history_base vm_id = b5add4af-8383-4090-b3e3-3f354a8859b8
402026-10-08T20:47:55.402ZINFOphd-runner: [PUT_INSTANCE_STATE - START] file = phd-tests/framework/src/test_vm/mod.rs line = 575 path = phd_tests::migrate::from_base::serial_history target = phd_framework::test_vm vm = migration_serial_history_base vm_id = b5add4af-8383-4090-b3e3-3f354a8859b8
412026-10-08T20:47:55.403ZINFOphd-runner: [PUT_INSTANCE_STATE - EVENT] Requesting instance state change file = phd-tests/framework/src/test_vm/mod.rs line = 580 path = phd_tests::migrate::from_base::serial_history state = Run target = phd_framework::test_vm vm = migration_serial_history_base vm_id = b5add4af-8383-4090-b3e3-3f354a8859b8
422026-10-08T20:47:55.404ZINFOphd-runner: [PUT_INSTANCE_STATE - END] elapsed_milliseconds = 1 file = phd-tests/framework/src/test_vm/mod.rs line = 575 path = phd_tests::migrate::from_base::serial_history target = phd_framework::test_vm vm = migration_serial_history_base vm_id = b5add4af-8383-4090-b3e3-3f354a8859b8
432026-10-08T20:47:55.405ZINFOphd-runner: [WAIT_TO_BOOT - START] file = phd-tests/framework/src/test_vm/mod.rs line = 890 path = phd_tests::migrate::from_base::serial_history target = phd_framework::test_vm
442026-10-08T20:47:55.405ZINFOphd-runner: [WAIT_TO_BOOT - EVENT] waiting for guest to boot file = phd-tests/framework/src/test_vm/mod.rs line = 839 path = phd_tests::migrate::from_base::serial_history target = phd_framework::test_vm timeout_duration = 300s vm = migration_serial_history_base vm_id = b5add4af-8383-4090-b3e3-3f354a8859b8
452026-10-08T20:47:55.405ZDEBGphd-runner: [WAIT_TO_BOOT - EVENT] executing command in boot sequence file = phd-tests/framework/src/test_vm/mod.rs line = 847 path = phd_tests::migrate::from_base::serial_history step = WaitFor("localhost login: ") target = phd_framework::test_vm
462026-10-08T20:47:55.405ZINFOphd-runner: [WAIT_FOR_SERIAL_OUTPUT - START] file = phd-tests/framework/src/test_vm/mod.rs line = 913 path = phd_tests::migrate::from_base::serial_history target = phd_framework::test_vm vm = migration_serial_history_base vm_id = b5add4af-8383-4090-b3e3-3f354a8859b8
472026-10-08T20:47:55.406ZINFOphd-runner: [WAIT_FOR_SERIAL_OUTPUT - EVENT] Waiting for output on serial console file = phd-tests/framework/src/test_vm/mod.rs line = 920 path = phd_tests::migrate::from_base::serial_history target = phd_framework::test_vm timeout_duration = CallerTimeout vm = migration_serial_history_base vm_id = b5add4af-8383-4090-b3e3-3f354a8859b8
482026-10-08T20:48:00.024ZINFOphd-runner: [WAIT_FOR_SERIAL_OUTPUT - END] elapsed_milliseconds = 4617 file = phd-tests/framework/src/test_vm/mod.rs line = 913 path = phd_tests::migrate::from_base::serial_history target = phd_framework::test_vm vm = migration_serial_history_base vm_id = b5add4af-8383-4090-b3e3-3f354a8859b8
492026-10-08T20:48:00.024ZDEBGphd-runner: [WAIT_TO_BOOT - EVENT] executing command in boot sequence file = phd-tests/framework/src/test_vm/mod.rs line = 847 path = phd_tests::migrate::from_base::serial_history step = WriteStr("root") target = phd_framework::test_vm
502026-10-08T20:48:00.028ZDEBGphd-runner: [WAIT_TO_BOOT - EVENT] executing command in boot sequence file = phd-tests/framework/src/test_vm/mod.rs line = 847 path = phd_tests::migrate::from_base::serial_history step = WaitFor("localhost:~#") target = phd_framework::test_vm
512026-10-08T20:48:00.028ZINFOphd-runner: [WAIT_FOR_SERIAL_OUTPUT - START] file = phd-tests/framework/src/test_vm/mod.rs line = 913 path = phd_tests::migrate::from_base::serial_history target = phd_framework::test_vm vm = migration_serial_history_base vm_id = b5add4af-8383-4090-b3e3-3f354a8859b8
522026-10-08T20:48:00.028ZINFOphd-runner: [WAIT_FOR_SERIAL_OUTPUT - EVENT] Waiting for output on serial console file = phd-tests/framework/src/test_vm/mod.rs line = 920 path = phd_tests::migrate::from_base::serial_history target = phd_framework::test_vm timeout_duration = CallerTimeout vm = migration_serial_history_base vm_id = b5add4af-8383-4090-b3e3-3f354a8859b8
532026-10-08T20:48:00.053ZINFOphd-runner: [WAIT_FOR_SERIAL_OUTPUT - END] elapsed_milliseconds = 24 file = phd-tests/framework/src/test_vm/mod.rs line = 913 path = phd_tests::migrate::from_base::serial_history target = phd_framework::test_vm vm = migration_serial_history_base vm_id = b5add4af-8383-4090-b3e3-3f354a8859b8
542026-10-08T20:48:00.053ZDEBGphd-runner: [WAIT_TO_BOOT - EVENT] executing command in boot sequence file = phd-tests/framework/src/test_vm/mod.rs line = 847 path = phd_tests::migrate::from_base::serial_history step = WriteStr("stty -F `tty` cols 9999") target = phd_framework::test_vm
552026-10-08T20:48:00.053ZDEBGphd-runner: [WAIT_TO_BOOT - EVENT] executing command in boot sequence file = phd-tests/framework/src/test_vm/mod.rs line = 847 path = phd_tests::migrate::from_base::serial_history step = WaitFor("localhost:~#") target = phd_framework::test_vm
562026-10-08T20:48:00.053ZINFOphd-runner: [WAIT_FOR_SERIAL_OUTPUT - START] file = phd-tests/framework/src/test_vm/mod.rs line = 913 path = phd_tests::migrate::from_base::serial_history target = phd_framework::test_vm vm = migration_serial_history_base vm_id = b5add4af-8383-4090-b3e3-3f354a8859b8
572026-10-08T20:48:00.053ZINFOphd-runner: [WAIT_FOR_SERIAL_OUTPUT - EVENT] Waiting for output on serial console file = phd-tests/framework/src/test_vm/mod.rs line = 920 path = phd_tests::migrate::from_base::serial_history target = phd_framework::test_vm timeout_duration = CallerTimeout vm = migration_serial_history_base vm_id = b5add4af-8383-4090-b3e3-3f354a8859b8
582026-10-08T20:48:00.087ZINFOphd-runner: [WAIT_FOR_SERIAL_OUTPUT - END] elapsed_milliseconds = 33 file = phd-tests/framework/src/test_vm/mod.rs line = 913 path = phd_tests::migrate::from_base::serial_history target = phd_framework::test_vm vm = migration_serial_history_base vm_id = b5add4af-8383-4090-b3e3-3f354a8859b8
592026-10-08T20:48:00.087ZINFOphd-runner: [WAIT_TO_BOOT - EVENT] Guest has booted file = phd-tests/framework/src/test_vm/mod.rs line = 887 path = phd_tests::migrate::from_base::serial_history target = phd_framework::test_vm
602026-10-08T20:48:00.087ZINFOphd-runner: [WAIT_TO_BOOT - END] elapsed_milliseconds = 4681 file = phd-tests/framework/src/test_vm/mod.rs line = 890 path = phd_tests::migrate::from_base::serial_history target = phd_framework::test_vm
612026-10-08T20:48:00.088ZINFOphd-runner: [WAIT_FOR_SERIAL_OUTPUT - START] file = phd-tests/framework/src/test_vm/mod.rs line = 913 path = phd_tests::migrate::from_base::serial_history target = phd_framework::test_vm vm = migration_serial_history_base vm_id = b5add4af-8383-4090-b3e3-3f354a8859b8
622026-10-08T20:48:00.088ZINFOphd-runner: [WAIT_FOR_SERIAL_OUTPUT - EVENT] Waiting for output on serial console file = phd-tests/framework/src/test_vm/mod.rs line = 920 path = phd_tests::migrate::from_base::serial_history target = phd_framework::test_vm timeout_duration = Explicit(15s) vm = migration_serial_history_base vm_id = b5add4af-8383-4090-b3e3-3f354a8859b8
632026-10-08T20:48:00.098ZINFOphd-runner: [WAIT_FOR_SERIAL_OUTPUT - END] elapsed_milliseconds = 10 file = phd-tests/framework/src/test_vm/mod.rs line = 913 path = phd_tests::migrate::from_base::serial_history target = phd_framework::test_vm vm = migration_serial_history_base vm_id = b5add4af-8383-4090-b3e3-3f354a8859b8
642026-10-08T20:48:00.099ZINFOphd-runner: [WAIT_FOR_SERIAL_OUTPUT - START] file = phd-tests/framework/src/test_vm/mod.rs line = 913 path = phd_tests::migrate::from_base::serial_history target = phd_framework::test_vm vm = migration_serial_history_base vm_id = b5add4af-8383-4090-b3e3-3f354a8859b8
652026-10-08T20:48:00.099ZINFOphd-runner: [WAIT_FOR_SERIAL_OUTPUT - EVENT] Waiting for output on serial console file = phd-tests/framework/src/test_vm/mod.rs line = 920 path = phd_tests::migrate::from_base::serial_history target = phd_framework::test_vm timeout_duration = Explicit(300s) vm = migration_serial_history_base vm_id = b5add4af-8383-4090-b3e3-3f354a8859b8
662026-10-08T20:48:00.131ZINFOphd-runner: [WAIT_FOR_SERIAL_OUTPUT - END] elapsed_milliseconds = 32 file = phd-tests/framework/src/test_vm/mod.rs line = 913 path = phd_tests::migrate::from_base::serial_history target = phd_framework::test_vm vm = migration_serial_history_base vm_id = b5add4af-8383-4090-b3e3-3f354a8859b8
672026-10-08T20:48:00.131ZINFOphd-runner: [WAIT_FOR_SERIAL_OUTPUT - START] file = phd-tests/framework/src/test_vm/mod.rs line = 913 path = phd_tests::migrate::from_base::serial_history target = phd_framework::test_vm vm = migration_serial_history_base vm_id = b5add4af-8383-4090-b3e3-3f354a8859b8
682026-10-08T20:48:00.131ZINFOphd-runner: [WAIT_FOR_SERIAL_OUTPUT - EVENT] Waiting for output on serial console file = phd-tests/framework/src/test_vm/mod.rs line = 920 path = phd_tests::migrate::from_base::serial_history target = phd_framework::test_vm timeout_duration = Explicit(15s) vm = migration_serial_history_base vm_id = b5add4af-8383-4090-b3e3-3f354a8859b8
692026-10-08T20:48:00.142ZINFOphd-runner: [WAIT_FOR_SERIAL_OUTPUT - END] elapsed_milliseconds = 10 file = phd-tests/framework/src/test_vm/mod.rs line = 913 path = phd_tests::migrate::from_base::serial_history target = phd_framework::test_vm vm = migration_serial_history_base vm_id = b5add4af-8383-4090-b3e3-3f354a8859b8
702026-10-08T20:48:00.142ZINFOphd-runner: [WAIT_FOR_SERIAL_OUTPUT - START] file = phd-tests/framework/src/test_vm/mod.rs line = 913 path = phd_tests::migrate::from_base::serial_history target = phd_framework::test_vm vm = migration_serial_history_base vm_id = b5add4af-8383-4090-b3e3-3f354a8859b8
712026-10-08T20:48:00.143ZINFOphd-runner: [WAIT_FOR_SERIAL_OUTPUT - EVENT] Waiting for output on serial console file = phd-tests/framework/src/test_vm/mod.rs line = 920 path = phd_tests::migrate::from_base::serial_history target = phd_framework::test_vm timeout_duration = Explicit(300s) vm = migration_serial_history_base vm_id = b5add4af-8383-4090-b3e3-3f354a8859b8
722026-10-08T20:48:00.175ZINFOphd-runner: [WAIT_FOR_SERIAL_OUTPUT - END] elapsed_milliseconds = 32 file = phd-tests/framework/src/test_vm/mod.rs line = 913 path = phd_tests::migrate::from_base::serial_history target = phd_framework::test_vm vm = migration_serial_history_base vm_id = b5add4af-8383-4090-b3e3-3f354a8859b8
732026-10-08T20:48:00.184ZINFOphd-runner: [TEST - EVENT] migrating to new Propolis artifact for lifecycle test file = phd-tests/framework/src/lifecycle.rs line = 73 path = phd_tests::migrate::from_base::serial_history propolis_artifact = __DEFAULT_PROPOLIS target = phd_framework::lifecycle vm_name = migration_serial_history_base
742026-10-08T20:48:00.184ZINFOphd-runner: [NEW - START] file = phd-tests/framework/src/test_vm/mod.rs line = 300 path = phd_tests::migrate::from_base::serial_history target = phd_framework::test_vm
752026-10-08T20:48:00.184ZINFOphd-runner: [NEW - EVENT] phd_framework::test_vm environment = EnvironmentSpec { location: Local, propolis_artifact: "__DEFAULT_PROPOLIS", metrics: None } file = phd-tests/framework/src/test_vm/mod.rs guest_os_kind = Alpine line = 318 path = phd_tests::migrate::from_base::serial_history target = phd_framework::test_vm vm_name = migration_serial_history_base_lifecycle_0
762026-10-08T20:48:00.184ZDEBGphd-runner: [NEW - EVENT] Examining locally-sourced artifact file = phd-tests/framework/src/artifacts/store.rs line = 56 path = /work/phd-test/propolis-server sha256 = None target = phd_framework::artifacts::store
772026-10-08T20:48:00.184ZDEBGphd-runner: [NEW - EVENT] Locally-sourced artifact is valid, caching its path file = phd-tests/framework/src/artifacts/store.rs line = 69 path = /work/phd-test/propolis-server target = phd_framework::artifacts::store
782026-10-08T20:48:00.184ZINFOphd-runner: [NEW - EVENT] Launching Propolis server bootrom_path = "/phd-artifacts/740187046a7267d0de72d3455070333547dbc0ea023531471fb2b2a61effa448/OVMF_CODE.fd" file = phd-tests/framework/src/test_vm/server.rs line = 66 path = phd_tests::migrate::from_base::serial_history server_addr = 127.0.0.1:9002 server_path = "/work/phd-test/propolis-server" target = phd_framework::test_vm::server
792026-10-08T20:48:00.184ZINFOphd-runner: [NEW - EVENT] Opening server log files file = phd-tests/framework/src/log_config.rs line = 84 path = phd_tests::migrate::from_base::serial_history stderr_path = "/tmp/propolis-phd/phd_tests::migrate::from_base::serial_history/migration_serial_history_base_lifecycle_0.stderr.log" stdout_path = "/tmp/propolis-phd/phd_tests::migrate::from_base::serial_history/migration_serial_history_base_lifecycle_0.stdout.log" target = phd_framework::log_config
802026-10-08T20:48:00.232ZINFOphd-runner: [NEW - EVENT] Launched server with pid 925 file = phd-tests/framework/src/test_vm/server.rs line = 127 path = phd_tests::migrate::from_base::serial_history target = phd_framework::test_vm::server
812026-10-08T20:48:00.245ZINFOphd-runner: [NEW - END] elapsed_milliseconds = 61 file = phd-tests/framework/src/test_vm/mod.rs line = 300 path = phd_tests::migrate::from_base::serial_history target = phd_framework::test_vm
822026-10-08T20:48:00.245ZINFOphd-runner: [MIGRATE_FROM - START] file = phd-tests/framework/src/test_vm/mod.rs line = 609 path = phd_tests::migrate::from_base::serial_history source = migration_serial_history_base source_id = b5add4af-8383-4090-b3e3-3f354a8859b8 target = phd_framework::test_vm target_id = c18b6116-69d5-4d65-9aee-861f20c2443d
832026-10-08T20:48:00.246ZINFOphd-runner: [MIGRATE_FROM - EVENT] Migrating from source at address 127.0.0.1:9000 file = phd-tests/framework/src/test_vm/mod.rs line = 642 migration_id = 400350dc-b43d-4f46-8151-883825481b1f path = phd_tests::migrate::from_base::serial_history source = migration_serial_history_base source_id = b5add4af-8383-4090-b3e3-3f354a8859b8 target = phd_framework::test_vm target_id = c18b6116-69d5-4d65-9aee-861f20c2443d timeout_duration = 45s
842026-10-08T20:48:00.246ZINFOphd-runner: [INSTANCE_ENSURE_INTERNAL - START] file = phd-tests/framework/src/test_vm/mod.rs line = 412 path = phd_tests::migrate::from_base::serial_history source = migration_serial_history_base source_id = b5add4af-8383-4090-b3e3-3f354a8859b8 target = phd_framework::test_vm target_id = c18b6116-69d5-4d65-9aee-861f20c2443d vm = migration_serial_history_base_lifecycle_0 vm_id = c18b6116-69d5-4d65-9aee-861f20c2443d
852026-10-08T20:48:00.247ZINFOphd-runner: [INSTANCE_ENSURE_INTERNAL - EVENT] retriable error from instance_spec_ensure e = Communication Error: error sending request for url (http://127.0.0.1:9002/instance) file = phd-tests/framework/src/test_vm/mod.rs line = 455 path = phd_tests::migrate::from_base::serial_history source = migration_serial_history_base source_id = b5add4af-8383-4090-b3e3-3f354a8859b8 target = phd_framework::test_vm target_id = c18b6116-69d5-4d65-9aee-861f20c2443d vm = migration_serial_history_base_lifecycle_0 vm_id = c18b6116-69d5-4d65-9aee-861f20c2443d
862026-10-08T20:48:01.182ZINFOphd-runner: [INSTANCE_ENSURE_INTERNAL - EVENT] Started instance file = phd-tests/framework/src/test_vm/mod.rs instance_description.instance = Instance { properties: InstanceProperties { id: c18b6116-69d5-4d65-9aee-861f20c2443d, name: "phd-vm-c18b6116-69d5-4d65-9aee-861f20c2443d", description: "Pheidippides-managed VM", metadata: InstanceMetadata { silo_id: 07ff424f-e6b8-45e5-9226-befe29d8955c, project_id: 5ca7e12f-dcb5-44f2-a821-56a92b7b36bb, sled_id: 9a45f482-3c35-46f4-80b2-392bcf7d5964, sled_serial: "9a45f482-3c35-46f4-80b2-392bcf7d5964", sled_revision: 1, sled_model: "pheidippes" } }, state: Migrating } line = 514 path = phd_tests::migrate::from_base::serial_history source = migration_serial_history_base source_id = b5add4af-8383-4090-b3e3-3f354a8859b8 target = phd_framework::test_vm target_id = c18b6116-69d5-4d65-9aee-861f20c2443d vm = migration_serial_history_base_lifecycle_0 vm_id = c18b6116-69d5-4d65-9aee-861f20c2443d
872026-10-08T20:48:01.182ZINFOphd-runner: [MIGRATE - START] file = phd-tests/framework/src/test_vm/mod.rs line = 663 migration_id = 400350dc-b43d-4f46-8151-883825481b1f path = phd_tests::migrate::from_base::serial_history source = migration_serial_history_base source_id = b5add4af-8383-4090-b3e3-3f354a8859b8 target = phd_framework::test_vm target_id = c18b6116-69d5-4d65-9aee-861f20c2443d
882026-10-08T20:48:03.716ZINFOphd-runner: [SERIAL CONSOLE TASK - EVENT] serial socket control message file = phd-tests/framework/src/serial/mod.rs line = 275 s = {"Migrating":{"destination":"127.0.0.1:9002","from_start":7756}} target = phd_framework::serial
892026-10-08T20:48:05.736ZINFOphd-runner: [MIGRATE_FROM - EVENT] Migration completed successfully file = phd-tests/framework/src/test_vm/mod.rs line = 676 path = phd_tests::migrate::from_base::serial_history source = migration_serial_history_base source_id = b5add4af-8383-4090-b3e3-3f354a8859b8 target = phd_framework::test_vm target_id = c18b6116-69d5-4d65-9aee-861f20c2443d
902026-10-08T20:48:05.736ZINFOphd-runner: [MIGRATE - END] elapsed_milliseconds = 4553 file = phd-tests/framework/src/test_vm/mod.rs line = 663 migration_id = 400350dc-b43d-4f46-8151-883825481b1f path = phd_tests::migrate::from_base::serial_history source = migration_serial_history_base source_id = b5add4af-8383-4090-b3e3-3f354a8859b8 target = phd_framework::test_vm target_id = c18b6116-69d5-4d65-9aee-861f20c2443d
912026-10-08T20:48:05.740ZINFOphd-runner: [VM CLEANUP - START] file = phd-tests/framework/src/test_vm/mod.rs line = 1172 path = phd_tests::migrate::from_base::serial_history target = phd_framework::test_vm vm = migration_serial_history_base vm_id = b5add4af-8383-4090-b3e3-3f354a8859b8
922026-10-08T20:48:05.745ZDEBGphd-runner: [VM CLEANUP - EVENT] Killing Propolis server process file = phd-tests/framework/src/test_vm/server.rs line = 177 path = phd_tests::migrate::from_base::serial_history self.address = 127.0.0.1:9000 target = phd_framework::test_vm::server vm = migration_serial_history_base vm_id = b5add4af-8383-4090-b3e3-3f354a8859b8
932026-10-08T20:48:05.824ZINFOphd-runner: [VM CLEANUP - END] elapsed_milliseconds = 80 file = phd-tests/framework/src/test_vm/mod.rs line = 1172 path = phd_tests::migrate::from_base::serial_history target = phd_framework::test_vm vm = migration_serial_history_base vm_id = b5add4af-8383-4090-b3e3-3f354a8859b8
942026-10-08T20:48:05.824ZINFOphd-runner: [INSTANCE_ENSURE_INTERNAL - END] elapsed_milliseconds = 11310 file = phd-tests/framework/src/test_vm/mod.rs line = 412 path = phd_tests::migrate::from_base::serial_history target = phd_framework::test_vm vm = migration_serial_history_base vm_id = b5add4af-8383-4090-b3e3-3f354a8859b8
952026-10-08T20:48:05.827ZINFOphd-runner: [VM CLEANUP - START] file = phd-tests/framework/src/test_vm/mod.rs line = 1172 path = phd_tests::migrate::from_base::serial_history target = phd_framework::test_vm vm = migration_serial_history_base_lifecycle_0 vm_id = c18b6116-69d5-4d65-9aee-861f20c2443d
962026-10-08T20:48:05.827ZDEBGphd-runner: [SERIAL CONSOLE TASK - EVENT] serial console command channel was closed file = phd-tests/framework/src/serial/mod.rs line = 213 target = phd_framework::serial
972026-10-08T20:48:05.829ZINFOphd-runner: [SERIAL CONSOLE TASK - END] elapsed_milliseconds = 10432 file = phd-tests/framework/src/serial/mod.rs line = 200 target = phd_framework::serial
982026-10-08T20:48:05.829ZDEBGphd-runner: [VM CLEANUP - EVENT] trying to ensure Propolis server VM is destroyed file = phd-tests/framework/src/test_vm/mod.rs line = 1195 path = phd_tests::migrate::from_base::serial_history target = phd_framework::test_vm vm = migration_serial_history_base_lifecycle_0 vm_id = c18b6116-69d5-4d65-9aee-861f20c2443d
992026-10-08T20:48:05.830ZINFOphd-runner: test phd_tests::migrate::from_base::serial_history ... ok file = phd-tests/runner/src/execute.rs line = 141 target = phd_runner::execute
1002026-10-08T20:48:05.830ZINFOphd-runner: [TEST_CLEANUP - START] file = phd-tests/runner/src/fixtures.rs line = 51 target = phd_runner::fixtures
1012026-10-08T20:48:06.158ZDEBGphd-runner: [VM CLEANUP - EVENT] Killing Propolis server process file = phd-tests/framework/src/test_vm/server.rs line = 177 path = phd_tests::migrate::from_base::serial_history self.address = 127.0.0.1:9002 target = phd_framework::test_vm::server vm = migration_serial_history_base_lifecycle_0 vm_id = c18b6116-69d5-4d65-9aee-861f20c2443d
1022026-10-08T20:48:06.245ZDEBGphd-runner: [VM CLEANUP - EVENT] zfs clone dropped file = phd-tests/framework/src/zfs.rs line = 83 path = phd_tests::migrate::from_base::serial_history target = phd_framework::zfs vm = migration_serial_history_base_lifecycle_0 vm_id = c18b6116-69d5-4d65-9aee-861f20c2443d
1032026-10-08T20:48:06.245ZDEBGphd-runner: [VM CLEANUP - EVENT] executing ZFS command args = ["phd-artifacts/phd-clone-ab71c805-56cf-42ce-bcbb-e1713b73edc1"] file = phd-tests/framework/src/zfs.rs line = 304 path = phd_tests::migrate::from_base::serial_history target = phd_framework::zfs verb = destroy vm = migration_serial_history_base_lifecycle_0 vm_id = c18b6116-69d5-4d65-9aee-861f20c2443d
1042026-10-08T20:48:06.270ZDEBGphd-runner: [VM CLEANUP - EVENT] zfs snapshot dropped file = phd-tests/framework/src/zfs.rs line = 57 path = phd_tests::migrate::from_base::serial_history target = phd_framework::zfs vm = migration_serial_history_base_lifecycle_0 vm_id = c18b6116-69d5-4d65-9aee-861f20c2443d
1052026-10-08T20:48:06.270ZDEBGphd-runner: [VM CLEANUP - EVENT] executing ZFS command args = ["phd-artifacts@phd-8ae3c52a-4b40-4373-a143-bc445fc5f461"] file = phd-tests/framework/src/zfs.rs line = 304 path = phd_tests::migrate::from_base::serial_history target = phd_framework::zfs verb = destroy vm = migration_serial_history_base_lifecycle_0 vm_id = c18b6116-69d5-4d65-9aee-861f20c2443d
1062026-10-08T20:48:06.288ZINFOphd-runner: [VM CLEANUP - END] elapsed_milliseconds = 460 file = phd-tests/framework/src/test_vm/mod.rs line = 1172 path = phd_tests::migrate::from_base::serial_history target = phd_framework::test_vm vm = migration_serial_history_base_lifecycle_0 vm_id = c18b6116-69d5-4d65-9aee-861f20c2443d
1072026-10-08T20:48:06.288ZINFOphd-runner: [INSTANCE_ENSURE_INTERNAL - END] elapsed_milliseconds = 6041 file = phd-tests/framework/src/test_vm/mod.rs line = 412 path = phd_tests::migrate::from_base::serial_history source = migration_serial_history_base source_id = b5add4af-8383-4090-b3e3-3f354a8859b8 target = phd_framework::test_vm target_id = c18b6116-69d5-4d65-9aee-861f20c2443d vm = migration_serial_history_base_lifecycle_0 vm_id = c18b6116-69d5-4d65-9aee-861f20c2443d
1082026-10-08T20:48:06.288ZINFOphd-runner: [MIGRATE_FROM - END] elapsed_milliseconds = 6042 file = phd-tests/framework/src/test_vm/mod.rs line = 609 path = phd_tests::migrate::from_base::serial_history source = migration_serial_history_base source_id = b5add4af-8383-4090-b3e3-3f354a8859b8 target = phd_framework::test_vm target_id = c18b6116-69d5-4d65-9aee-861f20c2443d
1092026-10-08T20:48:06.288ZINFOphd-runner: [TEST - END] elapsed_milliseconds = 58352 file = phd-tests/tests/src/migrate.rs line = 40 path = phd_tests::migrate::from_base::serial_history target = phd_tests::migrate::from_base
1102026-10-08T20:48:06.289ZINFOphd-runner: [TEST_CLEANUP - END] elapsed_milliseconds = 458 file = phd-tests/runner/src/fixtures.rs line = 51 target = phd_runner::fixtures
1112026-10-08T20:48:06.289ZINFOphd-runner: Starting test phd_tests::migrate::from_base::can_migrate_from_base file = phd-tests/runner/src/execute.rs line = 91 target = phd_runner::execute
1122026-10-08T20:48:06.289ZINFOphd-runner: [TEST_SETUP - START] file = phd-tests/runner/src/fixtures.rs line = 41 target = phd_runner::fixtures
1132026-10-08T20:48:06.289ZINFOphd-runner: [TEST_SETUP - END] elapsed_milliseconds = 0 file = phd-tests/runner/src/fixtures.rs line = 41 target = phd_runner::fixtures
1142026-10-08T20:48:06.289ZINFOphd-runner: [TEST - START] file = phd-tests/tests/src/migrate.rs line = 34 path = phd_tests::migrate::from_base::can_migrate_from_base target = phd_tests::migrate::from_base
1152026-10-08T20:48:06.289ZDEBGphd-runner: [TEST - EVENT] Verified artifact already exists file = phd-tests/framework/src/artifacts/store.rs line = 45 path = /phd-artifacts/740187046a7267d0de72d3455070333547dbc0ea023531471fb2b2a61effa448/OVMF_CODE.fd target = phd_framework::artifacts::store
1162026-10-08T20:48:06.289ZDEBGphd-runner: [TEST - EVENT] Verified artifact already exists file = phd-tests/framework/src/artifacts/store.rs line = 45 path = /phd-artifacts/ba8007f74f9b54fbae3b2520da577831b4834778a498d732f091260c61aa7ca1/alpine.iso target = phd_framework::artifacts::store
1172026-10-08T20:48:06.289ZDEBGphd-runner: [TEST - EVENT] Verified artifact already exists file = phd-tests/framework/src/artifacts/store.rs line = 45 path = /phd-artifacts/ba8007f74f9b54fbae3b2520da577831b4834778a498d732f091260c61aa7ca1/alpine.iso target = phd_framework::artifacts::store
1182026-10-08T20:48:06.289ZDEBGphd-runner: [TEST - EVENT] executing ZFS command args = ["/phd-artifacts/ba8007f74f9b54fbae3b2520da577831b4834778a498d732f091260c61aa7ca1/alpine.iso"] file = phd-tests/framework/src/zfs.rs line = 304 path = phd_tests::migrate::from_base::can_migrate_from_base target = phd_framework::zfs verb = list
1192026-10-08T20:48:06.302ZDEBGphd-runner: [TEST - EVENT] parsing zfs list output file = phd-tests/framework/src/zfs.rs line = 238 path = phd_tests::migrate::from_base::can_migrate_from_base stdout = NAME USED AVAIL REFER MOUNTPOINT\nphd-artifacts 1.30G 25.3T 1.30G /phd-artifacts\n target = phd_framework::zfs
1202026-10-08T20:48:06.302ZDEBGphd-runner: [TEST - EVENT] executing ZFS command args = ["phd-artifacts@phd-c7f5d666-0440-441d-9032-e4cf8507dd80"] file = phd-tests/framework/src/zfs.rs line = 304 path = phd_tests::migrate::from_base::can_migrate_from_base target = phd_framework::zfs verb = snapshot
1212026-10-08T20:48:06.319ZDEBGphd-runner: [TEST - EVENT] executing ZFS command args = ["phd-artifacts@phd-c7f5d666-0440-441d-9032-e4cf8507dd80", "phd-artifacts/phd-clone-10411573-af26-4942-8f75-d56af39e86fb"] file = phd-tests/framework/src/zfs.rs line = 304 path = phd_tests::migrate::from_base::can_migrate_from_base target = phd_framework::zfs verb = clone
1222026-10-08T20:48:06.337ZDEBGphd-runner: [TEST - EVENT] executing ZFS command args = ["phd-artifacts/phd-clone-10411573-af26-4942-8f75-d56af39e86fb"] file = phd-tests/framework/src/zfs.rs line = 304 path = phd_tests::migrate::from_base::can_migrate_from_base target = phd_framework::zfs verb = list
1232026-10-08T20:48:06.349ZDEBGphd-runner: [TEST - EVENT] parsing zfs list output file = phd-tests/framework/src/zfs.rs line = 238 path = phd_tests::migrate::from_base::can_migrate_from_base stdout = NAME USED AVAIL REFER MOUNTPOINT\nphd-artifacts/phd-clone-10411573-af26-4942-8f75-d56af39e86fb 0B 25.3T 1.30G /phd-artifacts/phd-clone-10411573-af26-4942-8f75-d56af39e86fb\n target = phd_framework::zfs
1242026-10-08T20:48:06.350ZINFOphd-runner: [NEW - START] file = phd-tests/framework/src/test_vm/mod.rs line = 300 path = phd_tests::migrate::from_base::can_migrate_from_base target = phd_framework::test_vm
1252026-10-08T20:48:06.350ZINFOphd-runner: [NEW - EVENT] phd_framework::test_vm environment = EnvironmentSpec { location: Local, propolis_artifact: "__BASE_PROPOLIS", metrics: None } file = phd-tests/framework/src/test_vm/mod.rs guest_os_kind = Alpine line = 318 path = phd_tests::migrate::from_base::can_migrate_from_base target = phd_framework::test_vm vm_name = migration_from_base
1262026-10-08T20:48:06.350ZDEBGphd-runner: [NEW - EVENT] Verified artifact already exists file = phd-tests/framework/src/artifacts/store.rs line = 45 path = /phd-artifacts/2e53bb834cc515fdddd791c8f4568062337ca5510331c876aadb4499858bd931/propolis-server target = phd_framework::artifacts::store
1272026-10-08T20:48:06.350ZINFOphd-runner: [NEW - EVENT] Launching Propolis server bootrom_path = "/phd-artifacts/740187046a7267d0de72d3455070333547dbc0ea023531471fb2b2a61effa448/OVMF_CODE.fd" file = phd-tests/framework/src/test_vm/server.rs line = 66 path = phd_tests::migrate::from_base::can_migrate_from_base server_addr = 127.0.0.1:9000 server_path = "/phd-artifacts/2e53bb834cc515fdddd791c8f4568062337ca5510331c876aadb4499858bd931/propolis-server" target = phd_framework::test_vm::server
1282026-10-08T20:48:06.350ZINFOphd-runner: [NEW - EVENT] Opening server log files file = phd-tests/framework/src/log_config.rs line = 84 path = phd_tests::migrate::from_base::can_migrate_from_base stderr_path = "/tmp/propolis-phd/phd_tests::migrate::from_base::can_migrate_from_base/migration_from_base.stderr.log" stdout_path = "/tmp/propolis-phd/phd_tests::migrate::from_base::can_migrate_from_base/migration_from_base.stdout.log" target = phd_framework::log_config
1292026-10-08T20:48:06.401ZINFOphd-runner: [NEW - EVENT] Launched server with pid 934 file = phd-tests/framework/src/test_vm/server.rs line = 127 path = phd_tests::migrate::from_base::can_migrate_from_base target = phd_framework::test_vm::server
1302026-10-08T20:48:06.415ZINFOphd-runner: [NEW - END] elapsed_milliseconds = 64 file = phd-tests/framework/src/test_vm/mod.rs line = 300 path = phd_tests::migrate::from_base::can_migrate_from_base target = phd_framework::test_vm
1312026-10-08T20:48:06.415ZINFOphd-runner: [INSTANCE_ENSURE_INTERNAL - START] file = phd-tests/framework/src/test_vm/mod.rs line = 412 path = phd_tests::migrate::from_base::can_migrate_from_base target = phd_framework::test_vm vm = migration_from_base vm_id = 95ed65c1-5a60-4cda-a8b0-2535c2029a36
1322026-10-08T20:48:06.415ZINFOphd-runner: [INSTANCE_ENSURE_INTERNAL - EVENT] retriable error from instance_spec_ensure e = Communication Error: error sending request for url (http://127.0.0.1:9000/instance) file = phd-tests/framework/src/test_vm/mod.rs line = 455 path = phd_tests::migrate::from_base::can_migrate_from_base target = phd_framework::test_vm vm = migration_from_base vm_id = 95ed65c1-5a60-4cda-a8b0-2535c2029a36
1332026-10-08T20:48:07.161ZINFOphd-runner: [SERIAL CONSOLE TASK - START] file = phd-tests/framework/src/serial/mod.rs line = 200 target = phd_framework::serial
1342026-10-08T20:48:07.162ZINFOphd-runner: [INSTANCE_ENSURE_INTERNAL - EVENT] Started instance file = phd-tests/framework/src/test_vm/mod.rs instance_description.instance = Instance { properties: InstanceProperties { id: 95ed65c1-5a60-4cda-a8b0-2535c2029a36, name: "phd-vm-95ed65c1-5a60-4cda-a8b0-2535c2029a36", description: "Pheidippides-managed VM", metadata: InstanceMetadata { silo_id: 154cfa0e-f00b-43b9-9302-77e47479b333, project_id: 39b0b4f1-e4d2-4cd7-8186-d28795e7cf17, sled_id: 940d9251-5087-4082-b6e2-c0c47c8a17f9, sled_serial: "940d9251-5087-4082-b6e2-c0c47c8a17f9", sled_revision: 1, sled_model: "pheidippes" } }, state: Creating } line = 514 path = phd_tests::migrate::from_base::can_migrate_from_base target = phd_framework::test_vm vm = migration_from_base vm_id = 95ed65c1-5a60-4cda-a8b0-2535c2029a36
1352026-10-08T20:48:07.162ZINFOphd-runner: [PUT_INSTANCE_STATE - START] file = phd-tests/framework/src/test_vm/mod.rs line = 575 path = phd_tests::migrate::from_base::can_migrate_from_base target = phd_framework::test_vm vm = migration_from_base vm_id = 95ed65c1-5a60-4cda-a8b0-2535c2029a36
1362026-10-08T20:48:07.162ZINFOphd-runner: [PUT_INSTANCE_STATE - EVENT] Requesting instance state change file = phd-tests/framework/src/test_vm/mod.rs line = 580 path = phd_tests::migrate::from_base::can_migrate_from_base state = Run target = phd_framework::test_vm vm = migration_from_base vm_id = 95ed65c1-5a60-4cda-a8b0-2535c2029a36
1372026-10-08T20:48:07.163ZINFOphd-runner: [PUT_INSTANCE_STATE - END] elapsed_milliseconds = 0 file = phd-tests/framework/src/test_vm/mod.rs line = 575 path = phd_tests::migrate::from_base::can_migrate_from_base target = phd_framework::test_vm vm = migration_from_base vm_id = 95ed65c1-5a60-4cda-a8b0-2535c2029a36
1382026-10-08T20:48:07.163ZINFOphd-runner: [WAIT_TO_BOOT - START] file = phd-tests/framework/src/test_vm/mod.rs line = 890 path = phd_tests::migrate::from_base::can_migrate_from_base target = phd_framework::test_vm
1392026-10-08T20:48:07.163ZINFOphd-runner: [WAIT_TO_BOOT - EVENT] waiting for guest to boot file = phd-tests/framework/src/test_vm/mod.rs line = 839 path = phd_tests::migrate::from_base::can_migrate_from_base target = phd_framework::test_vm timeout_duration = 300s vm = migration_from_base vm_id = 95ed65c1-5a60-4cda-a8b0-2535c2029a36
1402026-10-08T20:48:07.163ZDEBGphd-runner: [WAIT_TO_BOOT - EVENT] executing command in boot sequence file = phd-tests/framework/src/test_vm/mod.rs line = 847 path = phd_tests::migrate::from_base::can_migrate_from_base step = WaitFor("localhost login: ") target = phd_framework::test_vm
1412026-10-08T20:48:07.163ZINFOphd-runner: [WAIT_FOR_SERIAL_OUTPUT - START] file = phd-tests/framework/src/test_vm/mod.rs line = 913 path = phd_tests::migrate::from_base::can_migrate_from_base target = phd_framework::test_vm vm = migration_from_base vm_id = 95ed65c1-5a60-4cda-a8b0-2535c2029a36
1422026-10-08T20:48:07.163ZINFOphd-runner: [WAIT_FOR_SERIAL_OUTPUT - EVENT] Waiting for output on serial console file = phd-tests/framework/src/test_vm/mod.rs line = 920 path = phd_tests::migrate::from_base::can_migrate_from_base target = phd_framework::test_vm timeout_duration = CallerTimeout vm = migration_from_base vm_id = 95ed65c1-5a60-4cda-a8b0-2535c2029a36
1432026-10-08T20:48:11.781ZINFOphd-runner: [WAIT_FOR_SERIAL_OUTPUT - END] elapsed_milliseconds = 4617 file = phd-tests/framework/src/test_vm/mod.rs line = 913 path = phd_tests::migrate::from_base::can_migrate_from_base target = phd_framework::test_vm vm = migration_from_base vm_id = 95ed65c1-5a60-4cda-a8b0-2535c2029a36
1442026-10-08T20:48:11.781ZDEBGphd-runner: [WAIT_TO_BOOT - EVENT] executing command in boot sequence file = phd-tests/framework/src/test_vm/mod.rs line = 847 path = phd_tests::migrate::from_base::can_migrate_from_base step = WriteStr("root") target = phd_framework::test_vm
1452026-10-08T20:48:11.781ZDEBGphd-runner: [WAIT_TO_BOOT - EVENT] executing command in boot sequence file = phd-tests/framework/src/test_vm/mod.rs line = 847 path = phd_tests::migrate::from_base::can_migrate_from_base step = WaitFor("localhost:~#") target = phd_framework::test_vm
1462026-10-08T20:48:11.781ZINFOphd-runner: [WAIT_FOR_SERIAL_OUTPUT - START] file = phd-tests/framework/src/test_vm/mod.rs line = 913 path = phd_tests::migrate::from_base::can_migrate_from_base target = phd_framework::test_vm vm = migration_from_base vm_id = 95ed65c1-5a60-4cda-a8b0-2535c2029a36
1472026-10-08T20:48:11.781ZINFOphd-runner: [WAIT_FOR_SERIAL_OUTPUT - EVENT] Waiting for output on serial console file = phd-tests/framework/src/test_vm/mod.rs line = 920 path = phd_tests::migrate::from_base::can_migrate_from_base target = phd_framework::test_vm timeout_duration = CallerTimeout vm = migration_from_base vm_id = 95ed65c1-5a60-4cda-a8b0-2535c2029a36
1482026-10-08T20:48:11.799ZINFOphd-runner: [WAIT_FOR_SERIAL_OUTPUT - END] elapsed_milliseconds = 17 file = phd-tests/framework/src/test_vm/mod.rs line = 913 path = phd_tests::migrate::from_base::can_migrate_from_base target = phd_framework::test_vm vm = migration_from_base vm_id = 95ed65c1-5a60-4cda-a8b0-2535c2029a36
1492026-10-08T20:48:11.799ZDEBGphd-runner: [WAIT_TO_BOOT - EVENT] executing command in boot sequence file = phd-tests/framework/src/test_vm/mod.rs line = 847 path = phd_tests::migrate::from_base::can_migrate_from_base step = WriteStr("stty -F `tty` cols 9999") target = phd_framework::test_vm
1502026-10-08T20:48:11.799ZDEBGphd-runner: [WAIT_TO_BOOT - EVENT] executing command in boot sequence file = phd-tests/framework/src/test_vm/mod.rs line = 847 path = phd_tests::migrate::from_base::can_migrate_from_base step = WaitFor("localhost:~#") target = phd_framework::test_vm
1512026-10-08T20:48:11.799ZINFOphd-runner: [WAIT_FOR_SERIAL_OUTPUT - START] file = phd-tests/framework/src/test_vm/mod.rs line = 913 path = phd_tests::migrate::from_base::can_migrate_from_base target = phd_framework::test_vm vm = migration_from_base vm_id = 95ed65c1-5a60-4cda-a8b0-2535c2029a36
1522026-10-08T20:48:11.799ZINFOphd-runner: [WAIT_FOR_SERIAL_OUTPUT - EVENT] Waiting for output on serial console file = phd-tests/framework/src/test_vm/mod.rs line = 920 path = phd_tests::migrate::from_base::can_migrate_from_base target = phd_framework::test_vm timeout_duration = CallerTimeout vm = migration_from_base vm_id = 95ed65c1-5a60-4cda-a8b0-2535c2029a36
1532026-10-08T20:48:11.832ZINFOphd-runner: [WAIT_FOR_SERIAL_OUTPUT - END] elapsed_milliseconds = 32 file = phd-tests/framework/src/test_vm/mod.rs line = 913 path = phd_tests::migrate::from_base::can_migrate_from_base target = phd_framework::test_vm vm = migration_from_base vm_id = 95ed65c1-5a60-4cda-a8b0-2535c2029a36
1542026-10-08T20:48:11.832ZINFOphd-runner: [WAIT_TO_BOOT - EVENT] Guest has booted file = phd-tests/framework/src/test_vm/mod.rs line = 887 path = phd_tests::migrate::from_base::can_migrate_from_base target = phd_framework::test_vm
1552026-10-08T20:48:11.832ZINFOphd-runner: [WAIT_TO_BOOT - END] elapsed_milliseconds = 4668 file = phd-tests/framework/src/test_vm/mod.rs line = 890 path = phd_tests::migrate::from_base::can_migrate_from_base target = phd_framework::test_vm
1562026-10-08T20:48:11.832ZINFOphd-runner: [WAIT_FOR_SERIAL_OUTPUT - START] file = phd-tests/framework/src/test_vm/mod.rs line = 913 path = phd_tests::migrate::from_base::can_migrate_from_base target = phd_framework::test_vm vm = migration_from_base vm_id = 95ed65c1-5a60-4cda-a8b0-2535c2029a36
1572026-10-08T20:48:11.832ZINFOphd-runner: [WAIT_FOR_SERIAL_OUTPUT - EVENT] Waiting for output on serial console file = phd-tests/framework/src/test_vm/mod.rs line = 920 path = phd_tests::migrate::from_base::can_migrate_from_base target = phd_framework::test_vm timeout_duration = Explicit(15s) vm = migration_from_base vm_id = 95ed65c1-5a60-4cda-a8b0-2535c2029a36
1582026-10-08T20:48:11.843ZINFOphd-runner: [WAIT_FOR_SERIAL_OUTPUT - END] elapsed_milliseconds = 10 file = phd-tests/framework/src/test_vm/mod.rs line = 913 path = phd_tests::migrate::from_base::can_migrate_from_base target = phd_framework::test_vm vm = migration_from_base vm_id = 95ed65c1-5a60-4cda-a8b0-2535c2029a36
1592026-10-08T20:48:11.843ZINFOphd-runner: [WAIT_FOR_SERIAL_OUTPUT - START] file = phd-tests/framework/src/test_vm/mod.rs line = 913 path = phd_tests::migrate::from_base::can_migrate_from_base target = phd_framework::test_vm vm = migration_from_base vm_id = 95ed65c1-5a60-4cda-a8b0-2535c2029a36
1602026-10-08T20:48:11.843ZINFOphd-runner: [WAIT_FOR_SERIAL_OUTPUT - EVENT] Waiting for output on serial console file = phd-tests/framework/src/test_vm/mod.rs line = 920 path = phd_tests::migrate::from_base::can_migrate_from_base target = phd_framework::test_vm timeout_duration = Explicit(300s) vm = migration_from_base vm_id = 95ed65c1-5a60-4cda-a8b0-2535c2029a36
1612026-10-08T20:48:11.876ZINFOphd-runner: [WAIT_FOR_SERIAL_OUTPUT - END] elapsed_milliseconds = 33 file = phd-tests/framework/src/test_vm/mod.rs line = 913 path = phd_tests::migrate::from_base::can_migrate_from_base target = phd_framework::test_vm vm = migration_from_base vm_id = 95ed65c1-5a60-4cda-a8b0-2535c2029a36
1622026-10-08T20:48:11.877ZINFOphd-runner: [WAIT_FOR_SERIAL_OUTPUT - START] file = phd-tests/framework/src/test_vm/mod.rs line = 913 path = phd_tests::migrate::from_base::can_migrate_from_base target = phd_framework::test_vm vm = migration_from_base vm_id = 95ed65c1-5a60-4cda-a8b0-2535c2029a36
1632026-10-08T20:48:11.877ZINFOphd-runner: [WAIT_FOR_SERIAL_OUTPUT - EVENT] Waiting for output on serial console file = phd-tests/framework/src/test_vm/mod.rs line = 920 path = phd_tests::migrate::from_base::can_migrate_from_base target = phd_framework::test_vm timeout_duration = Explicit(15s) vm = migration_from_base vm_id = 95ed65c1-5a60-4cda-a8b0-2535c2029a36
1642026-10-08T20:48:11.887ZINFOphd-runner: [WAIT_FOR_SERIAL_OUTPUT - END] elapsed_milliseconds = 10 file = phd-tests/framework/src/test_vm/mod.rs line = 913 path = phd_tests::migrate::from_base::can_migrate_from_base target = phd_framework::test_vm vm = migration_from_base vm_id = 95ed65c1-5a60-4cda-a8b0-2535c2029a36
1652026-10-08T20:48:11.887ZINFOphd-runner: [WAIT_FOR_SERIAL_OUTPUT - START] file = phd-tests/framework/src/test_vm/mod.rs line = 913 path = phd_tests::migrate::from_base::can_migrate_from_base target = phd_framework::test_vm vm = migration_from_base vm_id = 95ed65c1-5a60-4cda-a8b0-2535c2029a36
1662026-10-08T20:48:11.887ZINFOphd-runner: [WAIT_FOR_SERIAL_OUTPUT - EVENT] Waiting for output on serial console file = phd-tests/framework/src/test_vm/mod.rs line = 920 path = phd_tests::migrate::from_base::can_migrate_from_base target = phd_framework::test_vm timeout_duration = Explicit(300s) vm = migration_from_base vm_id = 95ed65c1-5a60-4cda-a8b0-2535c2029a36
1672026-10-08T20:48:11.920ZINFOphd-runner: [WAIT_FOR_SERIAL_OUTPUT - END] elapsed_milliseconds = 33 file = phd-tests/framework/src/test_vm/mod.rs line = 913 path = phd_tests::migrate::from_base::can_migrate_from_base target = phd_framework::test_vm vm = migration_from_base vm_id = 95ed65c1-5a60-4cda-a8b0-2535c2029a36
1682026-10-08T20:48:11.921ZINFOphd-runner: [WAIT_FOR_SERIAL_OUTPUT - START] file = phd-tests/framework/src/test_vm/mod.rs line = 913 path = phd_tests::migrate::from_base::can_migrate_from_base target = phd_framework::test_vm vm = migration_from_base vm_id = 95ed65c1-5a60-4cda-a8b0-2535c2029a36
1692026-10-08T20:48:11.921ZINFOphd-runner: [WAIT_FOR_SERIAL_OUTPUT - EVENT] Waiting for output on serial console file = phd-tests/framework/src/test_vm/mod.rs line = 920 path = phd_tests::migrate::from_base::can_migrate_from_base target = phd_framework::test_vm timeout_duration = Explicit(15s) vm = migration_from_base vm_id = 95ed65c1-5a60-4cda-a8b0-2535c2029a36
1702026-10-08T20:48:11.931ZINFOphd-runner: [WAIT_FOR_SERIAL_OUTPUT - END] elapsed_milliseconds = 10 file = phd-tests/framework/src/test_vm/mod.rs line = 913 path = phd_tests::migrate::from_base::can_migrate_from_base target = phd_framework::test_vm vm = migration_from_base vm_id = 95ed65c1-5a60-4cda-a8b0-2535c2029a36
1712026-10-08T20:48:11.932ZINFOphd-runner: [WAIT_FOR_SERIAL_OUTPUT - START] file = phd-tests/framework/src/test_vm/mod.rs line = 913 path = phd_tests::migrate::from_base::can_migrate_from_base target = phd_framework::test_vm vm = migration_from_base vm_id = 95ed65c1-5a60-4cda-a8b0-2535c2029a36
1722026-10-08T20:48:11.932ZINFOphd-runner: [WAIT_FOR_SERIAL_OUTPUT - EVENT] Waiting for output on serial console file = phd-tests/framework/src/test_vm/mod.rs line = 920 path = phd_tests::migrate::from_base::can_migrate_from_base target = phd_framework::test_vm timeout_duration = Explicit(300s) vm = migration_from_base vm_id = 95ed65c1-5a60-4cda-a8b0-2535c2029a36
1732026-10-08T20:48:11.965ZINFOphd-runner: [WAIT_FOR_SERIAL_OUTPUT - END] elapsed_milliseconds = 33 file = phd-tests/framework/src/test_vm/mod.rs line = 913 path = phd_tests::migrate::from_base::can_migrate_from_base target = phd_framework::test_vm vm = migration_from_base vm_id = 95ed65c1-5a60-4cda-a8b0-2535c2029a36
1742026-10-08T20:48:11.965ZINFOphd-runner: [WAIT_FOR_SERIAL_OUTPUT - START] file = phd-tests/framework/src/test_vm/mod.rs line = 913 path = phd_tests::migrate::from_base::can_migrate_from_base target = phd_framework::test_vm vm = migration_from_base vm_id = 95ed65c1-5a60-4cda-a8b0-2535c2029a36
1752026-10-08T20:48:11.965ZINFOphd-runner: [WAIT_FOR_SERIAL_OUTPUT - EVENT] Waiting for output on serial console file = phd-tests/framework/src/test_vm/mod.rs line = 920 path = phd_tests::migrate::from_base::can_migrate_from_base target = phd_framework::test_vm timeout_duration = Explicit(15s) vm = migration_from_base vm_id = 95ed65c1-5a60-4cda-a8b0-2535c2029a36
1762026-10-08T20:48:11.976ZINFOphd-runner: [WAIT_FOR_SERIAL_OUTPUT - END] elapsed_milliseconds = 10 file = phd-tests/framework/src/test_vm/mod.rs line = 913 path = phd_tests::migrate::from_base::can_migrate_from_base target = phd_framework::test_vm vm = migration_from_base vm_id = 95ed65c1-5a60-4cda-a8b0-2535c2029a36
1772026-10-08T20:48:11.976ZINFOphd-runner: [WAIT_FOR_SERIAL_OUTPUT - START] file = phd-tests/framework/src/test_vm/mod.rs line = 913 path = phd_tests::migrate::from_base::can_migrate_from_base target = phd_framework::test_vm vm = migration_from_base vm_id = 95ed65c1-5a60-4cda-a8b0-2535c2029a36
1782026-10-08T20:48:11.976ZINFOphd-runner: [WAIT_FOR_SERIAL_OUTPUT - EVENT] Waiting for output on serial console file = phd-tests/framework/src/test_vm/mod.rs line = 920 path = phd_tests::migrate::from_base::can_migrate_from_base target = phd_framework::test_vm timeout_duration = Explicit(300s) vm = migration_from_base vm_id = 95ed65c1-5a60-4cda-a8b0-2535c2029a36
1792026-10-08T20:48:12.009ZINFOphd-runner: [WAIT_FOR_SERIAL_OUTPUT - END] elapsed_milliseconds = 33 file = phd-tests/framework/src/test_vm/mod.rs line = 913 path = phd_tests::migrate::from_base::can_migrate_from_base target = phd_framework::test_vm vm = migration_from_base vm_id = 95ed65c1-5a60-4cda-a8b0-2535c2029a36
1802026-10-08T20:48:12.009ZINFOphd-runner: [WAIT_FOR_SERIAL_OUTPUT - START] file = phd-tests/framework/src/test_vm/mod.rs line = 913 path = phd_tests::migrate::from_base::can_migrate_from_base target = phd_framework::test_vm vm = migration_from_base vm_id = 95ed65c1-5a60-4cda-a8b0-2535c2029a36
1812026-10-08T20:48:12.009ZINFOphd-runner: [WAIT_FOR_SERIAL_OUTPUT - EVENT] Waiting for output on serial console file = phd-tests/framework/src/test_vm/mod.rs line = 920 path = phd_tests::migrate::from_base::can_migrate_from_base target = phd_framework::test_vm timeout_duration = Explicit(15s) vm = migration_from_base vm_id = 95ed65c1-5a60-4cda-a8b0-2535c2029a36
1822026-10-08T20:48:12.020ZINFOphd-runner: [WAIT_FOR_SERIAL_OUTPUT - END] elapsed_milliseconds = 10 file = phd-tests/framework/src/test_vm/mod.rs line = 913 path = phd_tests::migrate::from_base::can_migrate_from_base target = phd_framework::test_vm vm = migration_from_base vm_id = 95ed65c1-5a60-4cda-a8b0-2535c2029a36
1832026-10-08T20:48:12.020ZINFOphd-runner: [WAIT_FOR_SERIAL_OUTPUT - START] file = phd-tests/framework/src/test_vm/mod.rs line = 913 path = phd_tests::migrate::from_base::can_migrate_from_base target = phd_framework::test_vm vm = migration_from_base vm_id = 95ed65c1-5a60-4cda-a8b0-2535c2029a36
1842026-10-08T20:48:12.020ZINFOphd-runner: [WAIT_FOR_SERIAL_OUTPUT - EVENT] Waiting for output on serial console file = phd-tests/framework/src/test_vm/mod.rs line = 920 path = phd_tests::migrate::from_base::can_migrate_from_base target = phd_framework::test_vm timeout_duration = Explicit(300s) vm = migration_from_base vm_id = 95ed65c1-5a60-4cda-a8b0-2535c2029a36
1852026-10-08T20:48:12.053ZINFOphd-runner: [WAIT_FOR_SERIAL_OUTPUT - END] elapsed_milliseconds = 33 file = phd-tests/framework/src/test_vm/mod.rs line = 913 path = phd_tests::migrate::from_base::can_migrate_from_base target = phd_framework::test_vm vm = migration_from_base vm_id = 95ed65c1-5a60-4cda-a8b0-2535c2029a36
1862026-10-08T20:48:12.054ZINFOphd-runner: [WAIT_FOR_SERIAL_OUTPUT - START] file = phd-tests/framework/src/test_vm/mod.rs line = 913 path = phd_tests::migrate::from_base::can_migrate_from_base target = phd_framework::test_vm vm = migration_from_base vm_id = 95ed65c1-5a60-4cda-a8b0-2535c2029a36
1872026-10-08T20:48:12.054ZINFOphd-runner: [WAIT_FOR_SERIAL_OUTPUT - EVENT] Waiting for output on serial console file = phd-tests/framework/src/test_vm/mod.rs line = 920 path = phd_tests::migrate::from_base::can_migrate_from_base target = phd_framework::test_vm timeout_duration = Explicit(15s) vm = migration_from_base vm_id = 95ed65c1-5a60-4cda-a8b0-2535c2029a36
1882026-10-08T20:48:12.064ZINFOphd-runner: [WAIT_FOR_SERIAL_OUTPUT - END] elapsed_milliseconds = 10 file = phd-tests/framework/src/test_vm/mod.rs line = 913 path = phd_tests::migrate::from_base::can_migrate_from_base target = phd_framework::test_vm vm = migration_from_base vm_id = 95ed65c1-5a60-4cda-a8b0-2535c2029a36
1892026-10-08T20:48:12.065ZINFOphd-runner: [WAIT_FOR_SERIAL_OUTPUT - START] file = phd-tests/framework/src/test_vm/mod.rs line = 913 path = phd_tests::migrate::from_base::can_migrate_from_base target = phd_framework::test_vm vm = migration_from_base vm_id = 95ed65c1-5a60-4cda-a8b0-2535c2029a36
1902026-10-08T20:48:12.065ZINFOphd-runner: [WAIT_FOR_SERIAL_OUTPUT - EVENT] Waiting for output on serial console file = phd-tests/framework/src/test_vm/mod.rs line = 920 path = phd_tests::migrate::from_base::can_migrate_from_base target = phd_framework::test_vm timeout_duration = Explicit(300s) vm = migration_from_base vm_id = 95ed65c1-5a60-4cda-a8b0-2535c2029a36
1912026-10-08T20:48:12.097ZINFOphd-runner: [WAIT_FOR_SERIAL_OUTPUT - END] elapsed_milliseconds = 32 file = phd-tests/framework/src/test_vm/mod.rs line = 913 path = phd_tests::migrate::from_base::can_migrate_from_base target = phd_framework::test_vm vm = migration_from_base vm_id = 95ed65c1-5a60-4cda-a8b0-2535c2029a36
1922026-10-08T20:48:12.097ZINFOphd-runner: [TEST - EVENT] migrating to new Propolis artifact for lifecycle test file = phd-tests/framework/src/lifecycle.rs line = 73 path = phd_tests::migrate::from_base::can_migrate_from_base propolis_artifact = __DEFAULT_PROPOLIS target = phd_framework::lifecycle vm_name = migration_from_base
1932026-10-08T20:48:12.097ZINFOphd-runner: [NEW - START] file = phd-tests/framework/src/test_vm/mod.rs line = 300 path = phd_tests::migrate::from_base::can_migrate_from_base target = phd_framework::test_vm
1942026-10-08T20:48:12.097ZINFOphd-runner: [NEW - EVENT] phd_framework::test_vm environment = EnvironmentSpec { location: Local, propolis_artifact: "__DEFAULT_PROPOLIS", metrics: None } file = phd-tests/framework/src/test_vm/mod.rs guest_os_kind = Alpine line = 318 path = phd_tests::migrate::from_base::can_migrate_from_base target = phd_framework::test_vm vm_name = migration_from_base_lifecycle_0
1952026-10-08T20:48:12.097ZDEBGphd-runner: [NEW - EVENT] Verified artifact already exists file = phd-tests/framework/src/artifacts/store.rs line = 45 path = /work/phd-test/propolis-server target = phd_framework::artifacts::store
1962026-10-08T20:48:12.097ZINFOphd-runner: [NEW - EVENT] Launching Propolis server bootrom_path = "/phd-artifacts/740187046a7267d0de72d3455070333547dbc0ea023531471fb2b2a61effa448/OVMF_CODE.fd" file = phd-tests/framework/src/test_vm/server.rs line = 66 path = phd_tests::migrate::from_base::can_migrate_from_base server_addr = 127.0.0.1:9002 server_path = "/work/phd-test/propolis-server" target = phd_framework::test_vm::server
1972026-10-08T20:48:12.098ZINFOphd-runner: [NEW - EVENT] Opening server log files file = phd-tests/framework/src/log_config.rs line = 84 path = phd_tests::migrate::from_base::can_migrate_from_base stderr_path = "/tmp/propolis-phd/phd_tests::migrate::from_base::can_migrate_from_base/migration_from_base_lifecycle_0.stderr.log" stdout_path = "/tmp/propolis-phd/phd_tests::migrate::from_base::can_migrate_from_base/migration_from_base_lifecycle_0.stdout.log" target = phd_framework::log_config
1982026-10-08T20:48:12.145ZINFOphd-runner: [NEW - EVENT] Launched server with pid 935 file = phd-tests/framework/src/test_vm/server.rs line = 127 path = phd_tests::migrate::from_base::can_migrate_from_base target = phd_framework::test_vm::server
1992026-10-08T20:48:12.158ZINFOphd-runner: [NEW - END] elapsed_milliseconds = 60 file = phd-tests/framework/src/test_vm/mod.rs line = 300 path = phd_tests::migrate::from_base::can_migrate_from_base target = phd_framework::test_vm
2002026-10-08T20:48:12.158ZINFOphd-runner: [MIGRATE_FROM - START] file = phd-tests/framework/src/test_vm/mod.rs line = 609 path = phd_tests::migrate::from_base::can_migrate_from_base source = migration_from_base source_id = 95ed65c1-5a60-4cda-a8b0-2535c2029a36 target = phd_framework::test_vm target_id = 1dd5de15-71c1-46b1-8fd2-7a7b999841af
2012026-10-08T20:48:12.158ZINFOphd-runner: [MIGRATE_FROM - EVENT] Migrating from source at address 127.0.0.1:9000 file = phd-tests/framework/src/test_vm/mod.rs line = 642 migration_id = d086cfba-f7b5-46aa-a3c1-a36cb378fa47 path = phd_tests::migrate::from_base::can_migrate_from_base source = migration_from_base source_id = 95ed65c1-5a60-4cda-a8b0-2535c2029a36 target = phd_framework::test_vm target_id = 1dd5de15-71c1-46b1-8fd2-7a7b999841af timeout_duration = 45s
2022026-10-08T20:48:12.158ZINFOphd-runner: [INSTANCE_ENSURE_INTERNAL - START] file = phd-tests/framework/src/test_vm/mod.rs line = 412 path = phd_tests::migrate::from_base::can_migrate_from_base source = migration_from_base source_id = 95ed65c1-5a60-4cda-a8b0-2535c2029a36 target = phd_framework::test_vm target_id = 1dd5de15-71c1-46b1-8fd2-7a7b999841af vm = migration_from_base_lifecycle_0 vm_id = 1dd5de15-71c1-46b1-8fd2-7a7b999841af
2032026-10-08T20:48:12.158ZINFOphd-runner: [INSTANCE_ENSURE_INTERNAL - EVENT] retriable error from instance_spec_ensure e = Communication Error: error sending request for url (http://127.0.0.1:9002/instance) file = phd-tests/framework/src/test_vm/mod.rs line = 455 path = phd_tests::migrate::from_base::can_migrate_from_base source = migration_from_base source_id = 95ed65c1-5a60-4cda-a8b0-2535c2029a36 target = phd_framework::test_vm target_id = 1dd5de15-71c1-46b1-8fd2-7a7b999841af vm = migration_from_base_lifecycle_0 vm_id = 1dd5de15-71c1-46b1-8fd2-7a7b999841af
2042026-10-08T20:48:12.616ZINFOphd-runner: [INSTANCE_ENSURE_INTERNAL - EVENT] Started instance file = phd-tests/framework/src/test_vm/mod.rs instance_description.instance = Instance { properties: InstanceProperties { id: 1dd5de15-71c1-46b1-8fd2-7a7b999841af, name: "phd-vm-1dd5de15-71c1-46b1-8fd2-7a7b999841af", description: "Pheidippides-managed VM", metadata: InstanceMetadata { silo_id: 154cfa0e-f00b-43b9-9302-77e47479b333, project_id: 39b0b4f1-e4d2-4cd7-8186-d28795e7cf17, sled_id: a2062acb-ac26-4ced-bf65-dcc6edd728c4, sled_serial: "a2062acb-ac26-4ced-bf65-dcc6edd728c4", sled_revision: 1, sled_model: "pheidippes" } }, state: Migrating } line = 514 path = phd_tests::migrate::from_base::can_migrate_from_base source = migration_from_base source_id = 95ed65c1-5a60-4cda-a8b0-2535c2029a36 target = phd_framework::test_vm target_id = 1dd5de15-71c1-46b1-8fd2-7a7b999841af vm = migration_from_base_lifecycle_0 vm_id = 1dd5de15-71c1-46b1-8fd2-7a7b999841af
2052026-10-08T20:48:12.616ZINFOphd-runner: [MIGRATE - START] file = phd-tests/framework/src/test_vm/mod.rs line = 663 migration_id = d086cfba-f7b5-46aa-a3c1-a36cb378fa47 path = phd_tests::migrate::from_base::can_migrate_from_base source = migration_from_base source_id = 95ed65c1-5a60-4cda-a8b0-2535c2029a36 target = phd_framework::test_vm target_id = 1dd5de15-71c1-46b1-8fd2-7a7b999841af
2062026-10-08T20:48:15.080ZINFOphd-runner: [SERIAL CONSOLE TASK - EVENT] serial socket control message file = phd-tests/framework/src/serial/mod.rs line = 275 s = {"Migrating":{"destination":"127.0.0.1:9002","from_start":7847}} target = phd_framework::serial
2072026-10-08T20:48:15.635ZINFOphd-runner: [MIGRATE_FROM - EVENT] Migration completed successfully file = phd-tests/framework/src/test_vm/mod.rs line = 676 path = phd_tests::migrate::from_base::can_migrate_from_base source = migration_from_base source_id = 95ed65c1-5a60-4cda-a8b0-2535c2029a36 target = phd_framework::test_vm target_id = 1dd5de15-71c1-46b1-8fd2-7a7b999841af
2082026-10-08T20:48:15.635ZINFOphd-runner: [MIGRATE - END] elapsed_milliseconds = 3018 file = phd-tests/framework/src/test_vm/mod.rs line = 663 migration_id = d086cfba-f7b5-46aa-a3c1-a36cb378fa47 path = phd_tests::migrate::from_base::can_migrate_from_base source = migration_from_base source_id = 95ed65c1-5a60-4cda-a8b0-2535c2029a36 target = phd_framework::test_vm target_id = 1dd5de15-71c1-46b1-8fd2-7a7b999841af
2092026-10-08T20:48:15.638ZINFOphd-runner: [VM CLEANUP - START] file = phd-tests/framework/src/test_vm/mod.rs line = 1172 path = phd_tests::migrate::from_base::can_migrate_from_base target = phd_framework::test_vm vm = migration_from_base vm_id = 95ed65c1-5a60-4cda-a8b0-2535c2029a36
2102026-10-08T20:48:15.638ZINFOphd-runner: [WAIT_FOR_SERIAL_OUTPUT - START] file = phd-tests/framework/src/test_vm/mod.rs line = 913 path = phd_tests::migrate::from_base::can_migrate_from_base target = phd_framework::test_vm vm = migration_from_base_lifecycle_0 vm_id = 1dd5de15-71c1-46b1-8fd2-7a7b999841af
2112026-10-08T20:48:15.638ZINFOphd-runner: [WAIT_FOR_SERIAL_OUTPUT - EVENT] Waiting for output on serial console file = phd-tests/framework/src/test_vm/mod.rs line = 920 path = phd_tests::migrate::from_base::can_migrate_from_base target = phd_framework::test_vm timeout_duration = Explicit(15s) vm = migration_from_base_lifecycle_0 vm_id = 1dd5de15-71c1-46b1-8fd2-7a7b999841af
2122026-10-08T20:48:15.640ZDEBGphd-runner: [VM CLEANUP - EVENT] Killing Propolis server process file = phd-tests/framework/src/test_vm/server.rs line = 177 path = phd_tests::migrate::from_base::can_migrate_from_base self.address = 127.0.0.1:9000 target = phd_framework::test_vm::server vm = migration_from_base vm_id = 95ed65c1-5a60-4cda-a8b0-2535c2029a36
2132026-10-08T20:48:15.721ZINFOphd-runner: [VM CLEANUP - END] elapsed_milliseconds = 82 file = phd-tests/framework/src/test_vm/mod.rs line = 1172 path = phd_tests::migrate::from_base::can_migrate_from_base target = phd_framework::test_vm vm = migration_from_base vm_id = 95ed65c1-5a60-4cda-a8b0-2535c2029a36
2142026-10-08T20:48:15.721ZINFOphd-runner: [INSTANCE_ENSURE_INTERNAL - END] elapsed_milliseconds = 9304 file = phd-tests/framework/src/test_vm/mod.rs line = 412 path = phd_tests::migrate::from_base::can_migrate_from_base target = phd_framework::test_vm vm = migration_from_base vm_id = 95ed65c1-5a60-4cda-a8b0-2535c2029a36
2152026-10-08T20:48:15.721ZINFOphd-runner: [WAIT_FOR_SERIAL_OUTPUT - END] elapsed_milliseconds = 83 file = phd-tests/framework/src/test_vm/mod.rs line = 913 path = phd_tests::migrate::from_base::can_migrate_from_base target = phd_framework::test_vm vm = migration_from_base_lifecycle_0 vm_id = 1dd5de15-71c1-46b1-8fd2-7a7b999841af
2162026-10-08T20:48:15.721ZINFOphd-runner: [WAIT_FOR_SERIAL_OUTPUT - START] file = phd-tests/framework/src/test_vm/mod.rs line = 913 path = phd_tests::migrate::from_base::can_migrate_from_base target = phd_framework::test_vm vm = migration_from_base_lifecycle_0 vm_id = 1dd5de15-71c1-46b1-8fd2-7a7b999841af
2172026-10-08T20:48:15.721ZINFOphd-runner: [WAIT_FOR_SERIAL_OUTPUT - EVENT] Waiting for output on serial console file = phd-tests/framework/src/test_vm/mod.rs line = 920 path = phd_tests::migrate::from_base::can_migrate_from_base target = phd_framework::test_vm timeout_duration = Explicit(300s) vm = migration_from_base_lifecycle_0 vm_id = 1dd5de15-71c1-46b1-8fd2-7a7b999841af
2182026-10-08T20:48:15.761ZINFOphd-runner: [WAIT_FOR_SERIAL_OUTPUT - END] elapsed_milliseconds = 39 file = phd-tests/framework/src/test_vm/mod.rs line = 913 path = phd_tests::migrate::from_base::can_migrate_from_base target = phd_framework::test_vm vm = migration_from_base_lifecycle_0 vm_id = 1dd5de15-71c1-46b1-8fd2-7a7b999841af
2192026-10-08T20:48:15.761ZINFOphd-runner: [WAIT_FOR_SERIAL_OUTPUT - START] file = phd-tests/framework/src/test_vm/mod.rs line = 913 path = phd_tests::migrate::from_base::can_migrate_from_base target = phd_framework::test_vm vm = migration_from_base_lifecycle_0 vm_id = 1dd5de15-71c1-46b1-8fd2-7a7b999841af
2202026-10-08T20:48:15.761ZINFOphd-runner: [WAIT_FOR_SERIAL_OUTPUT - EVENT] Waiting for output on serial console file = phd-tests/framework/src/test_vm/mod.rs line = 920 path = phd_tests::migrate::from_base::can_migrate_from_base target = phd_framework::test_vm timeout_duration = Explicit(15s) vm = migration_from_base_lifecycle_0 vm_id = 1dd5de15-71c1-46b1-8fd2-7a7b999841af
2212026-10-08T20:48:15.772ZINFOphd-runner: [WAIT_FOR_SERIAL_OUTPUT - END] elapsed_milliseconds = 10 file = phd-tests/framework/src/test_vm/mod.rs line = 913 path = phd_tests::migrate::from_base::can_migrate_from_base target = phd_framework::test_vm vm = migration_from_base_lifecycle_0 vm_id = 1dd5de15-71c1-46b1-8fd2-7a7b999841af
2222026-10-08T20:48:15.772ZINFOphd-runner: [WAIT_FOR_SERIAL_OUTPUT - START] file = phd-tests/framework/src/test_vm/mod.rs line = 913 path = phd_tests::migrate::from_base::can_migrate_from_base target = phd_framework::test_vm vm = migration_from_base_lifecycle_0 vm_id = 1dd5de15-71c1-46b1-8fd2-7a7b999841af
2232026-10-08T20:48:15.772ZINFOphd-runner: [WAIT_FOR_SERIAL_OUTPUT - EVENT] Waiting for output on serial console file = phd-tests/framework/src/test_vm/mod.rs line = 920 path = phd_tests::migrate::from_base::can_migrate_from_base target = phd_framework::test_vm timeout_duration = Explicit(300s) vm = migration_from_base_lifecycle_0 vm_id = 1dd5de15-71c1-46b1-8fd2-7a7b999841af
2242026-10-08T20:48:15.806ZINFOphd-runner: [WAIT_FOR_SERIAL_OUTPUT - END] elapsed_milliseconds = 33 file = phd-tests/framework/src/test_vm/mod.rs line = 913 path = phd_tests::migrate::from_base::can_migrate_from_base target = phd_framework::test_vm vm = migration_from_base_lifecycle_0 vm_id = 1dd5de15-71c1-46b1-8fd2-7a7b999841af
2252026-10-08T20:48:15.806ZINFOphd-runner: [WAIT_FOR_SERIAL_OUTPUT - START] file = phd-tests/framework/src/test_vm/mod.rs line = 913 path = phd_tests::migrate::from_base::can_migrate_from_base target = phd_framework::test_vm vm = migration_from_base_lifecycle_0 vm_id = 1dd5de15-71c1-46b1-8fd2-7a7b999841af
2262026-10-08T20:48:15.806ZINFOphd-runner: [WAIT_FOR_SERIAL_OUTPUT - EVENT] Waiting for output on serial console file = phd-tests/framework/src/test_vm/mod.rs line = 920 path = phd_tests::migrate::from_base::can_migrate_from_base target = phd_framework::test_vm timeout_duration = Explicit(15s) vm = migration_from_base_lifecycle_0 vm_id = 1dd5de15-71c1-46b1-8fd2-7a7b999841af
2272026-10-08T20:48:15.817ZINFOphd-runner: [WAIT_FOR_SERIAL_OUTPUT - END] elapsed_milliseconds = 10 file = phd-tests/framework/src/test_vm/mod.rs line = 913 path = phd_tests::migrate::from_base::can_migrate_from_base target = phd_framework::test_vm vm = migration_from_base_lifecycle_0 vm_id = 1dd5de15-71c1-46b1-8fd2-7a7b999841af
2282026-10-08T20:48:15.817ZINFOphd-runner: [WAIT_FOR_SERIAL_OUTPUT - START] file = phd-tests/framework/src/test_vm/mod.rs line = 913 path = phd_tests::migrate::from_base::can_migrate_from_base target = phd_framework::test_vm vm = migration_from_base_lifecycle_0 vm_id = 1dd5de15-71c1-46b1-8fd2-7a7b999841af
2292026-10-08T20:48:15.817ZINFOphd-runner: [WAIT_FOR_SERIAL_OUTPUT - EVENT] Waiting for output on serial console file = phd-tests/framework/src/test_vm/mod.rs line = 920 path = phd_tests::migrate::from_base::can_migrate_from_base target = phd_framework::test_vm timeout_duration = Explicit(300s) vm = migration_from_base_lifecycle_0 vm_id = 1dd5de15-71c1-46b1-8fd2-7a7b999841af
2302026-10-08T20:48:15.851ZINFOphd-runner: [WAIT_FOR_SERIAL_OUTPUT - END] elapsed_milliseconds = 33 file = phd-tests/framework/src/test_vm/mod.rs line = 913 path = phd_tests::migrate::from_base::can_migrate_from_base target = phd_framework::test_vm vm = migration_from_base_lifecycle_0 vm_id = 1dd5de15-71c1-46b1-8fd2-7a7b999841af
2312026-10-08T20:48:15.851ZINFOphd-runner: [WAIT_FOR_SERIAL_OUTPUT - START] file = phd-tests/framework/src/test_vm/mod.rs line = 913 path = phd_tests::migrate::from_base::can_migrate_from_base target = phd_framework::test_vm vm = migration_from_base_lifecycle_0 vm_id = 1dd5de15-71c1-46b1-8fd2-7a7b999841af
2322026-10-08T20:48:15.851ZINFOphd-runner: [WAIT_FOR_SERIAL_OUTPUT - EVENT] Waiting for output on serial console file = phd-tests/framework/src/test_vm/mod.rs line = 920 path = phd_tests::migrate::from_base::can_migrate_from_base target = phd_framework::test_vm timeout_duration = Explicit(15s) vm = migration_from_base_lifecycle_0 vm_id = 1dd5de15-71c1-46b1-8fd2-7a7b999841af
2332026-10-08T20:48:15.862ZINFOphd-runner: [WAIT_FOR_SERIAL_OUTPUT - END] elapsed_milliseconds = 10 file = phd-tests/framework/src/test_vm/mod.rs line = 913 path = phd_tests::migrate::from_base::can_migrate_from_base target = phd_framework::test_vm vm = migration_from_base_lifecycle_0 vm_id = 1dd5de15-71c1-46b1-8fd2-7a7b999841af
2342026-10-08T20:48:15.862ZINFOphd-runner: [WAIT_FOR_SERIAL_OUTPUT - START] file = phd-tests/framework/src/test_vm/mod.rs line = 913 path = phd_tests::migrate::from_base::can_migrate_from_base target = phd_framework::test_vm vm = migration_from_base_lifecycle_0 vm_id = 1dd5de15-71c1-46b1-8fd2-7a7b999841af
2352026-10-08T20:48:15.862ZINFOphd-runner: [WAIT_FOR_SERIAL_OUTPUT - EVENT] Waiting for output on serial console file = phd-tests/framework/src/test_vm/mod.rs line = 920 path = phd_tests::migrate::from_base::can_migrate_from_base target = phd_framework::test_vm timeout_duration = Explicit(300s) vm = migration_from_base_lifecycle_0 vm_id = 1dd5de15-71c1-46b1-8fd2-7a7b999841af
2362026-10-08T20:48:15.895ZINFOphd-runner: [WAIT_FOR_SERIAL_OUTPUT - END] elapsed_milliseconds = 32 file = phd-tests/framework/src/test_vm/mod.rs line = 913 path = phd_tests::migrate::from_base::can_migrate_from_base target = phd_framework::test_vm vm = migration_from_base_lifecycle_0 vm_id = 1dd5de15-71c1-46b1-8fd2-7a7b999841af
2372026-10-08T20:48:15.895ZINFOphd-runner: [WAIT_FOR_SERIAL_OUTPUT - START] file = phd-tests/framework/src/test_vm/mod.rs line = 913 path = phd_tests::migrate::from_base::can_migrate_from_base target = phd_framework::test_vm vm = migration_from_base_lifecycle_0 vm_id = 1dd5de15-71c1-46b1-8fd2-7a7b999841af
2382026-10-08T20:48:15.895ZINFOphd-runner: [WAIT_FOR_SERIAL_OUTPUT - EVENT] Waiting for output on serial console file = phd-tests/framework/src/test_vm/mod.rs line = 920 path = phd_tests::migrate::from_base::can_migrate_from_base target = phd_framework::test_vm timeout_duration = Explicit(15s) vm = migration_from_base_lifecycle_0 vm_id = 1dd5de15-71c1-46b1-8fd2-7a7b999841af
2392026-10-08T20:48:15.907ZINFOphd-runner: [WAIT_FOR_SERIAL_OUTPUT - END] elapsed_milliseconds = 11 file = phd-tests/framework/src/test_vm/mod.rs line = 913 path = phd_tests::migrate::from_base::can_migrate_from_base target = phd_framework::test_vm vm = migration_from_base_lifecycle_0 vm_id = 1dd5de15-71c1-46b1-8fd2-7a7b999841af
2402026-10-08T20:48:15.907ZINFOphd-runner: [WAIT_FOR_SERIAL_OUTPUT - START] file = phd-tests/framework/src/test_vm/mod.rs line = 913 path = phd_tests::migrate::from_base::can_migrate_from_base target = phd_framework::test_vm vm = migration_from_base_lifecycle_0 vm_id = 1dd5de15-71c1-46b1-8fd2-7a7b999841af
2412026-10-08T20:48:15.907ZINFOphd-runner: [WAIT_FOR_SERIAL_OUTPUT - EVENT] Waiting for output on serial console file = phd-tests/framework/src/test_vm/mod.rs line = 920 path = phd_tests::migrate::from_base::can_migrate_from_base target = phd_framework::test_vm timeout_duration = Explicit(300s) vm = migration_from_base_lifecycle_0 vm_id = 1dd5de15-71c1-46b1-8fd2-7a7b999841af
2422026-10-08T20:48:15.951ZINFOphd-runner: [WAIT_FOR_SERIAL_OUTPUT - END] elapsed_milliseconds = 43 file = phd-tests/framework/src/test_vm/mod.rs line = 913 path = phd_tests::migrate::from_base::can_migrate_from_base target = phd_framework::test_vm vm = migration_from_base_lifecycle_0 vm_id = 1dd5de15-71c1-46b1-8fd2-7a7b999841af
2432026-10-08T20:48:15.951ZINFOphd-runner: [WAIT_FOR_SERIAL_OUTPUT - START] file = phd-tests/framework/src/test_vm/mod.rs line = 913 path = phd_tests::migrate::from_base::can_migrate_from_base target = phd_framework::test_vm vm = migration_from_base_lifecycle_0 vm_id = 1dd5de15-71c1-46b1-8fd2-7a7b999841af
2442026-10-08T20:48:15.952ZINFOphd-runner: [WAIT_FOR_SERIAL_OUTPUT - EVENT] Waiting for output on serial console file = phd-tests/framework/src/test_vm/mod.rs line = 920 path = phd_tests::migrate::from_base::can_migrate_from_base target = phd_framework::test_vm timeout_duration = Explicit(15s) vm = migration_from_base_lifecycle_0 vm_id = 1dd5de15-71c1-46b1-8fd2-7a7b999841af
2452026-10-08T20:48:15.962ZINFOphd-runner: [WAIT_FOR_SERIAL_OUTPUT - END] elapsed_milliseconds = 10 file = phd-tests/framework/src/test_vm/mod.rs line = 913 path = phd_tests::migrate::from_base::can_migrate_from_base target = phd_framework::test_vm vm = migration_from_base_lifecycle_0 vm_id = 1dd5de15-71c1-46b1-8fd2-7a7b999841af
2462026-10-08T20:48:15.962ZINFOphd-runner: [WAIT_FOR_SERIAL_OUTPUT - START] file = phd-tests/framework/src/test_vm/mod.rs line = 913 path = phd_tests::migrate::from_base::can_migrate_from_base target = phd_framework::test_vm vm = migration_from_base_lifecycle_0 vm_id = 1dd5de15-71c1-46b1-8fd2-7a7b999841af
2472026-10-08T20:48:15.962ZINFOphd-runner: [WAIT_FOR_SERIAL_OUTPUT - EVENT] Waiting for output on serial console file = phd-tests/framework/src/test_vm/mod.rs line = 920 path = phd_tests::migrate::from_base::can_migrate_from_base target = phd_framework::test_vm timeout_duration = Explicit(300s) vm = migration_from_base_lifecycle_0 vm_id = 1dd5de15-71c1-46b1-8fd2-7a7b999841af
2482026-10-08T20:48:15.985ZINFOphd-runner: [WAIT_FOR_SERIAL_OUTPUT - END] elapsed_milliseconds = 22 file = phd-tests/framework/src/test_vm/mod.rs line = 913 path = phd_tests::migrate::from_base::can_migrate_from_base target = phd_framework::test_vm vm = migration_from_base_lifecycle_0 vm_id = 1dd5de15-71c1-46b1-8fd2-7a7b999841af
2492026-10-08T20:48:15.985ZINFOphd-runner: [WAIT_FOR_SERIAL_OUTPUT - START] file = phd-tests/framework/src/test_vm/mod.rs line = 913 path = phd_tests::migrate::from_base::can_migrate_from_base target = phd_framework::test_vm vm = migration_from_base_lifecycle_0 vm_id = 1dd5de15-71c1-46b1-8fd2-7a7b999841af
2502026-10-08T20:48:15.985ZINFOphd-runner: [WAIT_FOR_SERIAL_OUTPUT - EVENT] Waiting for output on serial console file = phd-tests/framework/src/test_vm/mod.rs line = 920 path = phd_tests::migrate::from_base::can_migrate_from_base target = phd_framework::test_vm timeout_duration = Explicit(15s) vm = migration_from_base_lifecycle_0 vm_id = 1dd5de15-71c1-46b1-8fd2-7a7b999841af
2512026-10-08T20:48:15.997ZINFOphd-runner: [WAIT_FOR_SERIAL_OUTPUT - END] elapsed_milliseconds = 11 file = phd-tests/framework/src/test_vm/mod.rs line = 913 path = phd_tests::migrate::from_base::can_migrate_from_base target = phd_framework::test_vm vm = migration_from_base_lifecycle_0 vm_id = 1dd5de15-71c1-46b1-8fd2-7a7b999841af
2522026-10-08T20:48:15.997ZINFOphd-runner: [WAIT_FOR_SERIAL_OUTPUT - START] file = phd-tests/framework/src/test_vm/mod.rs line = 913 path = phd_tests::migrate::from_base::can_migrate_from_base target = phd_framework::test_vm vm = migration_from_base_lifecycle_0 vm_id = 1dd5de15-71c1-46b1-8fd2-7a7b999841af
2532026-10-08T20:48:15.997ZINFOphd-runner: [WAIT_FOR_SERIAL_OUTPUT - EVENT] Waiting for output on serial console file = phd-tests/framework/src/test_vm/mod.rs line = 920 path = phd_tests::migrate::from_base::can_migrate_from_base target = phd_framework::test_vm timeout_duration = Explicit(300s) vm = migration_from_base_lifecycle_0 vm_id = 1dd5de15-71c1-46b1-8fd2-7a7b999841af
2542026-10-08T20:48:16.030ZINFOphd-runner: [WAIT_FOR_SERIAL_OUTPUT - END] elapsed_milliseconds = 32 file = phd-tests/framework/src/test_vm/mod.rs line = 913 path = phd_tests::migrate::from_base::can_migrate_from_base target = phd_framework::test_vm vm = migration_from_base_lifecycle_0 vm_id = 1dd5de15-71c1-46b1-8fd2-7a7b999841af
2552026-10-08T20:48:16.030ZINFOphd-runner: [WAIT_FOR_SERIAL_OUTPUT - START] file = phd-tests/framework/src/test_vm/mod.rs line = 913 path = phd_tests::migrate::from_base::can_migrate_from_base target = phd_framework::test_vm vm = migration_from_base_lifecycle_0 vm_id = 1dd5de15-71c1-46b1-8fd2-7a7b999841af
2562026-10-08T20:48:16.030ZINFOphd-runner: [WAIT_FOR_SERIAL_OUTPUT - EVENT] Waiting for output on serial console file = phd-tests/framework/src/test_vm/mod.rs line = 920 path = phd_tests::migrate::from_base::can_migrate_from_base target = phd_framework::test_vm timeout_duration = Explicit(15s) vm = migration_from_base_lifecycle_0 vm_id = 1dd5de15-71c1-46b1-8fd2-7a7b999841af
2572026-10-08T20:48:16.040ZINFOphd-runner: [WAIT_FOR_SERIAL_OUTPUT - END] elapsed_milliseconds = 10 file = phd-tests/framework/src/test_vm/mod.rs line = 913 path = phd_tests::migrate::from_base::can_migrate_from_base target = phd_framework::test_vm vm = migration_from_base_lifecycle_0 vm_id = 1dd5de15-71c1-46b1-8fd2-7a7b999841af
2582026-10-08T20:48:16.040ZINFOphd-runner: [WAIT_FOR_SERIAL_OUTPUT - START] file = phd-tests/framework/src/test_vm/mod.rs line = 913 path = phd_tests::migrate::from_base::can_migrate_from_base target = phd_framework::test_vm vm = migration_from_base_lifecycle_0 vm_id = 1dd5de15-71c1-46b1-8fd2-7a7b999841af
2592026-10-08T20:48:16.041ZINFOphd-runner: [WAIT_FOR_SERIAL_OUTPUT - EVENT] Waiting for output on serial console file = phd-tests/framework/src/test_vm/mod.rs line = 920 path = phd_tests::migrate::from_base::can_migrate_from_base target = phd_framework::test_vm timeout_duration = Explicit(300s) vm = migration_from_base_lifecycle_0 vm_id = 1dd5de15-71c1-46b1-8fd2-7a7b999841af
2602026-10-08T20:48:16.073ZINFOphd-runner: [WAIT_FOR_SERIAL_OUTPUT - END] elapsed_milliseconds = 32 file = phd-tests/framework/src/test_vm/mod.rs line = 913 path = phd_tests::migrate::from_base::can_migrate_from_base target = phd_framework::test_vm vm = migration_from_base_lifecycle_0 vm_id = 1dd5de15-71c1-46b1-8fd2-7a7b999841af
2612026-10-08T20:48:16.074ZINFOphd-runner: [VM CLEANUP - START] file = phd-tests/framework/src/test_vm/mod.rs line = 1172 path = phd_tests::migrate::from_base::can_migrate_from_base target = phd_framework::test_vm vm = migration_from_base_lifecycle_0 vm_id = 1dd5de15-71c1-46b1-8fd2-7a7b999841af
2622026-10-08T20:48:16.074ZDEBGphd-runner: [SERIAL CONSOLE TASK - EVENT] serial console command channel was closed file = phd-tests/framework/src/serial/mod.rs line = 213 target = phd_framework::serial
2632026-10-08T20:48:16.074ZINFOphd-runner: [SERIAL CONSOLE TASK - END] elapsed_milliseconds = 8912 file = phd-tests/framework/src/serial/mod.rs line = 200 target = phd_framework::serial
2642026-10-08T20:48:16.074ZINFOphd-runner: test phd_tests::migrate::from_base::can_migrate_from_base ... ok file = phd-tests/runner/src/execute.rs line = 141 target = phd_runner::execute
2652026-10-08T20:48:16.074ZINFOphd-runner: [TEST_CLEANUP - START] file = phd-tests/runner/src/fixtures.rs line = 51 target = phd_runner::fixtures
2662026-10-08T20:48:16.076ZDEBGphd-runner: [VM CLEANUP - EVENT] trying to ensure Propolis server VM is destroyed file = phd-tests/framework/src/test_vm/mod.rs line = 1195 path = phd_tests::migrate::from_base::can_migrate_from_base target = phd_framework::test_vm vm = migration_from_base_lifecycle_0 vm_id = 1dd5de15-71c1-46b1-8fd2-7a7b999841af
2672026-10-08T20:48:16.383ZDEBGphd-runner: [VM CLEANUP - EVENT] Killing Propolis server process file = phd-tests/framework/src/test_vm/server.rs line = 177 path = phd_tests::migrate::from_base::can_migrate_from_base self.address = 127.0.0.1:9002 target = phd_framework::test_vm::server vm = migration_from_base_lifecycle_0 vm_id = 1dd5de15-71c1-46b1-8fd2-7a7b999841af
2682026-10-08T20:48:16.486ZDEBGphd-runner: [VM CLEANUP - EVENT] zfs clone dropped file = phd-tests/framework/src/zfs.rs line = 83 path = phd_tests::migrate::from_base::can_migrate_from_base target = phd_framework::zfs vm = migration_from_base_lifecycle_0 vm_id = 1dd5de15-71c1-46b1-8fd2-7a7b999841af
2692026-10-08T20:48:16.486ZDEBGphd-runner: [VM CLEANUP - EVENT] executing ZFS command args = ["phd-artifacts/phd-clone-10411573-af26-4942-8f75-d56af39e86fb"] file = phd-tests/framework/src/zfs.rs line = 304 path = phd_tests::migrate::from_base::can_migrate_from_base target = phd_framework::zfs verb = destroy vm = migration_from_base_lifecycle_0 vm_id = 1dd5de15-71c1-46b1-8fd2-7a7b999841af
2702026-10-08T20:48:16.512ZDEBGphd-runner: [VM CLEANUP - EVENT] zfs snapshot dropped file = phd-tests/framework/src/zfs.rs line = 57 path = phd_tests::migrate::from_base::can_migrate_from_base target = phd_framework::zfs vm = migration_from_base_lifecycle_0 vm_id = 1dd5de15-71c1-46b1-8fd2-7a7b999841af
2712026-10-08T20:48:16.512ZDEBGphd-runner: [VM CLEANUP - EVENT] executing ZFS command args = ["phd-artifacts@phd-c7f5d666-0440-441d-9032-e4cf8507dd80"] file = phd-tests/framework/src/zfs.rs line = 304 path = phd_tests::migrate::from_base::can_migrate_from_base target = phd_framework::zfs verb = destroy vm = migration_from_base_lifecycle_0 vm_id = 1dd5de15-71c1-46b1-8fd2-7a7b999841af
2722026-10-08T20:48:16.530ZINFOphd-runner: [VM CLEANUP - END] elapsed_milliseconds = 455 file = phd-tests/framework/src/test_vm/mod.rs line = 1172 path = phd_tests::migrate::from_base::can_migrate_from_base target = phd_framework::test_vm vm = migration_from_base_lifecycle_0 vm_id = 1dd5de15-71c1-46b1-8fd2-7a7b999841af
2732026-10-08T20:48:16.530ZINFOphd-runner: [TEST_CLEANUP - END] elapsed_milliseconds = 455 file = phd-tests/runner/src/fixtures.rs line = 51 target = phd_runner::fixtures
2742026-10-08T20:48:16.530ZINFOphd-runner: [INSTANCE_ENSURE_INTERNAL - END] elapsed_milliseconds = 4371 file = phd-tests/framework/src/test_vm/mod.rs line = 412 path = phd_tests::migrate::from_base::can_migrate_from_base source = migration_from_base source_id = 95ed65c1-5a60-4cda-a8b0-2535c2029a36 target = phd_framework::test_vm target_id = 1dd5de15-71c1-46b1-8fd2-7a7b999841af vm = migration_from_base_lifecycle_0 vm_id = 1dd5de15-71c1-46b1-8fd2-7a7b999841af
2752026-10-08T20:48:16.530ZINFOphd-runner: [MIGRATE_FROM - END] elapsed_milliseconds = 4371 file = phd-tests/framework/src/test_vm/mod.rs line = 609 path = phd_tests::migrate::from_base::can_migrate_from_base source = migration_from_base source_id = 95ed65c1-5a60-4cda-a8b0-2535c2029a36 target = phd_framework::test_vm target_id = 1dd5de15-71c1-46b1-8fd2-7a7b999841af
2762026-10-08T20:48:16.530ZINFOphd-runner: Starting test phd_tests::migrate::from_base::migration_from_base_and_back file = phd-tests/runner/src/execute.rs line = 91 target = phd_runner::execute
2772026-10-08T20:48:16.530ZINFOphd-runner: [TEST - END] elapsed_milliseconds = 10239 file = phd-tests/tests/src/migrate.rs line = 34 path = phd_tests::migrate::from_base::can_migrate_from_base target = phd_tests::migrate::from_base
2782026-10-08T20:48:16.530ZINFOphd-runner: [TEST_SETUP - START] file = phd-tests/runner/src/fixtures.rs line = 41 target = phd_runner::fixtures
2792026-10-08T20:48:16.530ZINFOphd-runner: [TEST_SETUP - END] elapsed_milliseconds = 0 file = phd-tests/runner/src/fixtures.rs line = 41 target = phd_runner::fixtures
2802026-10-08T20:48:16.530ZINFOphd-runner: [TEST - START] file = phd-tests/tests/src/migrate.rs line = 52 path = phd_tests::migrate::from_base::migration_from_base_and_back target = phd_tests::migrate::from_base
2812026-10-08T20:48:16.530ZDEBGphd-runner: [TEST - EVENT] Verified artifact already exists file = phd-tests/framework/src/artifacts/store.rs line = 45 path = /phd-artifacts/740187046a7267d0de72d3455070333547dbc0ea023531471fb2b2a61effa448/OVMF_CODE.fd target = phd_framework::artifacts::store
2822026-10-08T20:48:16.531ZDEBGphd-runner: [TEST - EVENT] Verified artifact already exists file = phd-tests/framework/src/artifacts/store.rs line = 45 path = /phd-artifacts/ba8007f74f9b54fbae3b2520da577831b4834778a498d732f091260c61aa7ca1/alpine.iso target = phd_framework::artifacts::store
2832026-10-08T20:48:16.531ZDEBGphd-runner: [TEST - EVENT] Verified artifact already exists file = phd-tests/framework/src/artifacts/store.rs line = 45 path = /phd-artifacts/ba8007f74f9b54fbae3b2520da577831b4834778a498d732f091260c61aa7ca1/alpine.iso target = phd_framework::artifacts::store
2842026-10-08T20:48:16.531ZDEBGphd-runner: [TEST - EVENT] executing ZFS command args = ["/phd-artifacts/ba8007f74f9b54fbae3b2520da577831b4834778a498d732f091260c61aa7ca1/alpine.iso"] file = phd-tests/framework/src/zfs.rs line = 304 path = phd_tests::migrate::from_base::migration_from_base_and_back target = phd_framework::zfs verb = list
2852026-10-08T20:48:16.540ZDEBGphd-runner: [TEST - EVENT] parsing zfs list output file = phd-tests/framework/src/zfs.rs line = 238 path = phd_tests::migrate::from_base::migration_from_base_and_back stdout = NAME USED AVAIL REFER MOUNTPOINT\nphd-artifacts 1.30G 25.3T 1.30G /phd-artifacts\n target = phd_framework::zfs
2862026-10-08T20:48:16.540ZDEBGphd-runner: [TEST - EVENT] executing ZFS command args = ["phd-artifacts@phd-876421ab-11a3-4a5a-a341-23e0271ba410"] file = phd-tests/framework/src/zfs.rs line = 304 path = phd_tests::migrate::from_base::migration_from_base_and_back target = phd_framework::zfs verb = snapshot
2872026-10-08T20:48:16.557ZDEBGphd-runner: [TEST - EVENT] executing ZFS command args = ["phd-artifacts@phd-876421ab-11a3-4a5a-a341-23e0271ba410", "phd-artifacts/phd-clone-275cd6da-f407-4ca0-bfeb-9edde3a64e21"] file = phd-tests/framework/src/zfs.rs line = 304 path = phd_tests::migrate::from_base::migration_from_base_and_back target = phd_framework::zfs verb = clone
2882026-10-08T20:48:16.577ZDEBGphd-runner: [TEST - EVENT] executing ZFS command args = ["phd-artifacts/phd-clone-275cd6da-f407-4ca0-bfeb-9edde3a64e21"] file = phd-tests/framework/src/zfs.rs line = 304 path = phd_tests::migrate::from_base::migration_from_base_and_back target = phd_framework::zfs verb = list
2892026-10-08T20:48:16.589ZDEBGphd-runner: [TEST - EVENT] parsing zfs list output file = phd-tests/framework/src/zfs.rs line = 238 path = phd_tests::migrate::from_base::migration_from_base_and_back stdout = NAME USED AVAIL REFER MOUNTPOINT\nphd-artifacts/phd-clone-275cd6da-f407-4ca0-bfeb-9edde3a64e21 0B 25.3T 1.30G /phd-artifacts/phd-clone-275cd6da-f407-4ca0-bfeb-9edde3a64e21\n target = phd_framework::zfs
2902026-10-08T20:48:16.589ZINFOphd-runner: [NEW - START] file = phd-tests/framework/src/test_vm/mod.rs line = 300 path = phd_tests::migrate::from_base::migration_from_base_and_back target = phd_framework::test_vm
2912026-10-08T20:48:16.589ZINFOphd-runner: [NEW - EVENT] phd_framework::test_vm environment = EnvironmentSpec { location: Local, propolis_artifact: "__BASE_PROPOLIS", metrics: None } file = phd-tests/framework/src/test_vm/mod.rs guest_os_kind = Alpine line = 318 path = phd_tests::migrate::from_base::migration_from_base_and_back target = phd_framework::test_vm vm_name = migration_from_base_and_back
2922026-10-08T20:48:16.589ZDEBGphd-runner: [NEW - EVENT] Verified artifact already exists file = phd-tests/framework/src/artifacts/store.rs line = 45 path = /phd-artifacts/2e53bb834cc515fdddd791c8f4568062337ca5510331c876aadb4499858bd931/propolis-server target = phd_framework::artifacts::store
2932026-10-08T20:48:16.589ZINFOphd-runner: [NEW - EVENT] Launching Propolis server bootrom_path = "/phd-artifacts/740187046a7267d0de72d3455070333547dbc0ea023531471fb2b2a61effa448/OVMF_CODE.fd" file = phd-tests/framework/src/test_vm/server.rs line = 66 path = phd_tests::migrate::from_base::migration_from_base_and_back server_addr = 127.0.0.1:9000 server_path = "/phd-artifacts/2e53bb834cc515fdddd791c8f4568062337ca5510331c876aadb4499858bd931/propolis-server" target = phd_framework::test_vm::server
2942026-10-08T20:48:16.590ZINFOphd-runner: [NEW - EVENT] Opening server log files file = phd-tests/framework/src/log_config.rs line = 84 path = phd_tests::migrate::from_base::migration_from_base_and_back stderr_path = "/tmp/propolis-phd/phd_tests::migrate::from_base::migration_from_base_and_back/migration_from_base_and_back.stderr.log" stdout_path = "/tmp/propolis-phd/phd_tests::migrate::from_base::migration_from_base_and_back/migration_from_base_and_back.stdout.log" target = phd_framework::log_config
2952026-10-08T20:48:16.641ZINFOphd-runner: [NEW - EVENT] Launched server with pid 944 file = phd-tests/framework/src/test_vm/server.rs line = 127 path = phd_tests::migrate::from_base::migration_from_base_and_back target = phd_framework::test_vm::server
2962026-10-08T20:48:16.655ZINFOphd-runner: [NEW - END] elapsed_milliseconds = 65 file = phd-tests/framework/src/test_vm/mod.rs line = 300 path = phd_tests::migrate::from_base::migration_from_base_and_back target = phd_framework::test_vm
2972026-10-08T20:48:16.655ZINFOphd-runner: [INSTANCE_ENSURE_INTERNAL - START] file = phd-tests/framework/src/test_vm/mod.rs line = 412 path = phd_tests::migrate::from_base::migration_from_base_and_back target = phd_framework::test_vm vm = migration_from_base_and_back vm_id = 4e2c2233-5961-4277-8aa1-07f4b55b7529
2982026-10-08T20:48:16.656ZINFOphd-runner: [INSTANCE_ENSURE_INTERNAL - EVENT] retriable error from instance_spec_ensure e = Communication Error: error sending request for url (http://127.0.0.1:9000/instance) file = phd-tests/framework/src/test_vm/mod.rs line = 455 path = phd_tests::migrate::from_base::migration_from_base_and_back target = phd_framework::test_vm vm = migration_from_base_and_back vm_id = 4e2c2233-5961-4277-8aa1-07f4b55b7529
2992026-10-08T20:48:17.064ZINFOphd-runner: [SERIAL CONSOLE TASK - START] file = phd-tests/framework/src/serial/mod.rs line = 200 target = phd_framework::serial
3002026-10-08T20:48:17.065ZINFOphd-runner: [INSTANCE_ENSURE_INTERNAL - EVENT] Started instance file = phd-tests/framework/src/test_vm/mod.rs instance_description.instance = Instance { properties: InstanceProperties { id: 4e2c2233-5961-4277-8aa1-07f4b55b7529, name: "phd-vm-4e2c2233-5961-4277-8aa1-07f4b55b7529", description: "Pheidippides-managed VM", metadata: InstanceMetadata { silo_id: 879caf9e-a300-4a0f-93b1-ade65b3324fc, project_id: b8c12009-2963-4b83-8fbe-4e538cf5e433, sled_id: 2bc5e11f-8db2-4a62-b46b-4f134b6faa25, sled_serial: "2bc5e11f-8db2-4a62-b46b-4f134b6faa25", sled_revision: 1, sled_model: "pheidippes" } }, state: Creating } line = 514 path = phd_tests::migrate::from_base::migration_from_base_and_back target = phd_framework::test_vm vm = migration_from_base_and_back vm_id = 4e2c2233-5961-4277-8aa1-07f4b55b7529
3012026-10-08T20:48:17.065ZINFOphd-runner: [PUT_INSTANCE_STATE - START] file = phd-tests/framework/src/test_vm/mod.rs line = 575 path = phd_tests::migrate::from_base::migration_from_base_and_back target = phd_framework::test_vm vm = migration_from_base_and_back vm_id = 4e2c2233-5961-4277-8aa1-07f4b55b7529
3022026-10-08T20:48:17.065ZINFOphd-runner: [PUT_INSTANCE_STATE - EVENT] Requesting instance state change file = phd-tests/framework/src/test_vm/mod.rs line = 580 path = phd_tests::migrate::from_base::migration_from_base_and_back state = Run target = phd_framework::test_vm vm = migration_from_base_and_back vm_id = 4e2c2233-5961-4277-8aa1-07f4b55b7529
3032026-10-08T20:48:17.066ZINFOphd-runner: [PUT_INSTANCE_STATE - END] elapsed_milliseconds = 0 file = phd-tests/framework/src/test_vm/mod.rs line = 575 path = phd_tests::migrate::from_base::migration_from_base_and_back target = phd_framework::test_vm vm = migration_from_base_and_back vm_id = 4e2c2233-5961-4277-8aa1-07f4b55b7529
3042026-10-08T20:48:17.066ZINFOphd-runner: [WAIT_TO_BOOT - START] file = phd-tests/framework/src/test_vm/mod.rs line = 890 path = phd_tests::migrate::from_base::migration_from_base_and_back target = phd_framework::test_vm
3052026-10-08T20:48:17.066ZINFOphd-runner: [WAIT_TO_BOOT - EVENT] waiting for guest to boot file = phd-tests/framework/src/test_vm/mod.rs line = 839 path = phd_tests::migrate::from_base::migration_from_base_and_back target = phd_framework::test_vm timeout_duration = 300s vm = migration_from_base_and_back vm_id = 4e2c2233-5961-4277-8aa1-07f4b55b7529
3062026-10-08T20:48:17.066ZDEBGphd-runner: [WAIT_TO_BOOT - EVENT] executing command in boot sequence file = phd-tests/framework/src/test_vm/mod.rs line = 847 path = phd_tests::migrate::from_base::migration_from_base_and_back step = WaitFor("localhost login: ") target = phd_framework::test_vm
3072026-10-08T20:48:17.066ZINFOphd-runner: [WAIT_FOR_SERIAL_OUTPUT - START] file = phd-tests/framework/src/test_vm/mod.rs line = 913 path = phd_tests::migrate::from_base::migration_from_base_and_back target = phd_framework::test_vm vm = migration_from_base_and_back vm_id = 4e2c2233-5961-4277-8aa1-07f4b55b7529
3082026-10-08T20:48:17.066ZINFOphd-runner: [WAIT_FOR_SERIAL_OUTPUT - EVENT] Waiting for output on serial console file = phd-tests/framework/src/test_vm/mod.rs line = 920 path = phd_tests::migrate::from_base::migration_from_base_and_back target = phd_framework::test_vm timeout_duration = CallerTimeout vm = migration_from_base_and_back vm_id = 4e2c2233-5961-4277-8aa1-07f4b55b7529
3092026-10-08T20:48:21.666ZINFOphd-runner: [WAIT_FOR_SERIAL_OUTPUT - END] elapsed_milliseconds = 4599 file = phd-tests/framework/src/test_vm/mod.rs line = 913 path = phd_tests::migrate::from_base::migration_from_base_and_back target = phd_framework::test_vm vm = migration_from_base_and_back vm_id = 4e2c2233-5961-4277-8aa1-07f4b55b7529
3102026-10-08T20:48:21.666ZDEBGphd-runner: [WAIT_TO_BOOT - EVENT] executing command in boot sequence file = phd-tests/framework/src/test_vm/mod.rs line = 847 path = phd_tests::migrate::from_base::migration_from_base_and_back step = WriteStr("root") target = phd_framework::test_vm
3112026-10-08T20:48:21.666ZDEBGphd-runner: [WAIT_TO_BOOT - EVENT] executing command in boot sequence file = phd-tests/framework/src/test_vm/mod.rs line = 847 path = phd_tests::migrate::from_base::migration_from_base_and_back step = WaitFor("localhost:~#") target = phd_framework::test_vm
3122026-10-08T20:48:21.666ZINFOphd-runner: [WAIT_FOR_SERIAL_OUTPUT - START] file = phd-tests/framework/src/test_vm/mod.rs line = 913 path = phd_tests::migrate::from_base::migration_from_base_and_back target = phd_framework::test_vm vm = migration_from_base_and_back vm_id = 4e2c2233-5961-4277-8aa1-07f4b55b7529
3132026-10-08T20:48:21.666ZINFOphd-runner: [WAIT_FOR_SERIAL_OUTPUT - EVENT] Waiting for output on serial console file = phd-tests/framework/src/test_vm/mod.rs line = 920 path = phd_tests::migrate::from_base::migration_from_base_and_back target = phd_framework::test_vm timeout_duration = CallerTimeout vm = migration_from_base_and_back vm_id = 4e2c2233-5961-4277-8aa1-07f4b55b7529
3142026-10-08T20:48:21.685ZINFOphd-runner: [WAIT_FOR_SERIAL_OUTPUT - END] elapsed_milliseconds = 19 file = phd-tests/framework/src/test_vm/mod.rs line = 913 path = phd_tests::migrate::from_base::migration_from_base_and_back target = phd_framework::test_vm vm = migration_from_base_and_back vm_id = 4e2c2233-5961-4277-8aa1-07f4b55b7529
3152026-10-08T20:48:21.686ZDEBGphd-runner: [WAIT_TO_BOOT - EVENT] executing command in boot sequence file = phd-tests/framework/src/test_vm/mod.rs line = 847 path = phd_tests::migrate::from_base::migration_from_base_and_back step = WriteStr("stty -F `tty` cols 9999") target = phd_framework::test_vm
3162026-10-08T20:48:21.686ZDEBGphd-runner: [WAIT_TO_BOOT - EVENT] executing command in boot sequence file = phd-tests/framework/src/test_vm/mod.rs line = 847 path = phd_tests::migrate::from_base::migration_from_base_and_back step = WaitFor("localhost:~#") target = phd_framework::test_vm
3172026-10-08T20:48:21.686ZINFOphd-runner: [WAIT_FOR_SERIAL_OUTPUT - START] file = phd-tests/framework/src/test_vm/mod.rs line = 913 path = phd_tests::migrate::from_base::migration_from_base_and_back target = phd_framework::test_vm vm = migration_from_base_and_back vm_id = 4e2c2233-5961-4277-8aa1-07f4b55b7529
3182026-10-08T20:48:21.686ZINFOphd-runner: [WAIT_FOR_SERIAL_OUTPUT - EVENT] Waiting for output on serial console file = phd-tests/framework/src/test_vm/mod.rs line = 920 path = phd_tests::migrate::from_base::migration_from_base_and_back target = phd_framework::test_vm timeout_duration = CallerTimeout vm = migration_from_base_and_back vm_id = 4e2c2233-5961-4277-8aa1-07f4b55b7529
3192026-10-08T20:48:21.719ZINFOphd-runner: [WAIT_FOR_SERIAL_OUTPUT - END] elapsed_milliseconds = 32 file = phd-tests/framework/src/test_vm/mod.rs line = 913 path = phd_tests::migrate::from_base::migration_from_base_and_back target = phd_framework::test_vm vm = migration_from_base_and_back vm_id = 4e2c2233-5961-4277-8aa1-07f4b55b7529
3202026-10-08T20:48:21.719ZINFOphd-runner: [WAIT_TO_BOOT - EVENT] Guest has booted file = phd-tests/framework/src/test_vm/mod.rs line = 887 path = phd_tests::migrate::from_base::migration_from_base_and_back target = phd_framework::test_vm
3212026-10-08T20:48:21.719ZINFOphd-runner: [WAIT_TO_BOOT - END] elapsed_milliseconds = 4652 file = phd-tests/framework/src/test_vm/mod.rs line = 890 path = phd_tests::migrate::from_base::migration_from_base_and_back target = phd_framework::test_vm
3222026-10-08T20:48:21.719ZINFOphd-runner: [WAIT_FOR_SERIAL_OUTPUT - START] file = phd-tests/framework/src/test_vm/mod.rs line = 913 path = phd_tests::migrate::from_base::migration_from_base_and_back target = phd_framework::test_vm vm = migration_from_base_and_back vm_id = 4e2c2233-5961-4277-8aa1-07f4b55b7529
3232026-10-08T20:48:21.719ZINFOphd-runner: [WAIT_FOR_SERIAL_OUTPUT - EVENT] Waiting for output on serial console file = phd-tests/framework/src/test_vm/mod.rs line = 920 path = phd_tests::migrate::from_base::migration_from_base_and_back target = phd_framework::test_vm timeout_duration = Explicit(15s) vm = migration_from_base_and_back vm_id = 4e2c2233-5961-4277-8aa1-07f4b55b7529
3242026-10-08T20:48:21.730ZINFOphd-runner: [WAIT_FOR_SERIAL_OUTPUT - END] elapsed_milliseconds = 10 file = phd-tests/framework/src/test_vm/mod.rs line = 913 path = phd_tests::migrate::from_base::migration_from_base_and_back target = phd_framework::test_vm vm = migration_from_base_and_back vm_id = 4e2c2233-5961-4277-8aa1-07f4b55b7529
3252026-10-08T20:48:21.730ZINFOphd-runner: [WAIT_FOR_SERIAL_OUTPUT - START] file = phd-tests/framework/src/test_vm/mod.rs line = 913 path = phd_tests::migrate::from_base::migration_from_base_and_back target = phd_framework::test_vm vm = migration_from_base_and_back vm_id = 4e2c2233-5961-4277-8aa1-07f4b55b7529
3262026-10-08T20:48:21.730ZINFOphd-runner: [WAIT_FOR_SERIAL_OUTPUT - EVENT] Waiting for output on serial console file = phd-tests/framework/src/test_vm/mod.rs line = 920 path = phd_tests::migrate::from_base::migration_from_base_and_back target = phd_framework::test_vm timeout_duration = Explicit(300s) vm = migration_from_base_and_back vm_id = 4e2c2233-5961-4277-8aa1-07f4b55b7529
3272026-10-08T20:48:21.763ZINFOphd-runner: [WAIT_FOR_SERIAL_OUTPUT - END] elapsed_milliseconds = 32 file = phd-tests/framework/src/test_vm/mod.rs line = 913 path = phd_tests::migrate::from_base::migration_from_base_and_back target = phd_framework::test_vm vm = migration_from_base_and_back vm_id = 4e2c2233-5961-4277-8aa1-07f4b55b7529
3282026-10-08T20:48:21.763ZINFOphd-runner: [WAIT_FOR_SERIAL_OUTPUT - START] file = phd-tests/framework/src/test_vm/mod.rs line = 913 path = phd_tests::migrate::from_base::migration_from_base_and_back target = phd_framework::test_vm vm = migration_from_base_and_back vm_id = 4e2c2233-5961-4277-8aa1-07f4b55b7529
3292026-10-08T20:48:21.763ZINFOphd-runner: [WAIT_FOR_SERIAL_OUTPUT - EVENT] Waiting for output on serial console file = phd-tests/framework/src/test_vm/mod.rs line = 920 path = phd_tests::migrate::from_base::migration_from_base_and_back target = phd_framework::test_vm timeout_duration = Explicit(15s) vm = migration_from_base_and_back vm_id = 4e2c2233-5961-4277-8aa1-07f4b55b7529
3302026-10-08T20:48:21.774ZINFOphd-runner: [WAIT_FOR_SERIAL_OUTPUT - END] elapsed_milliseconds = 10 file = phd-tests/framework/src/test_vm/mod.rs line = 913 path = phd_tests::migrate::from_base::migration_from_base_and_back target = phd_framework::test_vm vm = migration_from_base_and_back vm_id = 4e2c2233-5961-4277-8aa1-07f4b55b7529
3312026-10-08T20:48:21.774ZINFOphd-runner: [WAIT_FOR_SERIAL_OUTPUT - START] file = phd-tests/framework/src/test_vm/mod.rs line = 913 path = phd_tests::migrate::from_base::migration_from_base_and_back target = phd_framework::test_vm vm = migration_from_base_and_back vm_id = 4e2c2233-5961-4277-8aa1-07f4b55b7529
3322026-10-08T20:48:21.774ZINFOphd-runner: [WAIT_FOR_SERIAL_OUTPUT - EVENT] Waiting for output on serial console file = phd-tests/framework/src/test_vm/mod.rs line = 920 path = phd_tests::migrate::from_base::migration_from_base_and_back target = phd_framework::test_vm timeout_duration = Explicit(300s) vm = migration_from_base_and_back vm_id = 4e2c2233-5961-4277-8aa1-07f4b55b7529
3332026-10-08T20:48:21.807ZINFOphd-runner: [WAIT_FOR_SERIAL_OUTPUT - END] elapsed_milliseconds = 32 file = phd-tests/framework/src/test_vm/mod.rs line = 913 path = phd_tests::migrate::from_base::migration_from_base_and_back target = phd_framework::test_vm vm = migration_from_base_and_back vm_id = 4e2c2233-5961-4277-8aa1-07f4b55b7529
3342026-10-08T20:48:21.807ZINFOphd-runner: [WAIT_FOR_SERIAL_OUTPUT - START] file = phd-tests/framework/src/test_vm/mod.rs line = 913 path = phd_tests::migrate::from_base::migration_from_base_and_back target = phd_framework::test_vm vm = migration_from_base_and_back vm_id = 4e2c2233-5961-4277-8aa1-07f4b55b7529
3352026-10-08T20:48:21.807ZINFOphd-runner: [WAIT_FOR_SERIAL_OUTPUT - EVENT] Waiting for output on serial console file = phd-tests/framework/src/test_vm/mod.rs line = 920 path = phd_tests::migrate::from_base::migration_from_base_and_back target = phd_framework::test_vm timeout_duration = Explicit(15s) vm = migration_from_base_and_back vm_id = 4e2c2233-5961-4277-8aa1-07f4b55b7529
3362026-10-08T20:48:21.818ZINFOphd-runner: [WAIT_FOR_SERIAL_OUTPUT - END] elapsed_milliseconds = 10 file = phd-tests/framework/src/test_vm/mod.rs line = 913 path = phd_tests::migrate::from_base::migration_from_base_and_back target = phd_framework::test_vm vm = migration_from_base_and_back vm_id = 4e2c2233-5961-4277-8aa1-07f4b55b7529
3372026-10-08T20:48:21.818ZINFOphd-runner: [WAIT_FOR_SERIAL_OUTPUT - START] file = phd-tests/framework/src/test_vm/mod.rs line = 913 path = phd_tests::migrate::from_base::migration_from_base_and_back target = phd_framework::test_vm vm = migration_from_base_and_back vm_id = 4e2c2233-5961-4277-8aa1-07f4b55b7529
3382026-10-08T20:48:21.818ZINFOphd-runner: [WAIT_FOR_SERIAL_OUTPUT - EVENT] Waiting for output on serial console file = phd-tests/framework/src/test_vm/mod.rs line = 920 path = phd_tests::migrate::from_base::migration_from_base_and_back target = phd_framework::test_vm timeout_duration = Explicit(300s) vm = migration_from_base_and_back vm_id = 4e2c2233-5961-4277-8aa1-07f4b55b7529
3392026-10-08T20:48:21.851ZINFOphd-runner: [WAIT_FOR_SERIAL_OUTPUT - END] elapsed_milliseconds = 33 file = phd-tests/framework/src/test_vm/mod.rs line = 913 path = phd_tests::migrate::from_base::migration_from_base_and_back target = phd_framework::test_vm vm = migration_from_base_and_back vm_id = 4e2c2233-5961-4277-8aa1-07f4b55b7529
3402026-10-08T20:48:21.852ZINFOphd-runner: [WAIT_FOR_SERIAL_OUTPUT - START] file = phd-tests/framework/src/test_vm/mod.rs line = 913 path = phd_tests::migrate::from_base::migration_from_base_and_back target = phd_framework::test_vm vm = migration_from_base_and_back vm_id = 4e2c2233-5961-4277-8aa1-07f4b55b7529
3412026-10-08T20:48:21.852ZINFOphd-runner: [WAIT_FOR_SERIAL_OUTPUT - EVENT] Waiting for output on serial console file = phd-tests/framework/src/test_vm/mod.rs line = 920 path = phd_tests::migrate::from_base::migration_from_base_and_back target = phd_framework::test_vm timeout_duration = Explicit(15s) vm = migration_from_base_and_back vm_id = 4e2c2233-5961-4277-8aa1-07f4b55b7529
3422026-10-08T20:48:21.862ZINFOphd-runner: [WAIT_FOR_SERIAL_OUTPUT - END] elapsed_milliseconds = 10 file = phd-tests/framework/src/test_vm/mod.rs line = 913 path = phd_tests::migrate::from_base::migration_from_base_and_back target = phd_framework::test_vm vm = migration_from_base_and_back vm_id = 4e2c2233-5961-4277-8aa1-07f4b55b7529
3432026-10-08T20:48:21.863ZINFOphd-runner: [WAIT_FOR_SERIAL_OUTPUT - START] file = phd-tests/framework/src/test_vm/mod.rs line = 913 path = phd_tests::migrate::from_base::migration_from_base_and_back target = phd_framework::test_vm vm = migration_from_base_and_back vm_id = 4e2c2233-5961-4277-8aa1-07f4b55b7529
3442026-10-08T20:48:21.863ZINFOphd-runner: [WAIT_FOR_SERIAL_OUTPUT - EVENT] Waiting for output on serial console file = phd-tests/framework/src/test_vm/mod.rs line = 920 path = phd_tests::migrate::from_base::migration_from_base_and_back target = phd_framework::test_vm timeout_duration = Explicit(300s) vm = migration_from_base_and_back vm_id = 4e2c2233-5961-4277-8aa1-07f4b55b7529
3452026-10-08T20:48:21.896ZINFOphd-runner: [WAIT_FOR_SERIAL_OUTPUT - END] elapsed_milliseconds = 32 file = phd-tests/framework/src/test_vm/mod.rs line = 913 path = phd_tests::migrate::from_base::migration_from_base_and_back target = phd_framework::test_vm vm = migration_from_base_and_back vm_id = 4e2c2233-5961-4277-8aa1-07f4b55b7529
3462026-10-08T20:48:21.896ZINFOphd-runner: [WAIT_FOR_SERIAL_OUTPUT - START] file = phd-tests/framework/src/test_vm/mod.rs line = 913 path = phd_tests::migrate::from_base::migration_from_base_and_back target = phd_framework::test_vm vm = migration_from_base_and_back vm_id = 4e2c2233-5961-4277-8aa1-07f4b55b7529
3472026-10-08T20:48:21.896ZINFOphd-runner: [WAIT_FOR_SERIAL_OUTPUT - EVENT] Waiting for output on serial console file = phd-tests/framework/src/test_vm/mod.rs line = 920 path = phd_tests::migrate::from_base::migration_from_base_and_back target = phd_framework::test_vm timeout_duration = Explicit(15s) vm = migration_from_base_and_back vm_id = 4e2c2233-5961-4277-8aa1-07f4b55b7529
3482026-10-08T20:48:21.907ZINFOphd-runner: [WAIT_FOR_SERIAL_OUTPUT - END] elapsed_milliseconds = 10 file = phd-tests/framework/src/test_vm/mod.rs line = 913 path = phd_tests::migrate::from_base::migration_from_base_and_back target = phd_framework::test_vm vm = migration_from_base_and_back vm_id = 4e2c2233-5961-4277-8aa1-07f4b55b7529
3492026-10-08T20:48:21.907ZINFOphd-runner: [WAIT_FOR_SERIAL_OUTPUT - START] file = phd-tests/framework/src/test_vm/mod.rs line = 913 path = phd_tests::migrate::from_base::migration_from_base_and_back target = phd_framework::test_vm vm = migration_from_base_and_back vm_id = 4e2c2233-5961-4277-8aa1-07f4b55b7529
3502026-10-08T20:48:21.907ZINFOphd-runner: [WAIT_FOR_SERIAL_OUTPUT - EVENT] Waiting for output on serial console file = phd-tests/framework/src/test_vm/mod.rs line = 920 path = phd_tests::migrate::from_base::migration_from_base_and_back target = phd_framework::test_vm timeout_duration = Explicit(300s) vm = migration_from_base_and_back vm_id = 4e2c2233-5961-4277-8aa1-07f4b55b7529
3512026-10-08T20:48:21.940ZINFOphd-runner: [WAIT_FOR_SERIAL_OUTPUT - END] elapsed_milliseconds = 32 file = phd-tests/framework/src/test_vm/mod.rs line = 913 path = phd_tests::migrate::from_base::migration_from_base_and_back target = phd_framework::test_vm vm = migration_from_base_and_back vm_id = 4e2c2233-5961-4277-8aa1-07f4b55b7529
3522026-10-08T20:48:21.940ZINFOphd-runner: [WAIT_FOR_SERIAL_OUTPUT - START] file = phd-tests/framework/src/test_vm/mod.rs line = 913 path = phd_tests::migrate::from_base::migration_from_base_and_back target = phd_framework::test_vm vm = migration_from_base_and_back vm_id = 4e2c2233-5961-4277-8aa1-07f4b55b7529
3532026-10-08T20:48:21.940ZINFOphd-runner: [WAIT_FOR_SERIAL_OUTPUT - EVENT] Waiting for output on serial console file = phd-tests/framework/src/test_vm/mod.rs line = 920 path = phd_tests::migrate::from_base::migration_from_base_and_back target = phd_framework::test_vm timeout_duration = Explicit(15s) vm = migration_from_base_and_back vm_id = 4e2c2233-5961-4277-8aa1-07f4b55b7529
3542026-10-08T20:48:21.951ZINFOphd-runner: [WAIT_FOR_SERIAL_OUTPUT - END] elapsed_milliseconds = 10 file = phd-tests/framework/src/test_vm/mod.rs line = 913 path = phd_tests::migrate::from_base::migration_from_base_and_back target = phd_framework::test_vm vm = migration_from_base_and_back vm_id = 4e2c2233-5961-4277-8aa1-07f4b55b7529
3552026-10-08T20:48:21.951ZINFOphd-runner: [WAIT_FOR_SERIAL_OUTPUT - START] file = phd-tests/framework/src/test_vm/mod.rs line = 913 path = phd_tests::migrate::from_base::migration_from_base_and_back target = phd_framework::test_vm vm = migration_from_base_and_back vm_id = 4e2c2233-5961-4277-8aa1-07f4b55b7529
3562026-10-08T20:48:21.951ZINFOphd-runner: [WAIT_FOR_SERIAL_OUTPUT - EVENT] Waiting for output on serial console file = phd-tests/framework/src/test_vm/mod.rs line = 920 path = phd_tests::migrate::from_base::migration_from_base_and_back target = phd_framework::test_vm timeout_duration = Explicit(300s) vm = migration_from_base_and_back vm_id = 4e2c2233-5961-4277-8aa1-07f4b55b7529
3572026-10-08T20:48:21.984ZINFOphd-runner: [WAIT_FOR_SERIAL_OUTPUT - END] elapsed_milliseconds = 32 file = phd-tests/framework/src/test_vm/mod.rs line = 913 path = phd_tests::migrate::from_base::migration_from_base_and_back target = phd_framework::test_vm vm = migration_from_base_and_back vm_id = 4e2c2233-5961-4277-8aa1-07f4b55b7529
3582026-10-08T20:48:21.984ZINFOphd-runner: [TEST - EVENT] migrating to new Propolis artifact for lifecycle test file = phd-tests/framework/src/lifecycle.rs line = 73 path = phd_tests::migrate::from_base::migration_from_base_and_back propolis_artifact = __DEFAULT_PROPOLIS target = phd_framework::lifecycle vm_name = migration_from_base_and_back
3592026-10-08T20:48:21.984ZINFOphd-runner: [NEW - START] file = phd-tests/framework/src/test_vm/mod.rs line = 300 path = phd_tests::migrate::from_base::migration_from_base_and_back target = phd_framework::test_vm
3602026-10-08T20:48:21.984ZINFOphd-runner: [NEW - EVENT] phd_framework::test_vm environment = EnvironmentSpec { location: Local, propolis_artifact: "__DEFAULT_PROPOLIS", metrics: None } file = phd-tests/framework/src/test_vm/mod.rs guest_os_kind = Alpine line = 318 path = phd_tests::migrate::from_base::migration_from_base_and_back target = phd_framework::test_vm vm_name = migration_from_base_and_back_lifecycle_0
3612026-10-08T20:48:21.984ZDEBGphd-runner: [NEW - EVENT] Verified artifact already exists file = phd-tests/framework/src/artifacts/store.rs line = 45 path = /work/phd-test/propolis-server target = phd_framework::artifacts::store
3622026-10-08T20:48:21.984ZINFOphd-runner: [NEW - EVENT] Launching Propolis server bootrom_path = "/phd-artifacts/740187046a7267d0de72d3455070333547dbc0ea023531471fb2b2a61effa448/OVMF_CODE.fd" file = phd-tests/framework/src/test_vm/server.rs line = 66 path = phd_tests::migrate::from_base::migration_from_base_and_back server_addr = 127.0.0.1:9002 server_path = "/work/phd-test/propolis-server" target = phd_framework::test_vm::server
3632026-10-08T20:48:21.984ZINFOphd-runner: [NEW - EVENT] Opening server log files file = phd-tests/framework/src/log_config.rs line = 84 path = phd_tests::migrate::from_base::migration_from_base_and_back stderr_path = "/tmp/propolis-phd/phd_tests::migrate::from_base::migration_from_base_and_back/migration_from_base_and_back_lifecycle_0.stderr.log" stdout_path = "/tmp/propolis-phd/phd_tests::migrate::from_base::migration_from_base_and_back/migration_from_base_and_back_lifecycle_0.stdout.log" target = phd_framework::log_config
3642026-10-08T20:48:22.032ZINFOphd-runner: [NEW - EVENT] Launched server with pid 945 file = phd-tests/framework/src/test_vm/server.rs line = 127 path = phd_tests::migrate::from_base::migration_from_base_and_back target = phd_framework::test_vm::server
3652026-10-08T20:48:22.045ZINFOphd-runner: [NEW - END] elapsed_milliseconds = 60 file = phd-tests/framework/src/test_vm/mod.rs line = 300 path = phd_tests::migrate::from_base::migration_from_base_and_back target = phd_framework::test_vm
3662026-10-08T20:48:22.045ZINFOphd-runner: [MIGRATE_FROM - START] file = phd-tests/framework/src/test_vm/mod.rs line = 609 path = phd_tests::migrate::from_base::migration_from_base_and_back source = migration_from_base_and_back source_id = 4e2c2233-5961-4277-8aa1-07f4b55b7529 target = phd_framework::test_vm target_id = 3b9577ee-cef2-47fb-8def-8390ae28859b
3672026-10-08T20:48:22.045ZINFOphd-runner: [MIGRATE_FROM - EVENT] Migrating from source at address 127.0.0.1:9000 file = phd-tests/framework/src/test_vm/mod.rs line = 642 migration_id = e33683f3-c36c-4da0-9593-d2bb140963c4 path = phd_tests::migrate::from_base::migration_from_base_and_back source = migration_from_base_and_back source_id = 4e2c2233-5961-4277-8aa1-07f4b55b7529 target = phd_framework::test_vm target_id = 3b9577ee-cef2-47fb-8def-8390ae28859b timeout_duration = 45s
3682026-10-08T20:48:22.045ZINFOphd-runner: [INSTANCE_ENSURE_INTERNAL - START] file = phd-tests/framework/src/test_vm/mod.rs line = 412 path = phd_tests::migrate::from_base::migration_from_base_and_back source = migration_from_base_and_back source_id = 4e2c2233-5961-4277-8aa1-07f4b55b7529 target = phd_framework::test_vm target_id = 3b9577ee-cef2-47fb-8def-8390ae28859b vm = migration_from_base_and_back_lifecycle_0 vm_id = 3b9577ee-cef2-47fb-8def-8390ae28859b
3692026-10-08T20:48:22.046ZINFOphd-runner: [INSTANCE_ENSURE_INTERNAL - EVENT] retriable error from instance_spec_ensure e = Communication Error: error sending request for url (http://127.0.0.1:9002/instance) file = phd-tests/framework/src/test_vm/mod.rs line = 455 path = phd_tests::migrate::from_base::migration_from_base_and_back source = migration_from_base_and_back source_id = 4e2c2233-5961-4277-8aa1-07f4b55b7529 target = phd_framework::test_vm target_id = 3b9577ee-cef2-47fb-8def-8390ae28859b vm = migration_from_base_and_back_lifecycle_0 vm_id = 3b9577ee-cef2-47fb-8def-8390ae28859b
3702026-10-08T20:48:22.537ZINFOphd-runner: [INSTANCE_ENSURE_INTERNAL - EVENT] Started instance file = phd-tests/framework/src/test_vm/mod.rs instance_description.instance = Instance { properties: InstanceProperties { id: 3b9577ee-cef2-47fb-8def-8390ae28859b, name: "phd-vm-3b9577ee-cef2-47fb-8def-8390ae28859b", description: "Pheidippides-managed VM", metadata: InstanceMetadata { silo_id: 879caf9e-a300-4a0f-93b1-ade65b3324fc, project_id: b8c12009-2963-4b83-8fbe-4e538cf5e433, sled_id: 6d00ea09-e7eb-4462-bc50-2b85f7fce99e, sled_serial: "6d00ea09-e7eb-4462-bc50-2b85f7fce99e", sled_revision: 1, sled_model: "pheidippes" } }, state: Migrating } line = 514 path = phd_tests::migrate::from_base::migration_from_base_and_back source = migration_from_base_and_back source_id = 4e2c2233-5961-4277-8aa1-07f4b55b7529 target = phd_framework::test_vm target_id = 3b9577ee-cef2-47fb-8def-8390ae28859b vm = migration_from_base_and_back_lifecycle_0 vm_id = 3b9577ee-cef2-47fb-8def-8390ae28859b
3712026-10-08T20:48:22.537ZINFOphd-runner: [MIGRATE - START] file = phd-tests/framework/src/test_vm/mod.rs line = 663 migration_id = e33683f3-c36c-4da0-9593-d2bb140963c4 path = phd_tests::migrate::from_base::migration_from_base_and_back source = migration_from_base_and_back source_id = 4e2c2233-5961-4277-8aa1-07f4b55b7529 target = phd_framework::test_vm target_id = 3b9577ee-cef2-47fb-8def-8390ae28859b
3722026-10-08T20:48:25.030ZINFOphd-runner: [SERIAL CONSOLE TASK - EVENT] serial socket control message file = phd-tests/framework/src/serial/mod.rs line = 275 s = {"Migrating":{"destination":"127.0.0.1:9002","from_start":7847}} target = phd_framework::serial
3732026-10-08T20:48:27.009ZINFOphd-runner: [MIGRATE_FROM - EVENT] Migration completed successfully file = phd-tests/framework/src/test_vm/mod.rs line = 676 path = phd_tests::migrate::from_base::migration_from_base_and_back source = migration_from_base_and_back source_id = 4e2c2233-5961-4277-8aa1-07f4b55b7529 target = phd_framework::test_vm target_id = 3b9577ee-cef2-47fb-8def-8390ae28859b
3742026-10-08T20:48:27.009ZINFOphd-runner: [MIGRATE - END] elapsed_milliseconds = 4471 file = phd-tests/framework/src/test_vm/mod.rs line = 663 migration_id = e33683f3-c36c-4da0-9593-d2bb140963c4 path = phd_tests::migrate::from_base::migration_from_base_and_back source = migration_from_base_and_back source_id = 4e2c2233-5961-4277-8aa1-07f4b55b7529 target = phd_framework::test_vm target_id = 3b9577ee-cef2-47fb-8def-8390ae28859b
3752026-10-08T20:48:27.012ZINFOphd-runner: [VM CLEANUP - START] file = phd-tests/framework/src/test_vm/mod.rs line = 1172 path = phd_tests::migrate::from_base::migration_from_base_and_back target = phd_framework::test_vm vm = migration_from_base_and_back vm_id = 4e2c2233-5961-4277-8aa1-07f4b55b7529
3762026-10-08T20:48:27.012ZINFOphd-runner: [WAIT_FOR_SERIAL_OUTPUT - START] file = phd-tests/framework/src/test_vm/mod.rs line = 913 path = phd_tests::migrate::from_base::migration_from_base_and_back target = phd_framework::test_vm vm = migration_from_base_and_back_lifecycle_0 vm_id = 3b9577ee-cef2-47fb-8def-8390ae28859b
3772026-10-08T20:48:27.012ZINFOphd-runner: [WAIT_FOR_SERIAL_OUTPUT - EVENT] Waiting for output on serial console file = phd-tests/framework/src/test_vm/mod.rs line = 920 path = phd_tests::migrate::from_base::migration_from_base_and_back target = phd_framework::test_vm timeout_duration = Explicit(15s) vm = migration_from_base_and_back_lifecycle_0 vm_id = 3b9577ee-cef2-47fb-8def-8390ae28859b
3782026-10-08T20:48:27.013ZDEBGphd-runner: [VM CLEANUP - EVENT] Killing Propolis server process file = phd-tests/framework/src/test_vm/server.rs line = 177 path = phd_tests::migrate::from_base::migration_from_base_and_back self.address = 127.0.0.1:9000 target = phd_framework::test_vm::server vm = migration_from_base_and_back vm_id = 4e2c2233-5961-4277-8aa1-07f4b55b7529
3792026-10-08T20:48:27.091ZINFOphd-runner: [VM CLEANUP - END] elapsed_milliseconds = 79 file = phd-tests/framework/src/test_vm/mod.rs line = 1172 path = phd_tests::migrate::from_base::migration_from_base_and_back target = phd_framework::test_vm vm = migration_from_base_and_back vm_id = 4e2c2233-5961-4277-8aa1-07f4b55b7529
3802026-10-08T20:48:27.091ZINFOphd-runner: [WAIT_FOR_SERIAL_OUTPUT - END] elapsed_milliseconds = 79 file = phd-tests/framework/src/test_vm/mod.rs line = 913 path = phd_tests::migrate::from_base::migration_from_base_and_back target = phd_framework::test_vm vm = migration_from_base_and_back_lifecycle_0 vm_id = 3b9577ee-cef2-47fb-8def-8390ae28859b
3812026-10-08T20:48:27.091ZINFOphd-runner: [INSTANCE_ENSURE_INTERNAL - END] elapsed_milliseconds = 10434 file = phd-tests/framework/src/test_vm/mod.rs line = 412 path = phd_tests::migrate::from_base::migration_from_base_and_back target = phd_framework::test_vm vm = migration_from_base_and_back vm_id = 4e2c2233-5961-4277-8aa1-07f4b55b7529
3822026-10-08T20:48:27.091ZINFOphd-runner: [WAIT_FOR_SERIAL_OUTPUT - START] file = phd-tests/framework/src/test_vm/mod.rs line = 913 path = phd_tests::migrate::from_base::migration_from_base_and_back target = phd_framework::test_vm vm = migration_from_base_and_back_lifecycle_0 vm_id = 3b9577ee-cef2-47fb-8def-8390ae28859b
3832026-10-08T20:48:27.091ZINFOphd-runner: [WAIT_FOR_SERIAL_OUTPUT - EVENT] Waiting for output on serial console file = phd-tests/framework/src/test_vm/mod.rs line = 920 path = phd_tests::migrate::from_base::migration_from_base_and_back target = phd_framework::test_vm timeout_duration = Explicit(300s) vm = migration_from_base_and_back_lifecycle_0 vm_id = 3b9577ee-cef2-47fb-8def-8390ae28859b
3842026-10-08T20:48:27.123ZINFOphd-runner: [WAIT_FOR_SERIAL_OUTPUT - END] elapsed_milliseconds = 32 file = phd-tests/framework/src/test_vm/mod.rs line = 913 path = phd_tests::migrate::from_base::migration_from_base_and_back target = phd_framework::test_vm vm = migration_from_base_and_back_lifecycle_0 vm_id = 3b9577ee-cef2-47fb-8def-8390ae28859b
3852026-10-08T20:48:27.124ZINFOphd-runner: [TEST - EVENT] migrating to new Propolis artifact for lifecycle test file = phd-tests/framework/src/lifecycle.rs line = 73 path = phd_tests::migrate::from_base::migration_from_base_and_back propolis_artifact = __BASE_PROPOLIS target = phd_framework::lifecycle vm_name = migration_from_base_and_back
3862026-10-08T20:48:27.124ZINFOphd-runner: [NEW - START] file = phd-tests/framework/src/test_vm/mod.rs line = 300 path = phd_tests::migrate::from_base::migration_from_base_and_back target = phd_framework::test_vm
3872026-10-08T20:48:27.124ZINFOphd-runner: [NEW - EVENT] phd_framework::test_vm environment = EnvironmentSpec { location: Local, propolis_artifact: "__BASE_PROPOLIS", metrics: None } file = phd-tests/framework/src/test_vm/mod.rs guest_os_kind = Alpine line = 318 path = phd_tests::migrate::from_base::migration_from_base_and_back target = phd_framework::test_vm vm_name = migration_from_base_and_back_lifecycle_1
3882026-10-08T20:48:27.124ZDEBGphd-runner: [NEW - EVENT] Verified artifact already exists file = phd-tests/framework/src/artifacts/store.rs line = 45 path = /phd-artifacts/2e53bb834cc515fdddd791c8f4568062337ca5510331c876aadb4499858bd931/propolis-server target = phd_framework::artifacts::store
3892026-10-08T20:48:27.124ZINFOphd-runner: [NEW - EVENT] Launching Propolis server bootrom_path = "/phd-artifacts/740187046a7267d0de72d3455070333547dbc0ea023531471fb2b2a61effa448/OVMF_CODE.fd" file = phd-tests/framework/src/test_vm/server.rs line = 66 path = phd_tests::migrate::from_base::migration_from_base_and_back server_addr = 127.0.0.1:9004 server_path = "/phd-artifacts/2e53bb834cc515fdddd791c8f4568062337ca5510331c876aadb4499858bd931/propolis-server" target = phd_framework::test_vm::server
3902026-10-08T20:48:27.124ZINFOphd-runner: [NEW - EVENT] Opening server log files file = phd-tests/framework/src/log_config.rs line = 84 path = phd_tests::migrate::from_base::migration_from_base_and_back stderr_path = "/tmp/propolis-phd/phd_tests::migrate::from_base::migration_from_base_and_back/migration_from_base_and_back_lifecycle_1.stderr.log" stdout_path = "/tmp/propolis-phd/phd_tests::migrate::from_base::migration_from_base_and_back/migration_from_base_and_back_lifecycle_1.stdout.log" target = phd_framework::log_config
3912026-10-08T20:48:27.176ZINFOphd-runner: [NEW - EVENT] Launched server with pid 947 file = phd-tests/framework/src/test_vm/server.rs line = 127 path = phd_tests::migrate::from_base::migration_from_base_and_back target = phd_framework::test_vm::server
3922026-10-08T20:48:27.190ZINFOphd-runner: [NEW - END] elapsed_milliseconds = 66 file = phd-tests/framework/src/test_vm/mod.rs line = 300 path = phd_tests::migrate::from_base::migration_from_base_and_back target = phd_framework::test_vm
3932026-10-08T20:48:27.190ZINFOphd-runner: [MIGRATE_FROM - START] file = phd-tests/framework/src/test_vm/mod.rs line = 609 path = phd_tests::migrate::from_base::migration_from_base_and_back source = migration_from_base_and_back_lifecycle_0 source_id = 3b9577ee-cef2-47fb-8def-8390ae28859b target = phd_framework::test_vm target_id = e198df77-9304-4557-8768-88cb3c8589ae
3942026-10-08T20:48:27.190ZINFOphd-runner: [MIGRATE_FROM - EVENT] Migrating from source at address 127.0.0.1:9002 file = phd-tests/framework/src/test_vm/mod.rs line = 642 migration_id = eddccbda-39b7-4bc3-b98e-2ff5362591c3 path = phd_tests::migrate::from_base::migration_from_base_and_back source = migration_from_base_and_back_lifecycle_0 source_id = 3b9577ee-cef2-47fb-8def-8390ae28859b target = phd_framework::test_vm target_id = e198df77-9304-4557-8768-88cb3c8589ae timeout_duration = 45s
3952026-10-08T20:48:27.190ZINFOphd-runner: [INSTANCE_ENSURE_INTERNAL - START] file = phd-tests/framework/src/test_vm/mod.rs line = 412 path = phd_tests::migrate::from_base::migration_from_base_and_back source = migration_from_base_and_back_lifecycle_0 source_id = 3b9577ee-cef2-47fb-8def-8390ae28859b target = phd_framework::test_vm target_id = e198df77-9304-4557-8768-88cb3c8589ae vm = migration_from_base_and_back_lifecycle_1 vm_id = e198df77-9304-4557-8768-88cb3c8589ae
3962026-10-08T20:48:27.191ZINFOphd-runner: [INSTANCE_ENSURE_INTERNAL - EVENT] retriable error from instance_spec_ensure e = Communication Error: error sending request for url (http://127.0.0.1:9004/instance) file = phd-tests/framework/src/test_vm/mod.rs line = 455 path = phd_tests::migrate::from_base::migration_from_base_and_back source = migration_from_base_and_back_lifecycle_0 source_id = 3b9577ee-cef2-47fb-8def-8390ae28859b target = phd_framework::test_vm target_id = e198df77-9304-4557-8768-88cb3c8589ae vm = migration_from_base_and_back_lifecycle_1 vm_id = e198df77-9304-4557-8768-88cb3c8589ae
3972026-10-08T20:48:28.003ZINFOphd-runner: [INSTANCE_ENSURE_INTERNAL - EVENT] Started instance file = phd-tests/framework/src/test_vm/mod.rs instance_description.instance = Instance { properties: InstanceProperties { id: e198df77-9304-4557-8768-88cb3c8589ae, name: "phd-vm-e198df77-9304-4557-8768-88cb3c8589ae", description: "Pheidippides-managed VM", metadata: InstanceMetadata { silo_id: 879caf9e-a300-4a0f-93b1-ade65b3324fc, project_id: b8c12009-2963-4b83-8fbe-4e538cf5e433, sled_id: bb9ffab0-07f1-4be0-bc24-b37e8b277aa8, sled_serial: "bb9ffab0-07f1-4be0-bc24-b37e8b277aa8", sled_revision: 1, sled_model: "pheidippes" } }, state: Migrating } line = 514 path = phd_tests::migrate::from_base::migration_from_base_and_back source = migration_from_base_and_back_lifecycle_0 source_id = 3b9577ee-cef2-47fb-8def-8390ae28859b target = phd_framework::test_vm target_id = e198df77-9304-4557-8768-88cb3c8589ae vm = migration_from_base_and_back_lifecycle_1 vm_id = e198df77-9304-4557-8768-88cb3c8589ae
3982026-10-08T20:48:28.003ZINFOphd-runner: [MIGRATE - START] file = phd-tests/framework/src/test_vm/mod.rs line = 663 migration_id = eddccbda-39b7-4bc3-b98e-2ff5362591c3 path = phd_tests::migrate::from_base::migration_from_base_and_back source = migration_from_base_and_back_lifecycle_0 source_id = 3b9577ee-cef2-47fb-8def-8390ae28859b target = phd_framework::test_vm target_id = e198df77-9304-4557-8768-88cb3c8589ae
3992026-10-08T20:48:30.547ZINFOphd-runner: [SERIAL CONSOLE TASK - EVENT] serial socket control message file = phd-tests/framework/src/serial/mod.rs line = 275 s = {"Migrating":{"destination":"127.0.0.1:9004","from_start":7894}} target = phd_framework::serial
4002026-10-08T20:48:31.391ZINFOphd-runner: [MIGRATE_FROM - EVENT] Migration completed successfully file = phd-tests/framework/src/test_vm/mod.rs line = 676 path = phd_tests::migrate::from_base::migration_from_base_and_back source = migration_from_base_and_back_lifecycle_0 source_id = 3b9577ee-cef2-47fb-8def-8390ae28859b target = phd_framework::test_vm target_id = e198df77-9304-4557-8768-88cb3c8589ae
4012026-10-08T20:48:31.391ZINFOphd-runner: [MIGRATE - END] elapsed_milliseconds = 3387 file = phd-tests/framework/src/test_vm/mod.rs line = 663 migration_id = eddccbda-39b7-4bc3-b98e-2ff5362591c3 path = phd_tests::migrate::from_base::migration_from_base_and_back source = migration_from_base_and_back_lifecycle_0 source_id = 3b9577ee-cef2-47fb-8def-8390ae28859b target = phd_framework::test_vm target_id = e198df77-9304-4557-8768-88cb3c8589ae
4022026-10-08T20:48:31.394ZINFOphd-runner: [VM CLEANUP - START] file = phd-tests/framework/src/test_vm/mod.rs line = 1172 path = phd_tests::migrate::from_base::migration_from_base_and_back target = phd_framework::test_vm vm = migration_from_base_and_back_lifecycle_0 vm_id = 3b9577ee-cef2-47fb-8def-8390ae28859b
4032026-10-08T20:48:31.394ZINFOphd-runner: [WAIT_FOR_SERIAL_OUTPUT - START] file = phd-tests/framework/src/test_vm/mod.rs line = 913 path = phd_tests::migrate::from_base::migration_from_base_and_back target = phd_framework::test_vm vm = migration_from_base_and_back_lifecycle_1 vm_id = e198df77-9304-4557-8768-88cb3c8589ae
4042026-10-08T20:48:31.394ZINFOphd-runner: [WAIT_FOR_SERIAL_OUTPUT - EVENT] Waiting for output on serial console file = phd-tests/framework/src/test_vm/mod.rs line = 920 path = phd_tests::migrate::from_base::migration_from_base_and_back target = phd_framework::test_vm timeout_duration = Explicit(15s) vm = migration_from_base_and_back_lifecycle_1 vm_id = e198df77-9304-4557-8768-88cb3c8589ae
4052026-10-08T20:48:31.396ZDEBGphd-runner: [VM CLEANUP - EVENT] Killing Propolis server process file = phd-tests/framework/src/test_vm/server.rs line = 177 path = phd_tests::migrate::from_base::migration_from_base_and_back self.address = 127.0.0.1:9002 target = phd_framework::test_vm::server vm = migration_from_base_and_back_lifecycle_0 vm_id = 3b9577ee-cef2-47fb-8def-8390ae28859b
4062026-10-08T20:48:31.490ZINFOphd-runner: [VM CLEANUP - END] elapsed_milliseconds = 95 file = phd-tests/framework/src/test_vm/mod.rs line = 1172 path = phd_tests::migrate::from_base::migration_from_base_and_back target = phd_framework::test_vm vm = migration_from_base_and_back_lifecycle_0 vm_id = 3b9577ee-cef2-47fb-8def-8390ae28859b
4072026-10-08T20:48:31.490ZINFOphd-runner: [INSTANCE_ENSURE_INTERNAL - END] elapsed_milliseconds = 9443 file = phd-tests/framework/src/test_vm/mod.rs line = 412 path = phd_tests::migrate::from_base::migration_from_base_and_back source = migration_from_base_and_back source_id = 4e2c2233-5961-4277-8aa1-07f4b55b7529 target = phd_framework::test_vm target_id = 3b9577ee-cef2-47fb-8def-8390ae28859b vm = migration_from_base_and_back_lifecycle_0 vm_id = 3b9577ee-cef2-47fb-8def-8390ae28859b
4082026-10-08T20:48:31.490ZINFOphd-runner: [WAIT_FOR_SERIAL_OUTPUT - END] elapsed_milliseconds = 95 file = phd-tests/framework/src/test_vm/mod.rs line = 913 path = phd_tests::migrate::from_base::migration_from_base_and_back target = phd_framework::test_vm vm = migration_from_base_and_back_lifecycle_1 vm_id = e198df77-9304-4557-8768-88cb3c8589ae
4092026-10-08T20:48:31.490ZINFOphd-runner: [MIGRATE_FROM - END] elapsed_milliseconds = 9444 file = phd-tests/framework/src/test_vm/mod.rs line = 609 path = phd_tests::migrate::from_base::migration_from_base_and_back source = migration_from_base_and_back source_id = 4e2c2233-5961-4277-8aa1-07f4b55b7529 target = phd_framework::test_vm target_id = 3b9577ee-cef2-47fb-8def-8390ae28859b
4102026-10-08T20:48:31.490ZINFOphd-runner: [WAIT_FOR_SERIAL_OUTPUT - START] file = phd-tests/framework/src/test_vm/mod.rs line = 913 path = phd_tests::migrate::from_base::migration_from_base_and_back target = phd_framework::test_vm vm = migration_from_base_and_back_lifecycle_1 vm_id = e198df77-9304-4557-8768-88cb3c8589ae
4112026-10-08T20:48:31.490ZINFOphd-runner: [WAIT_FOR_SERIAL_OUTPUT - EVENT] Waiting for output on serial console file = phd-tests/framework/src/test_vm/mod.rs line = 920 path = phd_tests::migrate::from_base::migration_from_base_and_back target = phd_framework::test_vm timeout_duration = Explicit(300s) vm = migration_from_base_and_back_lifecycle_1 vm_id = e198df77-9304-4557-8768-88cb3c8589ae
4122026-10-08T20:48:31.524ZINFOphd-runner: [WAIT_FOR_SERIAL_OUTPUT - END] elapsed_milliseconds = 33 file = phd-tests/framework/src/test_vm/mod.rs line = 913 path = phd_tests::migrate::from_base::migration_from_base_and_back target = phd_framework::test_vm vm = migration_from_base_and_back_lifecycle_1 vm_id = e198df77-9304-4557-8768-88cb3c8589ae
4132026-10-08T20:48:31.524ZINFOphd-runner: [TEST - EVENT] migrating to new Propolis artifact for lifecycle test file = phd-tests/framework/src/lifecycle.rs line = 73 path = phd_tests::migrate::from_base::migration_from_base_and_back propolis_artifact = __DEFAULT_PROPOLIS target = phd_framework::lifecycle vm_name = migration_from_base_and_back
4142026-10-08T20:48:31.524ZINFOphd-runner: [NEW - START] file = phd-tests/framework/src/test_vm/mod.rs line = 300 path = phd_tests::migrate::from_base::migration_from_base_and_back target = phd_framework::test_vm
4152026-10-08T20:48:31.524ZINFOphd-runner: [NEW - EVENT] phd_framework::test_vm environment = EnvironmentSpec { location: Local, propolis_artifact: "__DEFAULT_PROPOLIS", metrics: None } file = phd-tests/framework/src/test_vm/mod.rs guest_os_kind = Alpine line = 318 path = phd_tests::migrate::from_base::migration_from_base_and_back target = phd_framework::test_vm vm_name = migration_from_base_and_back_lifecycle_2
4162026-10-08T20:48:31.524ZDEBGphd-runner: [NEW - EVENT] Verified artifact already exists file = phd-tests/framework/src/artifacts/store.rs line = 45 path = /work/phd-test/propolis-server target = phd_framework::artifacts::store
4172026-10-08T20:48:31.525ZINFOphd-runner: [NEW - EVENT] Launching Propolis server bootrom_path = "/phd-artifacts/740187046a7267d0de72d3455070333547dbc0ea023531471fb2b2a61effa448/OVMF_CODE.fd" file = phd-tests/framework/src/test_vm/server.rs line = 66 path = phd_tests::migrate::from_base::migration_from_base_and_back server_addr = 127.0.0.1:9006 server_path = "/work/phd-test/propolis-server" target = phd_framework::test_vm::server
4182026-10-08T20:48:31.525ZINFOphd-runner: [NEW - EVENT] Opening server log files file = phd-tests/framework/src/log_config.rs line = 84 path = phd_tests::migrate::from_base::migration_from_base_and_back stderr_path = "/tmp/propolis-phd/phd_tests::migrate::from_base::migration_from_base_and_back/migration_from_base_and_back_lifecycle_2.stderr.log" stdout_path = "/tmp/propolis-phd/phd_tests::migrate::from_base::migration_from_base_and_back/migration_from_base_and_back_lifecycle_2.stdout.log" target = phd_framework::log_config
4192026-10-08T20:48:31.579ZINFOphd-runner: [NEW - EVENT] Launched server with pid 949 file = phd-tests/framework/src/test_vm/server.rs line = 127 path = phd_tests::migrate::from_base::migration_from_base_and_back target = phd_framework::test_vm::server
4202026-10-08T20:48:31.594ZINFOphd-runner: [NEW - END] elapsed_milliseconds = 69 file = phd-tests/framework/src/test_vm/mod.rs line = 300 path = phd_tests::migrate::from_base::migration_from_base_and_back target = phd_framework::test_vm
4212026-10-08T20:48:31.594ZINFOphd-runner: [MIGRATE_FROM - START] file = phd-tests/framework/src/test_vm/mod.rs line = 609 path = phd_tests::migrate::from_base::migration_from_base_and_back source = migration_from_base_and_back_lifecycle_1 source_id = e198df77-9304-4557-8768-88cb3c8589ae target = phd_framework::test_vm target_id = 93bde851-21d2-4fcd-8235-db4c858c117e
4222026-10-08T20:48:31.594ZINFOphd-runner: [MIGRATE_FROM - EVENT] Migrating from source at address 127.0.0.1:9004 file = phd-tests/framework/src/test_vm/mod.rs line = 642 migration_id = b368ab1a-e9b6-43bb-bcfe-2d966c3c3fd5 path = phd_tests::migrate::from_base::migration_from_base_and_back source = migration_from_base_and_back_lifecycle_1 source_id = e198df77-9304-4557-8768-88cb3c8589ae target = phd_framework::test_vm target_id = 93bde851-21d2-4fcd-8235-db4c858c117e timeout_duration = 45s
4232026-10-08T20:48:31.594ZINFOphd-runner: [INSTANCE_ENSURE_INTERNAL - START] file = phd-tests/framework/src/test_vm/mod.rs line = 412 path = phd_tests::migrate::from_base::migration_from_base_and_back source = migration_from_base_and_back_lifecycle_1 source_id = e198df77-9304-4557-8768-88cb3c8589ae target = phd_framework::test_vm target_id = 93bde851-21d2-4fcd-8235-db4c858c117e vm = migration_from_base_and_back_lifecycle_2 vm_id = 93bde851-21d2-4fcd-8235-db4c858c117e
4242026-10-08T20:48:31.594ZINFOphd-runner: [INSTANCE_ENSURE_INTERNAL - EVENT] retriable error from instance_spec_ensure e = Communication Error: error sending request for url (http://127.0.0.1:9006/instance) file = phd-tests/framework/src/test_vm/mod.rs line = 455 path = phd_tests::migrate::from_base::migration_from_base_and_back source = migration_from_base_and_back_lifecycle_1 source_id = e198df77-9304-4557-8768-88cb3c8589ae target = phd_framework::test_vm target_id = 93bde851-21d2-4fcd-8235-db4c858c117e vm = migration_from_base_and_back_lifecycle_2 vm_id = 93bde851-21d2-4fcd-8235-db4c858c117e
4252026-10-08T20:48:32.104ZINFOphd-runner: [INSTANCE_ENSURE_INTERNAL - EVENT] Started instance file = phd-tests/framework/src/test_vm/mod.rs instance_description.instance = Instance { properties: InstanceProperties { id: 93bde851-21d2-4fcd-8235-db4c858c117e, name: "phd-vm-93bde851-21d2-4fcd-8235-db4c858c117e", description: "Pheidippides-managed VM", metadata: InstanceMetadata { silo_id: 879caf9e-a300-4a0f-93b1-ade65b3324fc, project_id: b8c12009-2963-4b83-8fbe-4e538cf5e433, sled_id: d7a7da2f-dc4f-46e0-afcc-7c53d196eb7b, sled_serial: "d7a7da2f-dc4f-46e0-afcc-7c53d196eb7b", sled_revision: 1, sled_model: "pheidippes" } }, state: Migrating } line = 514 path = phd_tests::migrate::from_base::migration_from_base_and_back source = migration_from_base_and_back_lifecycle_1 source_id = e198df77-9304-4557-8768-88cb3c8589ae target = phd_framework::test_vm target_id = 93bde851-21d2-4fcd-8235-db4c858c117e vm = migration_from_base_and_back_lifecycle_2 vm_id = 93bde851-21d2-4fcd-8235-db4c858c117e
4262026-10-08T20:48:32.104ZINFOphd-runner: [MIGRATE - START] file = phd-tests/framework/src/test_vm/mod.rs line = 663 migration_id = b368ab1a-e9b6-43bb-bcfe-2d966c3c3fd5 path = phd_tests::migrate::from_base::migration_from_base_and_back source = migration_from_base_and_back_lifecycle_1 source_id = e198df77-9304-4557-8768-88cb3c8589ae target = phd_framework::test_vm target_id = 93bde851-21d2-4fcd-8235-db4c858c117e
4272026-10-08T20:48:34.655ZINFOphd-runner: [SERIAL CONSOLE TASK - EVENT] serial socket control message file = phd-tests/framework/src/serial/mod.rs line = 275 s = {"Migrating":{"destination":"127.0.0.1:9006","from_start":7941}} target = phd_framework::serial
4282026-10-08T20:48:36.479ZINFOphd-runner: [MIGRATE_FROM - EVENT] Migration completed successfully file = phd-tests/framework/src/test_vm/mod.rs line = 676 path = phd_tests::migrate::from_base::migration_from_base_and_back source = migration_from_base_and_back_lifecycle_1 source_id = e198df77-9304-4557-8768-88cb3c8589ae target = phd_framework::test_vm target_id = 93bde851-21d2-4fcd-8235-db4c858c117e
4292026-10-08T20:48:36.479ZINFOphd-runner: [MIGRATE - END] elapsed_milliseconds = 4373 file = phd-tests/framework/src/test_vm/mod.rs line = 663 migration_id = b368ab1a-e9b6-43bb-bcfe-2d966c3c3fd5 path = phd_tests::migrate::from_base::migration_from_base_and_back source = migration_from_base_and_back_lifecycle_1 source_id = e198df77-9304-4557-8768-88cb3c8589ae target = phd_framework::test_vm target_id = 93bde851-21d2-4fcd-8235-db4c858c117e
4302026-10-08T20:48:36.481ZINFOphd-runner: [VM CLEANUP - START] file = phd-tests/framework/src/test_vm/mod.rs line = 1172 path = phd_tests::migrate::from_base::migration_from_base_and_back target = phd_framework::test_vm vm = migration_from_base_and_back_lifecycle_1 vm_id = e198df77-9304-4557-8768-88cb3c8589ae
4312026-10-08T20:48:36.482ZINFOphd-runner: [WAIT_FOR_SERIAL_OUTPUT - START] file = phd-tests/framework/src/test_vm/mod.rs line = 913 path = phd_tests::migrate::from_base::migration_from_base_and_back target = phd_framework::test_vm vm = migration_from_base_and_back_lifecycle_2 vm_id = 93bde851-21d2-4fcd-8235-db4c858c117e
4322026-10-08T20:48:36.482ZINFOphd-runner: [WAIT_FOR_SERIAL_OUTPUT - EVENT] Waiting for output on serial console file = phd-tests/framework/src/test_vm/mod.rs line = 920 path = phd_tests::migrate::from_base::migration_from_base_and_back target = phd_framework::test_vm timeout_duration = Explicit(15s) vm = migration_from_base_and_back_lifecycle_2 vm_id = 93bde851-21d2-4fcd-8235-db4c858c117e
4332026-10-08T20:48:36.483ZDEBGphd-runner: [VM CLEANUP - EVENT] Killing Propolis server process file = phd-tests/framework/src/test_vm/server.rs line = 177 path = phd_tests::migrate::from_base::migration_from_base_and_back self.address = 127.0.0.1:9004 target = phd_framework::test_vm::server vm = migration_from_base_and_back_lifecycle_1 vm_id = e198df77-9304-4557-8768-88cb3c8589ae
4342026-10-08T20:48:36.561ZINFOphd-runner: [VM CLEANUP - END] elapsed_milliseconds = 79 file = phd-tests/framework/src/test_vm/mod.rs line = 1172 path = phd_tests::migrate::from_base::migration_from_base_and_back target = phd_framework::test_vm vm = migration_from_base_and_back_lifecycle_1 vm_id = e198df77-9304-4557-8768-88cb3c8589ae
4352026-10-08T20:48:36.561ZINFOphd-runner: [INSTANCE_ENSURE_INTERNAL - END] elapsed_milliseconds = 9369 file = phd-tests/framework/src/test_vm/mod.rs line = 412 path = phd_tests::migrate::from_base::migration_from_base_and_back source = migration_from_base_and_back_lifecycle_0 source_id = 3b9577ee-cef2-47fb-8def-8390ae28859b target = phd_framework::test_vm target_id = e198df77-9304-4557-8768-88cb3c8589ae vm = migration_from_base_and_back_lifecycle_1 vm_id = e198df77-9304-4557-8768-88cb3c8589ae
4362026-10-08T20:48:36.561ZINFOphd-runner: [MIGRATE_FROM - END] elapsed_milliseconds = 9370 file = phd-tests/framework/src/test_vm/mod.rs line = 609 path = phd_tests::migrate::from_base::migration_from_base_and_back source = migration_from_base_and_back_lifecycle_0 source_id = 3b9577ee-cef2-47fb-8def-8390ae28859b target = phd_framework::test_vm target_id = e198df77-9304-4557-8768-88cb3c8589ae
4372026-10-08T20:48:36.561ZINFOphd-runner: [WAIT_FOR_SERIAL_OUTPUT - END] elapsed_milliseconds = 79 file = phd-tests/framework/src/test_vm/mod.rs line = 913 path = phd_tests::migrate::from_base::migration_from_base_and_back target = phd_framework::test_vm vm = migration_from_base_and_back_lifecycle_2 vm_id = 93bde851-21d2-4fcd-8235-db4c858c117e
4382026-10-08T20:48:36.561ZINFOphd-runner: [WAIT_FOR_SERIAL_OUTPUT - START] file = phd-tests/framework/src/test_vm/mod.rs line = 913 path = phd_tests::migrate::from_base::migration_from_base_and_back target = phd_framework::test_vm vm = migration_from_base_and_back_lifecycle_2 vm_id = 93bde851-21d2-4fcd-8235-db4c858c117e
4392026-10-08T20:48:36.562ZINFOphd-runner: [WAIT_FOR_SERIAL_OUTPUT - EVENT] Waiting for output on serial console file = phd-tests/framework/src/test_vm/mod.rs line = 920 path = phd_tests::migrate::from_base::migration_from_base_and_back target = phd_framework::test_vm timeout_duration = Explicit(300s) vm = migration_from_base_and_back_lifecycle_2 vm_id = 93bde851-21d2-4fcd-8235-db4c858c117e
4402026-10-08T20:48:36.593ZINFOphd-runner: [WAIT_FOR_SERIAL_OUTPUT - END] elapsed_milliseconds = 31 file = phd-tests/framework/src/test_vm/mod.rs line = 913 path = phd_tests::migrate::from_base::migration_from_base_and_back target = phd_framework::test_vm vm = migration_from_base_and_back_lifecycle_2 vm_id = 93bde851-21d2-4fcd-8235-db4c858c117e
4412026-10-08T20:48:36.594ZINFOphd-runner: [VM CLEANUP - START] file = phd-tests/framework/src/test_vm/mod.rs line = 1172 path = phd_tests::migrate::from_base::migration_from_base_and_back target = phd_framework::test_vm vm = migration_from_base_and_back_lifecycle_2 vm_id = 93bde851-21d2-4fcd-8235-db4c858c117e
4422026-10-08T20:48:36.594ZDEBGphd-runner: [SERIAL CONSOLE TASK - EVENT] serial console command channel was closed file = phd-tests/framework/src/serial/mod.rs line = 213 target = phd_framework::serial
4432026-10-08T20:48:36.594ZINFOphd-runner: [SERIAL CONSOLE TASK - END] elapsed_milliseconds = 19528 file = phd-tests/framework/src/serial/mod.rs line = 200 target = phd_framework::serial
4442026-10-08T20:48:36.594ZINFOphd-runner: test phd_tests::migrate::from_base::migration_from_base_and_back ... ok file = phd-tests/runner/src/execute.rs line = 141 target = phd_runner::execute
4452026-10-08T20:48:36.594ZINFOphd-runner: [TEST_CLEANUP - START] file = phd-tests/runner/src/fixtures.rs line = 51 target = phd_runner::fixtures
4462026-10-08T20:48:36.596ZDEBGphd-runner: [VM CLEANUP - EVENT] trying to ensure Propolis server VM is destroyed file = phd-tests/framework/src/test_vm/mod.rs line = 1195 path = phd_tests::migrate::from_base::migration_from_base_and_back target = phd_framework::test_vm vm = migration_from_base_and_back_lifecycle_2 vm_id = 93bde851-21d2-4fcd-8235-db4c858c117e
4472026-10-08T20:48:36.987ZDEBGphd-runner: [VM CLEANUP - EVENT] Killing Propolis server process file = phd-tests/framework/src/test_vm/server.rs line = 177 path = phd_tests::migrate::from_base::migration_from_base_and_back self.address = 127.0.0.1:9006 target = phd_framework::test_vm::server vm = migration_from_base_and_back_lifecycle_2 vm_id = 93bde851-21d2-4fcd-8235-db4c858c117e
4482026-10-08T20:48:37.075ZDEBGphd-runner: [VM CLEANUP - EVENT] zfs clone dropped file = phd-tests/framework/src/zfs.rs line = 83 path = phd_tests::migrate::from_base::migration_from_base_and_back target = phd_framework::zfs vm = migration_from_base_and_back_lifecycle_2 vm_id = 93bde851-21d2-4fcd-8235-db4c858c117e
4492026-10-08T20:48:37.075ZDEBGphd-runner: [VM CLEANUP - EVENT] executing ZFS command args = ["phd-artifacts/phd-clone-275cd6da-f407-4ca0-bfeb-9edde3a64e21"] file = phd-tests/framework/src/zfs.rs line = 304 path = phd_tests::migrate::from_base::migration_from_base_and_back target = phd_framework::zfs verb = destroy vm = migration_from_base_and_back_lifecycle_2 vm_id = 93bde851-21d2-4fcd-8235-db4c858c117e
4502026-10-08T20:48:37.102ZDEBGphd-runner: [VM CLEANUP - EVENT] zfs snapshot dropped file = phd-tests/framework/src/zfs.rs line = 57 path = phd_tests::migrate::from_base::migration_from_base_and_back target = phd_framework::zfs vm = migration_from_base_and_back_lifecycle_2 vm_id = 93bde851-21d2-4fcd-8235-db4c858c117e
4512026-10-08T20:48:37.102ZDEBGphd-runner: [VM CLEANUP - EVENT] executing ZFS command args = ["phd-artifacts@phd-876421ab-11a3-4a5a-a341-23e0271ba410"] file = phd-tests/framework/src/zfs.rs line = 304 path = phd_tests::migrate::from_base::migration_from_base_and_back target = phd_framework::zfs verb = destroy vm = migration_from_base_and_back_lifecycle_2 vm_id = 93bde851-21d2-4fcd-8235-db4c858c117e
4522026-10-08T20:48:37.120ZINFOphd-runner: [VM CLEANUP - END] elapsed_milliseconds = 526 file = phd-tests/framework/src/test_vm/mod.rs line = 1172 path = phd_tests::migrate::from_base::migration_from_base_and_back target = phd_framework::test_vm vm = migration_from_base_and_back_lifecycle_2 vm_id = 93bde851-21d2-4fcd-8235-db4c858c117e
4532026-10-08T20:48:37.120ZINFOphd-runner: [TEST_CLEANUP - END] elapsed_milliseconds = 525 file = phd-tests/runner/src/fixtures.rs line = 51 target = phd_runner::fixtures
4542026-10-08T20:48:37.120ZINFOphd-runner: [INSTANCE_ENSURE_INTERNAL - END] elapsed_milliseconds = 5525 file = phd-tests/framework/src/test_vm/mod.rs line = 412 path = phd_tests::migrate::from_base::migration_from_base_and_back source = migration_from_base_and_back_lifecycle_1 source_id = e198df77-9304-4557-8768-88cb3c8589ae target = phd_framework::test_vm target_id = 93bde851-21d2-4fcd-8235-db4c858c117e vm = migration_from_base_and_back_lifecycle_2 vm_id = 93bde851-21d2-4fcd-8235-db4c858c117e
4552026-10-08T20:48:37.121ZINFOphd-runner: [EXECUTION_CLEANUP - START] file = phd-tests/runner/src/fixtures.rs line = 35 target = phd_runner::fixtures
4562026-10-08T20:48:37.121ZINFOphd-runner: [MIGRATE_FROM - END] elapsed_milliseconds = 5526 file = phd-tests/framework/src/test_vm/mod.rs line = 609 path = phd_tests::migrate::from_base::migration_from_base_and_back source = migration_from_base_and_back_lifecycle_1 source_id = e198df77-9304-4557-8768-88cb3c8589ae target = phd_framework::test_vm target_id = 93bde851-21d2-4fcd-8235-db4c858c117e
4572026-10-08T20:48:37.121ZINFOphd-runner: [TEST - END] elapsed_milliseconds = 20588 file = phd-tests/tests/src/migrate.rs line = 52 path = phd_tests::migrate::from_base::migration_from_base_and_back target = phd_tests::migrate::from_base
4582026-10-08T20:48:37.121ZINFOphd-runner: [EXECUTION_CLEANUP - END] elapsed_milliseconds = 0 file = phd-tests/runner/src/fixtures.rs line = 35 target = phd_runner::fixtures
459 test result: ok. 3 passed; 0 failed; 0 skipped; 0 not run; finished in 89.19s
460 
4612026-10-08T20:48:37.122ZDEBGphd-runner: phd_runner exit_code = 0 file = phd-tests/runner/src/main.rs line = 41 target = phd_runner