| 1 | 2026-10-12T21:19:57.562Z | INFO | phd-runner: phd_runner
file = phd-tests/runner/src/main.rs
line = 36
runner_args = ProcessArgs { command: Run(RunOptions { propolis_server_cmd: "/work/phd-test/propolis-server", base_propolis_branch: Some("master"), base_propolis_commit: None, base_propolis_cmd: None, crucible_downstairs_cmd: None, crucible_downstairs_commit: Some(Auto), tmp_directory: "/tmp/propolis-phd", artifact_directory: Some("/phd-artifacts"), output_mode: TmpFile, default_guest_cpus: 2, default_guest_memory_mib: 512, artifact_toml_path: "/work/phd-test/artifacts.toml", default_guest_artifact: "alpine", default_bootrom_artifact: "ovmf", include_filter: ["phd_tests::migrate::from_base"], exclude_filter: [], max_buildomat_wait_secs: 1200, manual_stop_on_failure: false }), disable_ansi: false, emit_bunyan: true }
target = phd_runner
|
| 2 | 2026-10-12T21:19:57.591Z | DEBG | phd-runner: Created new artifact store from manifest
file = phd-tests/framework/src/artifacts/store.rs
line = 219
store = Store { local_dir: "/phd-artifacts", artifacts: {"alpine": Mutex { data: StoredArtifact { description: Artifact { filename: "alpine.iso", kind: GuestOs(Alpine), source: RemoteServer { sha256: "ba8007f74f9b54fbae3b2520da577831b4834778a498d732f091260c61aa7ca1" }, untar: None }, cached_path: None } }, "ovmf": Mutex { data: StoredArtifact { description: Artifact { filename: "OVMF_CODE.fd", kind: Bootrom, source: Buildomat(BuildomatArtifact { repo: Repo("oxidecomputer/edk2"), series: Series("image_debug"), commit: Commit("bf64f45b1a58e69d126a3c6ca1e4512c88668132"), sha256: "740187046a7267d0de72d3455070333547dbc0ea023531471fb2b2a61effa448" }), untar: None }, cached_path: None } }}, downloader: DownloadConfig { timeout: 600s, buildomat_backoff: ExponentialBackoff { current_interval: 1s, initial_interval: 1s, randomization_factor: 0.5, multiplier: 1.5, max_interval: 60s, start_time: Instant { tv_sec: 246, tv_nsec: 809512993 }, max_elapsed_time: Some(1200s), clock: SystemClock }, remote_server_uris: ["https://oxide-omicron-build.s3.amazonaws.com"] } }
target = phd_framework::artifacts::store
|
| 3 | 2026-10-12T21:19:57.591Z | INFO | phd-runner: Adding Propolis server from local command
file = phd-tests/framework/src/artifacts/store.rs
line = 227
propolis_server_cmd = /work/phd-test/propolis-server
target = phd_framework::artifacts::store
|
| 4 | 2026-10-12T21:19:57.593Z | INFO | phd-runner: Adding crucible-downstairs from Buildomat Git revision
commit = bd62980710dd3d6d3524aa7f6617127942b75002
file = phd-tests/framework/src/artifacts/store.rs
line = 311
target = phd_framework::artifacts::store
|
| 5 | 2026-10-12T21:19:57.596Z | DEBG | phd-runner: Downloading file from Buildomat...
file = phd-tests/framework/src/artifacts/buildomat.rs
line = 215
target = phd_framework::artifacts::buildomat
timeout = 600s
uri = https://buildomat.eng.oxide.computer/public/file/oxidecomputer/crucible/nightly-image/bd62980710dd3d6d3524aa7f6617127942b75002/crucible-nightly.sha256.txt
|
| 6 | 2026-10-12T21:19:57.852Z | INFO | phd-runner: Adding 'current' Propolis server from Buildomat Git branch 'master'
file = phd-tests/framework/src/artifacts/store.rs
line = 248
target = phd_framework::artifacts::store
|
| 7 | 2026-10-12T21:19:58.469Z | DEBG | phd-runner: Downloading file from Buildomat...
file = phd-tests/framework/src/artifacts/buildomat.rs
line = 215
target = phd_framework::artifacts::buildomat
timeout = 600s
uri = https://buildomat.eng.oxide.computer/public/file/oxidecomputer/propolis/phd_build/65886117ca3b32994b7a77f1436d55b716a1d5f8/propolis-server.sha256.txt
|
| 8 | 2026-10-12T21:19:58.654Z | INFO | phd-runner: [EXECUTION_SETUP - START]
file = phd-tests/runner/src/fixtures.rs
line = 25
target = phd_runner::fixtures
|
| 9 | 2026-10-12T21:19:58.655Z | INFO | phd-runner: [EXECUTION_SETUP - END]
elapsed_milliseconds = 0
file = phd-tests/runner/src/fixtures.rs
line = 25
target = phd_runner::fixtures
|
| 10 | 2026-10-12T21:19:58.657Z | INFO | phd-runner: Running 3 test(s)
file = phd-tests/runner/src/execute.rs
line = 83
target = phd_runner::execute
|
| 11 | 2026-10-12T21:19:58.658Z | INFO | phd-runner: Starting test phd_tests::migrate::from_base::serial_history
file = phd-tests/runner/src/execute.rs
line = 91
target = phd_runner::execute
|
| 12 | 2026-10-12T21:19:58.658Z | INFO | phd-runner: [TEST_SETUP - START]
file = phd-tests/runner/src/fixtures.rs
line = 41
target = phd_runner::fixtures
|
| 13 | 2026-10-12T21:19:58.658Z | INFO | phd-runner: [TEST_SETUP - END]
elapsed_milliseconds = 0
file = phd-tests/runner/src/fixtures.rs
line = 41
target = phd_runner::fixtures
|
| 14 | 2026-10-12T21:19:58.661Z | INFO | phd-runner: [TEST - START]
file = phd-tests/tests/src/migrate.rs
line = 40
path = phd_tests::migrate::from_base::serial_history
target = phd_tests::migrate::from_base
|
| 15 | 2026-10-12T21:19:58.666Z | DEBG | phd-runner: [TEST - EVENT] checking for existing copy of artifact
file = phd-tests/framework/src/artifacts/store.rs
line = 89
maybe_path = /phd-artifacts/740187046a7267d0de72d3455070333547dbc0ea023531471fb2b2a61effa448/OVMF_CODE.fd
path = phd_tests::migrate::from_base::serial_history
target = phd_framework::artifacts::store
|
| 16 | 2026-10-12T21:19:58.670Z | DEBG | phd-runner: [TEST - EVENT] Downloading file from Buildomat...
file = phd-tests/framework/src/artifacts/buildomat.rs
line = 215
path = phd_tests::migrate::from_base::serial_history
target = phd_framework::artifacts::buildomat
timeout = 600s
uri = https://buildomat.eng.oxide.computer/public/file/oxidecomputer/edk2/image_debug/bf64f45b1a58e69d126a3c6ca1e4512c88668132/OVMF_CODE.fd
|
| 17 | 2026-10-12T21:19:59.191Z | DEBG | phd-runner: [TEST - EVENT] checking for existing copy of artifact
file = phd-tests/framework/src/artifacts/store.rs
line = 89
maybe_path = /phd-artifacts/ba8007f74f9b54fbae3b2520da577831b4834778a498d732f091260c61aa7ca1/alpine.iso
path = phd_tests::migrate::from_base::serial_history
target = phd_framework::artifacts::store
|
| 18 | 2026-10-12T21:19:59.203Z | DEBG | phd-runner: [TEST - EVENT] Downloading alpine.iso from https://oxide-omicron-build.s3.amazonaws.com/alpine.iso
file = phd-tests/framework/src/artifacts/store.rs
line = 614
path = phd_tests::migrate::from_base::serial_history
target = phd_framework::artifacts::store
timeout = 600s
|
| 19 | 2026-10-12T21:20:05.985Z | DEBG | phd-runner: [TEST - EVENT] Verified artifact already exists
file = phd-tests/framework/src/artifacts/store.rs
line = 45
path = /phd-artifacts/ba8007f74f9b54fbae3b2520da577831b4834778a498d732f091260c61aa7ca1/alpine.iso
target = phd_framework::artifacts::store
|
| 20 | 2026-10-12T21:20:05.986Z | DEBG | phd-runner: [TEST - EVENT] executing ZFS command
args = ["/phd-artifacts/ba8007f74f9b54fbae3b2520da577831b4834778a498d732f091260c61aa7ca1/alpine.iso"]
file = phd-tests/framework/src/zfs.rs
line = 304
path = phd_tests::migrate::from_base::serial_history
target = phd_framework::zfs
verb = list
|
| 21 | 2026-10-12T21:20:06.002Z | DEBG | phd-runner: [TEST - EVENT] parsing zfs list output
file = phd-tests/framework/src/zfs.rs
line = 238
path = phd_tests::migrate::from_base::serial_history
stdout = NAME USED AVAIL REFER MOUNTPOINT\nphd-artifacts 3.86M 25.3T 2M /phd-artifacts\n
target = phd_framework::zfs
|
| 22 | 2026-10-12T21:20:06.004Z | DEBG | phd-runner: [TEST - EVENT] executing ZFS command
args = ["phd-artifacts@phd-29396787-a836-4a53-b6a6-f35d19aa2022"]
file = phd-tests/framework/src/zfs.rs
line = 304
path = phd_tests::migrate::from_base::serial_history
target = phd_framework::zfs
verb = snapshot
|
| 23 | 2026-10-12T21:20:06.028Z | DEBG | phd-runner: [TEST - EVENT] executing ZFS command
args = ["phd-artifacts@phd-29396787-a836-4a53-b6a6-f35d19aa2022", "phd-artifacts/phd-clone-9c6e1033-398f-4f6f-b42b-acc4e9dd8d83"]
file = phd-tests/framework/src/zfs.rs
line = 304
path = phd_tests::migrate::from_base::serial_history
target = phd_framework::zfs
verb = clone
|
| 24 | 2026-10-12T21:20:06.045Z | DEBG | phd-runner: [TEST - EVENT] executing ZFS command
args = ["phd-artifacts/phd-clone-9c6e1033-398f-4f6f-b42b-acc4e9dd8d83"]
file = phd-tests/framework/src/zfs.rs
line = 304
path = phd_tests::migrate::from_base::serial_history
target = phd_framework::zfs
verb = list
|
| 25 | 2026-10-12T21:20:06.056Z | DEBG | phd-runner: [TEST - EVENT] parsing zfs list output
file = phd-tests/framework/src/zfs.rs
line = 238
path = phd_tests::migrate::from_base::serial_history
stdout = NAME USED AVAIL REFER MOUNTPOINT\nphd-artifacts/phd-clone-9c6e1033-398f-4f6f-b42b-acc4e9dd8d83 0B 25.3T 49.0M /phd-artifacts/phd-clone-9c6e1033-398f-4f6f-b42b-acc4e9dd8d83\n
target = phd_framework::zfs
|
| 26 | 2026-10-12T21:20:06.060Z | INFO | phd-runner: [NEW - START]
file = phd-tests/framework/src/test_vm/mod.rs
line = 300
path = phd_tests::migrate::from_base::serial_history
target = phd_framework::test_vm
|
| 27 | 2026-10-12T21:20:06.060Z | INFO | phd-runner: [NEW - EVENT] phd_framework::test_vm
environment = EnvironmentSpec { location: Local, propolis_artifact: "__BASE_PROPOLIS", metrics: None }
file = phd-tests/framework/src/test_vm/mod.rs
guest_os_kind = Alpine
line = 318
path = phd_tests::migrate::from_base::serial_history
target = phd_framework::test_vm
vm_name = migration_serial_history_base
|
| 28 | 2026-10-12T21:20:06.060Z | DEBG | phd-runner: [NEW - EVENT] checking for existing copy of artifact
file = phd-tests/framework/src/artifacts/store.rs
line = 89
maybe_path = /phd-artifacts/c0d9344f91d563c7ab06bccfd2aae4b75c245ada57f0262eac2fd4a28094086e/propolis-server.tar.gz
path = phd_tests::migrate::from_base::serial_history
target = phd_framework::artifacts::store
|
| 29 | 2026-10-12T21:20:06.060Z | DEBG | phd-runner: [NEW - EVENT] Downloading file from Buildomat...
file = phd-tests/framework/src/artifacts/buildomat.rs
line = 215
path = phd_tests::migrate::from_base::serial_history
target = phd_framework::artifacts::buildomat
timeout = 600s
uri = https://buildomat.eng.oxide.computer/public/file/oxidecomputer/propolis/phd_build/65886117ca3b32994b7a77f1436d55b716a1d5f8/propolis-server.tar.gz
|
| 30 | 2026-10-12T21:20:20.627Z | DEBG | phd-runner: [NEW - EVENT] Extracting artifact from tarball
extracted_path = /phd-artifacts/c0d9344f91d563c7ab06bccfd2aae4b75c245ada57f0262eac2fd4a28094086e/propolis-server
file = phd-tests/framework/src/artifacts/store.rs
line = 160
path = phd_tests::migrate::from_base::serial_history
target = phd_framework::artifacts::store
untar_path = propolis-server
|
| 31 | 2026-10-12T21:20:20.627Z | DEBG | phd-runner: [NEW - EVENT] Extracting gzipped tarball...
file = phd-tests/framework/src/artifacts/store.rs
line = 514
path = phd_tests::migrate::from_base::serial_history
target = phd_framework::artifacts::store
|
| 32 | 2026-10-12T21:20:45.692Z | INFO | phd-runner: [NEW - EVENT] Launching Propolis server
bootrom_path = "/phd-artifacts/740187046a7267d0de72d3455070333547dbc0ea023531471fb2b2a61effa448/OVMF_CODE.fd"
file = phd-tests/framework/src/test_vm/server.rs
line = 66
path = phd_tests::migrate::from_base::serial_history
server_addr = 127.0.0.1:9000
server_path = "/phd-artifacts/c0d9344f91d563c7ab06bccfd2aae4b75c245ada57f0262eac2fd4a28094086e/propolis-server"
target = phd_framework::test_vm::server
|
| 33 | 2026-10-12T21:20:45.692Z | INFO | phd-runner: [NEW - EVENT] Opening server log files
file = phd-tests/framework/src/log_config.rs
line = 84
path = phd_tests::migrate::from_base::serial_history
stderr_path = "/tmp/propolis-phd/phd_tests::migrate::from_base::serial_history/migration_serial_history_base.stderr.log"
stdout_path = "/tmp/propolis-phd/phd_tests::migrate::from_base::serial_history/migration_serial_history_base.stdout.log"
target = phd_framework::log_config
|
| 34 | 2026-10-12T21:20:45.808Z | INFO | phd-runner: [NEW - EVENT] Launched server with pid 917
file = phd-tests/framework/src/test_vm/server.rs
line = 127
path = phd_tests::migrate::from_base::serial_history
target = phd_framework::test_vm::server
|
| 35 | 2026-10-12T21:20:45.824Z | INFO | phd-runner: [INSTANCE_ENSURE_INTERNAL - START]
file = phd-tests/framework/src/test_vm/mod.rs
line = 412
path = phd_tests::migrate::from_base::serial_history
target = phd_framework::test_vm
vm = migration_serial_history_base
vm_id = 6da8da09-f204-4716-ac65-7bea91e6272d
|
| 36 | 2026-10-12T21:20:45.832Z | INFO | phd-runner: [INSTANCE_ENSURE_INTERNAL - EVENT] retriable error from instance_spec_ensure
e = Communication Error: error sending request for url (http://127.0.0.1:9000/instance)
file = phd-tests/framework/src/test_vm/mod.rs
line = 455
path = phd_tests::migrate::from_base::serial_history
target = phd_framework::test_vm
vm = migration_serial_history_base
vm_id = 6da8da09-f204-4716-ac65-7bea91e6272d
|
| 37 | 2026-10-12T21:20:45.835Z | INFO | phd-runner: [NEW - END]
elapsed_milliseconds = 39774
file = phd-tests/framework/src/test_vm/mod.rs
line = 300
path = phd_tests::migrate::from_base::serial_history
target = phd_framework::test_vm
|
| 38 | 2026-10-12T21:20:46.686Z | INFO | phd-runner: [SERIAL CONSOLE TASK - START]
file = phd-tests/framework/src/serial/mod.rs
line = 200
target = phd_framework::serial
|
| 39 | 2026-10-12T21:20:46.692Z | INFO | phd-runner: [INSTANCE_ENSURE_INTERNAL - EVENT] Started instance
file = phd-tests/framework/src/test_vm/mod.rs
instance_description.instance = Instance { properties: InstanceProperties { id: 6da8da09-f204-4716-ac65-7bea91e6272d, name: "phd-vm-6da8da09-f204-4716-ac65-7bea91e6272d", description: "Pheidippides-managed VM", metadata: InstanceMetadata { silo_id: edcd5662-a4ea-4dc9-82c8-5b5dcbfa5b41, project_id: d38cc3a5-7d3e-44e2-b01b-4490009ffa3b, sled_id: 948cbcc0-5530-485e-b0aa-f4983a04887b, sled_serial: "948cbcc0-5530-485e-b0aa-f4983a04887b", sled_revision: 1, sled_model: "pheidippes" } }, state: Creating }
line = 514
path = phd_tests::migrate::from_base::serial_history
target = phd_framework::test_vm
vm = migration_serial_history_base
vm_id = 6da8da09-f204-4716-ac65-7bea91e6272d
|
| 40 | 2026-10-12T21:20:46.692Z | INFO | phd-runner: [PUT_INSTANCE_STATE - START]
file = phd-tests/framework/src/test_vm/mod.rs
line = 575
path = phd_tests::migrate::from_base::serial_history
target = phd_framework::test_vm
vm = migration_serial_history_base
vm_id = 6da8da09-f204-4716-ac65-7bea91e6272d
|
| 41 | 2026-10-12T21:20:46.692Z | INFO | phd-runner: [PUT_INSTANCE_STATE - EVENT] Requesting instance state change
file = phd-tests/framework/src/test_vm/mod.rs
line = 580
path = phd_tests::migrate::from_base::serial_history
state = Run
target = phd_framework::test_vm
vm = migration_serial_history_base
vm_id = 6da8da09-f204-4716-ac65-7bea91e6272d
|
| 42 | 2026-10-12T21:20:46.694Z | INFO | phd-runner: [PUT_INSTANCE_STATE - END]
elapsed_milliseconds = 1
file = phd-tests/framework/src/test_vm/mod.rs
line = 575
path = phd_tests::migrate::from_base::serial_history
target = phd_framework::test_vm
vm = migration_serial_history_base
vm_id = 6da8da09-f204-4716-ac65-7bea91e6272d
|
| 43 | 2026-10-12T21:20:46.696Z | INFO | phd-runner: [WAIT_TO_BOOT - START]
file = phd-tests/framework/src/test_vm/mod.rs
line = 890
path = phd_tests::migrate::from_base::serial_history
target = phd_framework::test_vm
|
| 44 | 2026-10-12T21:20:46.696Z | INFO | phd-runner: [WAIT_TO_BOOT - EVENT] waiting for guest to boot
file = phd-tests/framework/src/test_vm/mod.rs
line = 839
path = phd_tests::migrate::from_base::serial_history
target = phd_framework::test_vm
timeout_duration = 300s
vm = migration_serial_history_base
vm_id = 6da8da09-f204-4716-ac65-7bea91e6272d
|
| 45 | 2026-10-12T21:20:46.696Z | DEBG | phd-runner: [WAIT_TO_BOOT - EVENT] executing command in boot sequence
file = phd-tests/framework/src/test_vm/mod.rs
line = 847
path = phd_tests::migrate::from_base::serial_history
step = WaitFor("localhost login: ")
target = phd_framework::test_vm
|
| 46 | 2026-10-12T21:20:46.696Z | INFO | phd-runner: [WAIT_FOR_SERIAL_OUTPUT - START]
file = phd-tests/framework/src/test_vm/mod.rs
line = 913
path = phd_tests::migrate::from_base::serial_history
target = phd_framework::test_vm
vm = migration_serial_history_base
vm_id = 6da8da09-f204-4716-ac65-7bea91e6272d
|
| 47 | 2026-10-12T21:20:46.697Z | INFO | phd-runner: [WAIT_FOR_SERIAL_OUTPUT - EVENT] Waiting for output on serial console
file = phd-tests/framework/src/test_vm/mod.rs
line = 920
path = phd_tests::migrate::from_base::serial_history
target = phd_framework::test_vm
timeout_duration = CallerTimeout
vm = migration_serial_history_base
vm_id = 6da8da09-f204-4716-ac65-7bea91e6272d
|
| 48 | 2026-10-12T21:20:51.329Z | INFO | phd-runner: [WAIT_FOR_SERIAL_OUTPUT - END]
elapsed_milliseconds = 4632
file = phd-tests/framework/src/test_vm/mod.rs
line = 913
path = phd_tests::migrate::from_base::serial_history
target = phd_framework::test_vm
vm = migration_serial_history_base
vm_id = 6da8da09-f204-4716-ac65-7bea91e6272d
|
| 49 | 2026-10-12T21:20:51.329Z | DEBG | phd-runner: [WAIT_TO_BOOT - EVENT] executing command in boot sequence
file = phd-tests/framework/src/test_vm/mod.rs
line = 847
path = phd_tests::migrate::from_base::serial_history
step = WriteStr("root")
target = phd_framework::test_vm
|
| 50 | 2026-10-12T21:20:51.332Z | DEBG | phd-runner: [WAIT_TO_BOOT - EVENT] executing command in boot sequence
file = phd-tests/framework/src/test_vm/mod.rs
line = 847
path = phd_tests::migrate::from_base::serial_history
step = WaitFor("localhost:~#")
target = phd_framework::test_vm
|
| 51 | 2026-10-12T21:20:51.332Z | INFO | phd-runner: [WAIT_FOR_SERIAL_OUTPUT - START]
file = phd-tests/framework/src/test_vm/mod.rs
line = 913
path = phd_tests::migrate::from_base::serial_history
target = phd_framework::test_vm
vm = migration_serial_history_base
vm_id = 6da8da09-f204-4716-ac65-7bea91e6272d
|
| 52 | 2026-10-12T21:20:51.332Z | INFO | phd-runner: [WAIT_FOR_SERIAL_OUTPUT - EVENT] Waiting for output on serial console
file = phd-tests/framework/src/test_vm/mod.rs
line = 920
path = phd_tests::migrate::from_base::serial_history
target = phd_framework::test_vm
timeout_duration = CallerTimeout
vm = migration_serial_history_base
vm_id = 6da8da09-f204-4716-ac65-7bea91e6272d
|
| 53 | 2026-10-12T21:20:51.358Z | INFO | phd-runner: [WAIT_FOR_SERIAL_OUTPUT - END]
elapsed_milliseconds = 25
file = phd-tests/framework/src/test_vm/mod.rs
line = 913
path = phd_tests::migrate::from_base::serial_history
target = phd_framework::test_vm
vm = migration_serial_history_base
vm_id = 6da8da09-f204-4716-ac65-7bea91e6272d
|
| 54 | 2026-10-12T21:20:51.358Z | DEBG | phd-runner: [WAIT_TO_BOOT - EVENT] executing command in boot sequence
file = phd-tests/framework/src/test_vm/mod.rs
line = 847
path = phd_tests::migrate::from_base::serial_history
step = WriteStr("stty -F `tty` cols 9999")
target = phd_framework::test_vm
|
| 55 | 2026-10-12T21:20:51.358Z | DEBG | phd-runner: [WAIT_TO_BOOT - EVENT] executing command in boot sequence
file = phd-tests/framework/src/test_vm/mod.rs
line = 847
path = phd_tests::migrate::from_base::serial_history
step = WaitFor("localhost:~#")
target = phd_framework::test_vm
|
| 56 | 2026-10-12T21:20:51.358Z | INFO | phd-runner: [WAIT_FOR_SERIAL_OUTPUT - START]
file = phd-tests/framework/src/test_vm/mod.rs
line = 913
path = phd_tests::migrate::from_base::serial_history
target = phd_framework::test_vm
vm = migration_serial_history_base
vm_id = 6da8da09-f204-4716-ac65-7bea91e6272d
|
| 57 | 2026-10-12T21:20:51.358Z | INFO | phd-runner: [WAIT_FOR_SERIAL_OUTPUT - EVENT] Waiting for output on serial console
file = phd-tests/framework/src/test_vm/mod.rs
line = 920
path = phd_tests::migrate::from_base::serial_history
target = phd_framework::test_vm
timeout_duration = CallerTimeout
vm = migration_serial_history_base
vm_id = 6da8da09-f204-4716-ac65-7bea91e6272d
|
| 58 | 2026-10-12T21:20:51.391Z | INFO | phd-runner: [WAIT_FOR_SERIAL_OUTPUT - END]
elapsed_milliseconds = 32
file = phd-tests/framework/src/test_vm/mod.rs
line = 913
path = phd_tests::migrate::from_base::serial_history
target = phd_framework::test_vm
vm = migration_serial_history_base
vm_id = 6da8da09-f204-4716-ac65-7bea91e6272d
|
| 59 | 2026-10-12T21:20:51.391Z | INFO | phd-runner: [WAIT_TO_BOOT - EVENT] Guest has booted
file = phd-tests/framework/src/test_vm/mod.rs
line = 887
path = phd_tests::migrate::from_base::serial_history
target = phd_framework::test_vm
|
| 60 | 2026-10-12T21:20:51.391Z | INFO | phd-runner: [WAIT_TO_BOOT - END]
elapsed_milliseconds = 4695
file = phd-tests/framework/src/test_vm/mod.rs
line = 890
path = phd_tests::migrate::from_base::serial_history
target = phd_framework::test_vm
|
| 61 | 2026-10-12T21:20:51.394Z | INFO | phd-runner: [WAIT_FOR_SERIAL_OUTPUT - START]
file = phd-tests/framework/src/test_vm/mod.rs
line = 913
path = phd_tests::migrate::from_base::serial_history
target = phd_framework::test_vm
vm = migration_serial_history_base
vm_id = 6da8da09-f204-4716-ac65-7bea91e6272d
|
| 62 | 2026-10-12T21:20:51.395Z | INFO | phd-runner: [WAIT_FOR_SERIAL_OUTPUT - EVENT] Waiting for output on serial console
file = phd-tests/framework/src/test_vm/mod.rs
line = 920
path = phd_tests::migrate::from_base::serial_history
target = phd_framework::test_vm
timeout_duration = Explicit(15s)
vm = migration_serial_history_base
vm_id = 6da8da09-f204-4716-ac65-7bea91e6272d
|
| 63 | 2026-10-12T21:20:51.413Z | INFO | phd-runner: [WAIT_FOR_SERIAL_OUTPUT - END]
elapsed_milliseconds = 18
file = phd-tests/framework/src/test_vm/mod.rs
line = 913
path = phd_tests::migrate::from_base::serial_history
target = phd_framework::test_vm
vm = migration_serial_history_base
vm_id = 6da8da09-f204-4716-ac65-7bea91e6272d
|
| 64 | 2026-10-12T21:20:51.414Z | INFO | phd-runner: [WAIT_FOR_SERIAL_OUTPUT - START]
file = phd-tests/framework/src/test_vm/mod.rs
line = 913
path = phd_tests::migrate::from_base::serial_history
target = phd_framework::test_vm
vm = migration_serial_history_base
vm_id = 6da8da09-f204-4716-ac65-7bea91e6272d
|
| 65 | 2026-10-12T21:20:51.414Z | INFO | phd-runner: [WAIT_FOR_SERIAL_OUTPUT - EVENT] Waiting for output on serial console
file = phd-tests/framework/src/test_vm/mod.rs
line = 920
path = phd_tests::migrate::from_base::serial_history
target = phd_framework::test_vm
timeout_duration = Explicit(300s)
vm = migration_serial_history_base
vm_id = 6da8da09-f204-4716-ac65-7bea91e6272d
|
| 66 | 2026-10-12T21:20:51.446Z | INFO | phd-runner: [WAIT_FOR_SERIAL_OUTPUT - END]
elapsed_milliseconds = 32
file = phd-tests/framework/src/test_vm/mod.rs
line = 913
path = phd_tests::migrate::from_base::serial_history
target = phd_framework::test_vm
vm = migration_serial_history_base
vm_id = 6da8da09-f204-4716-ac65-7bea91e6272d
|
| 67 | 2026-10-12T21:20:51.447Z | INFO | phd-runner: [WAIT_FOR_SERIAL_OUTPUT - START]
file = phd-tests/framework/src/test_vm/mod.rs
line = 913
path = phd_tests::migrate::from_base::serial_history
target = phd_framework::test_vm
vm = migration_serial_history_base
vm_id = 6da8da09-f204-4716-ac65-7bea91e6272d
|
| 68 | 2026-10-12T21:20:51.447Z | INFO | phd-runner: [WAIT_FOR_SERIAL_OUTPUT - EVENT] Waiting for output on serial console
file = phd-tests/framework/src/test_vm/mod.rs
line = 920
path = phd_tests::migrate::from_base::serial_history
target = phd_framework::test_vm
timeout_duration = Explicit(15s)
vm = migration_serial_history_base
vm_id = 6da8da09-f204-4716-ac65-7bea91e6272d
|
| 69 | 2026-10-12T21:20:51.457Z | INFO | phd-runner: [WAIT_FOR_SERIAL_OUTPUT - END]
elapsed_milliseconds = 10
file = phd-tests/framework/src/test_vm/mod.rs
line = 913
path = phd_tests::migrate::from_base::serial_history
target = phd_framework::test_vm
vm = migration_serial_history_base
vm_id = 6da8da09-f204-4716-ac65-7bea91e6272d
|
| 70 | 2026-10-12T21:20:51.457Z | INFO | phd-runner: [WAIT_FOR_SERIAL_OUTPUT - START]
file = phd-tests/framework/src/test_vm/mod.rs
line = 913
path = phd_tests::migrate::from_base::serial_history
target = phd_framework::test_vm
vm = migration_serial_history_base
vm_id = 6da8da09-f204-4716-ac65-7bea91e6272d
|
| 71 | 2026-10-12T21:20:51.457Z | INFO | phd-runner: [WAIT_FOR_SERIAL_OUTPUT - EVENT] Waiting for output on serial console
file = phd-tests/framework/src/test_vm/mod.rs
line = 920
path = phd_tests::migrate::from_base::serial_history
target = phd_framework::test_vm
timeout_duration = Explicit(300s)
vm = migration_serial_history_base
vm_id = 6da8da09-f204-4716-ac65-7bea91e6272d
|
| 72 | 2026-10-12T21:20:51.490Z | INFO | phd-runner: [WAIT_FOR_SERIAL_OUTPUT - END]
elapsed_milliseconds = 32
file = phd-tests/framework/src/test_vm/mod.rs
line = 913
path = phd_tests::migrate::from_base::serial_history
target = phd_framework::test_vm
vm = migration_serial_history_base
vm_id = 6da8da09-f204-4716-ac65-7bea91e6272d
|
| 73 | 2026-10-12T21:20:51.500Z | INFO | phd-runner: [TEST - EVENT] migrating to new Propolis artifact for lifecycle test
file = phd-tests/framework/src/lifecycle.rs
line = 73
path = phd_tests::migrate::from_base::serial_history
propolis_artifact = __DEFAULT_PROPOLIS
target = phd_framework::lifecycle
vm_name = migration_serial_history_base
|
| 74 | 2026-10-12T21:20:51.500Z | INFO | phd-runner: [NEW - START]
file = phd-tests/framework/src/test_vm/mod.rs
line = 300
path = phd_tests::migrate::from_base::serial_history
target = phd_framework::test_vm
|
| 75 | 2026-10-12T21:20:51.500Z | INFO | phd-runner: [NEW - EVENT] phd_framework::test_vm
environment = EnvironmentSpec { location: Local, propolis_artifact: "__DEFAULT_PROPOLIS", metrics: None }
file = phd-tests/framework/src/test_vm/mod.rs
guest_os_kind = Alpine
line = 318
path = phd_tests::migrate::from_base::serial_history
target = phd_framework::test_vm
vm_name = migration_serial_history_base_lifecycle_0
|
| 76 | 2026-10-12T21:20:51.501Z | DEBG | phd-runner: [NEW - EVENT] Examining locally-sourced artifact
file = phd-tests/framework/src/artifacts/store.rs
line = 56
path = /work/phd-test/propolis-server
sha256 = None
target = phd_framework::artifacts::store
|
| 77 | 2026-10-12T21:20:51.501Z | DEBG | phd-runner: [NEW - EVENT] Locally-sourced artifact is valid, caching its path
file = phd-tests/framework/src/artifacts/store.rs
line = 69
path = /work/phd-test/propolis-server
target = phd_framework::artifacts::store
|
| 78 | 2026-10-12T21:20:51.501Z | INFO | phd-runner: [NEW - EVENT] Launching Propolis server
bootrom_path = "/phd-artifacts/740187046a7267d0de72d3455070333547dbc0ea023531471fb2b2a61effa448/OVMF_CODE.fd"
file = phd-tests/framework/src/test_vm/server.rs
line = 66
path = phd_tests::migrate::from_base::serial_history
server_addr = 127.0.0.1:9002
server_path = "/work/phd-test/propolis-server"
target = phd_framework::test_vm::server
|
| 79 | 2026-10-12T21:20:51.501Z | INFO | phd-runner: [NEW - EVENT] Opening server log files
file = phd-tests/framework/src/log_config.rs
line = 84
path = phd_tests::migrate::from_base::serial_history
stderr_path = "/tmp/propolis-phd/phd_tests::migrate::from_base::serial_history/migration_serial_history_base_lifecycle_0.stderr.log"
stdout_path = "/tmp/propolis-phd/phd_tests::migrate::from_base::serial_history/migration_serial_history_base_lifecycle_0.stdout.log"
target = phd_framework::log_config
|
| 80 | 2026-10-12T21:20:51.550Z | INFO | phd-runner: [NEW - EVENT] Launched server with pid 918
file = phd-tests/framework/src/test_vm/server.rs
line = 127
path = phd_tests::migrate::from_base::serial_history
target = phd_framework::test_vm::server
|
| 81 | 2026-10-12T21:20:51.563Z | INFO | phd-runner: [NEW - END]
elapsed_milliseconds = 63
file = phd-tests/framework/src/test_vm/mod.rs
line = 300
path = phd_tests::migrate::from_base::serial_history
target = phd_framework::test_vm
|
| 82 | 2026-10-12T21:20:51.563Z | INFO | phd-runner: [MIGRATE_FROM - START]
file = phd-tests/framework/src/test_vm/mod.rs
line = 609
path = phd_tests::migrate::from_base::serial_history
source = migration_serial_history_base
source_id = 6da8da09-f204-4716-ac65-7bea91e6272d
target = phd_framework::test_vm
target_id = 27c42844-d940-40b1-9468-e1ea33f92c1e
|
| 83 | 2026-10-12T21:20:51.565Z | INFO | phd-runner: [MIGRATE_FROM - EVENT] Migrating from source at address 127.0.0.1:9000
file = phd-tests/framework/src/test_vm/mod.rs
line = 642
migration_id = 4af8c521-300c-4cec-93c1-eeec072c40b4
path = phd_tests::migrate::from_base::serial_history
source = migration_serial_history_base
source_id = 6da8da09-f204-4716-ac65-7bea91e6272d
target = phd_framework::test_vm
target_id = 27c42844-d940-40b1-9468-e1ea33f92c1e
timeout_duration = 45s
|
| 84 | 2026-10-12T21:20:51.565Z | INFO | phd-runner: [INSTANCE_ENSURE_INTERNAL - START]
file = phd-tests/framework/src/test_vm/mod.rs
line = 412
path = phd_tests::migrate::from_base::serial_history
source = migration_serial_history_base
source_id = 6da8da09-f204-4716-ac65-7bea91e6272d
target = phd_framework::test_vm
target_id = 27c42844-d940-40b1-9468-e1ea33f92c1e
vm = migration_serial_history_base_lifecycle_0
vm_id = 27c42844-d940-40b1-9468-e1ea33f92c1e
|
| 85 | 2026-10-12T21:20:51.566Z | INFO | phd-runner: [INSTANCE_ENSURE_INTERNAL - EVENT] retriable error from instance_spec_ensure
e = Communication Error: error sending request for url (http://127.0.0.1:9002/instance)
file = phd-tests/framework/src/test_vm/mod.rs
line = 455
path = phd_tests::migrate::from_base::serial_history
source = migration_serial_history_base
source_id = 6da8da09-f204-4716-ac65-7bea91e6272d
target = phd_framework::test_vm
target_id = 27c42844-d940-40b1-9468-e1ea33f92c1e
vm = migration_serial_history_base_lifecycle_0
vm_id = 27c42844-d940-40b1-9468-e1ea33f92c1e
|
| 86 | 2026-10-12T21:20:52.460Z | INFO | phd-runner: [INSTANCE_ENSURE_INTERNAL - EVENT] Started instance
file = phd-tests/framework/src/test_vm/mod.rs
instance_description.instance = Instance { properties: InstanceProperties { id: 27c42844-d940-40b1-9468-e1ea33f92c1e, name: "phd-vm-27c42844-d940-40b1-9468-e1ea33f92c1e", description: "Pheidippides-managed VM", metadata: InstanceMetadata { silo_id: edcd5662-a4ea-4dc9-82c8-5b5dcbfa5b41, project_id: d38cc3a5-7d3e-44e2-b01b-4490009ffa3b, sled_id: 4d42531b-6b50-4cab-86b6-f420b131e6b3, sled_serial: "4d42531b-6b50-4cab-86b6-f420b131e6b3", sled_revision: 1, sled_model: "pheidippes" } }, state: Migrating }
line = 514
path = phd_tests::migrate::from_base::serial_history
source = migration_serial_history_base
source_id = 6da8da09-f204-4716-ac65-7bea91e6272d
target = phd_framework::test_vm
target_id = 27c42844-d940-40b1-9468-e1ea33f92c1e
vm = migration_serial_history_base_lifecycle_0
vm_id = 27c42844-d940-40b1-9468-e1ea33f92c1e
|
| 87 | 2026-10-12T21:20:52.460Z | INFO | phd-runner: [MIGRATE - START]
file = phd-tests/framework/src/test_vm/mod.rs
line = 663
migration_id = 4af8c521-300c-4cec-93c1-eeec072c40b4
path = phd_tests::migrate::from_base::serial_history
source = migration_serial_history_base
source_id = 6da8da09-f204-4716-ac65-7bea91e6272d
target = phd_framework::test_vm
target_id = 27c42844-d940-40b1-9468-e1ea33f92c1e
|
| 88 | 2026-10-12T21:20:54.990Z | INFO | phd-runner: [SERIAL CONSOLE TASK - EVENT] serial socket control message
file = phd-tests/framework/src/serial/mod.rs
line = 275
s = {"Migrating":{"destination":"127.0.0.1:9002","from_start":7756}}
target = phd_framework::serial
|
| 89 | 2026-10-12T21:20:57.115Z | INFO | phd-runner: [MIGRATE_FROM - EVENT] Migration completed successfully
file = phd-tests/framework/src/test_vm/mod.rs
line = 676
path = phd_tests::migrate::from_base::serial_history
source = migration_serial_history_base
source_id = 6da8da09-f204-4716-ac65-7bea91e6272d
target = phd_framework::test_vm
target_id = 27c42844-d940-40b1-9468-e1ea33f92c1e
|
| 90 | 2026-10-12T21:20:57.115Z | INFO | phd-runner: [MIGRATE - END]
elapsed_milliseconds = 4654
file = phd-tests/framework/src/test_vm/mod.rs
line = 663
migration_id = 4af8c521-300c-4cec-93c1-eeec072c40b4
path = phd_tests::migrate::from_base::serial_history
source = migration_serial_history_base
source_id = 6da8da09-f204-4716-ac65-7bea91e6272d
target = phd_framework::test_vm
target_id = 27c42844-d940-40b1-9468-e1ea33f92c1e
|
| 91 | 2026-10-12T21:20:57.118Z | INFO | phd-runner: [VM CLEANUP - START]
file = phd-tests/framework/src/test_vm/mod.rs
line = 1172
path = phd_tests::migrate::from_base::serial_history
target = phd_framework::test_vm
vm = migration_serial_history_base
vm_id = 6da8da09-f204-4716-ac65-7bea91e6272d
|
| 92 | 2026-10-12T21:20:57.124Z | DEBG | phd-runner: [VM CLEANUP - EVENT] Killing Propolis server process
file = phd-tests/framework/src/test_vm/server.rs
line = 177
path = phd_tests::migrate::from_base::serial_history
self.address = 127.0.0.1:9000
target = phd_framework::test_vm::server
vm = migration_serial_history_base
vm_id = 6da8da09-f204-4716-ac65-7bea91e6272d
|
| 93 | 2026-10-12T21:20:57.132Z | INFO | phd-runner: [VM CLEANUP - START]
file = phd-tests/framework/src/test_vm/mod.rs
line = 1172
path = phd_tests::migrate::from_base::serial_history
target = phd_framework::test_vm
vm = migration_serial_history_base_lifecycle_0
vm_id = 27c42844-d940-40b1-9468-e1ea33f92c1e
|
| 94 | 2026-10-12T21:20:57.132Z | DEBG | phd-runner: [SERIAL CONSOLE TASK - EVENT] serial console command channel was closed
file = phd-tests/framework/src/serial/mod.rs
line = 213
target = phd_framework::serial
|
| 95 | 2026-10-12T21:20:57.132Z | INFO | phd-runner: [SERIAL CONSOLE TASK - END]
elapsed_milliseconds = 10445
file = phd-tests/framework/src/serial/mod.rs
line = 200
target = phd_framework::serial
|
| 96 | 2026-10-12T21:20:57.134Z | INFO | phd-runner: test phd_tests::migrate::from_base::serial_history ... ok
file = phd-tests/runner/src/execute.rs
line = 141
target = phd_runner::execute
|
| 97 | 2026-10-12T21:20:57.134Z | INFO | phd-runner: [TEST_CLEANUP - START]
file = phd-tests/runner/src/fixtures.rs
line = 51
target = phd_runner::fixtures
|
| 98 | 2026-10-12T21:20:57.134Z | DEBG | phd-runner: [VM CLEANUP - EVENT] trying to ensure Propolis server VM is destroyed
file = phd-tests/framework/src/test_vm/mod.rs
line = 1195
path = phd_tests::migrate::from_base::serial_history
target = phd_framework::test_vm
vm = migration_serial_history_base_lifecycle_0
vm_id = 27c42844-d940-40b1-9468-e1ea33f92c1e
|
| 99 | 2026-10-12T21:20:57.205Z | INFO | phd-runner: [VM CLEANUP - END]
elapsed_milliseconds = 82
file = phd-tests/framework/src/test_vm/mod.rs
line = 1172
path = phd_tests::migrate::from_base::serial_history
target = phd_framework::test_vm
vm = migration_serial_history_base
vm_id = 6da8da09-f204-4716-ac65-7bea91e6272d
|
| 100 | 2026-10-12T21:20:57.205Z | INFO | phd-runner: [INSTANCE_ENSURE_INTERNAL - END]
elapsed_milliseconds = 11381
file = phd-tests/framework/src/test_vm/mod.rs
line = 412
path = phd_tests::migrate::from_base::serial_history
target = phd_framework::test_vm
vm = migration_serial_history_base
vm_id = 6da8da09-f204-4716-ac65-7bea91e6272d
|
| 101 | 2026-10-12T21:20:57.882Z | DEBG | phd-runner: [VM CLEANUP - EVENT] Killing Propolis server process
file = phd-tests/framework/src/test_vm/server.rs
line = 177
path = phd_tests::migrate::from_base::serial_history
self.address = 127.0.0.1:9002
target = phd_framework::test_vm::server
vm = migration_serial_history_base_lifecycle_0
vm_id = 27c42844-d940-40b1-9468-e1ea33f92c1e
|
| 102 | 2026-10-12T21:20:57.977Z | DEBG | phd-runner: [VM CLEANUP - EVENT] zfs clone dropped
file = phd-tests/framework/src/zfs.rs
line = 83
path = phd_tests::migrate::from_base::serial_history
target = phd_framework::zfs
vm = migration_serial_history_base_lifecycle_0
vm_id = 27c42844-d940-40b1-9468-e1ea33f92c1e
|
| 103 | 2026-10-12T21:20:57.978Z | DEBG | phd-runner: [VM CLEANUP - EVENT] executing ZFS command
args = ["phd-artifacts/phd-clone-9c6e1033-398f-4f6f-b42b-acc4e9dd8d83"]
file = phd-tests/framework/src/zfs.rs
line = 304
path = phd_tests::migrate::from_base::serial_history
target = phd_framework::zfs
verb = destroy
vm = migration_serial_history_base_lifecycle_0
vm_id = 27c42844-d940-40b1-9468-e1ea33f92c1e
|
| 104 | 2026-10-12T21:20:58.005Z | DEBG | phd-runner: [VM CLEANUP - EVENT] zfs snapshot dropped
file = phd-tests/framework/src/zfs.rs
line = 57
path = phd_tests::migrate::from_base::serial_history
target = phd_framework::zfs
vm = migration_serial_history_base_lifecycle_0
vm_id = 27c42844-d940-40b1-9468-e1ea33f92c1e
|
| 105 | 2026-10-12T21:20:58.005Z | DEBG | phd-runner: [VM CLEANUP - EVENT] executing ZFS command
args = ["phd-artifacts@phd-29396787-a836-4a53-b6a6-f35d19aa2022"]
file = phd-tests/framework/src/zfs.rs
line = 304
path = phd_tests::migrate::from_base::serial_history
target = phd_framework::zfs
verb = destroy
vm = migration_serial_history_base_lifecycle_0
vm_id = 27c42844-d940-40b1-9468-e1ea33f92c1e
|
| 106 | 2026-10-12T21:20:58.026Z | INFO | phd-runner: [VM CLEANUP - END]
elapsed_milliseconds = 893
file = phd-tests/framework/src/test_vm/mod.rs
line = 1172
path = phd_tests::migrate::from_base::serial_history
target = phd_framework::test_vm
vm = migration_serial_history_base_lifecycle_0
vm_id = 27c42844-d940-40b1-9468-e1ea33f92c1e
|
| 107 | 2026-10-12T21:20:58.026Z | INFO | phd-runner: [INSTANCE_ENSURE_INTERNAL - END]
elapsed_milliseconds = 6461
file = phd-tests/framework/src/test_vm/mod.rs
line = 412
path = phd_tests::migrate::from_base::serial_history
source = migration_serial_history_base
source_id = 6da8da09-f204-4716-ac65-7bea91e6272d
target = phd_framework::test_vm
target_id = 27c42844-d940-40b1-9468-e1ea33f92c1e
vm = migration_serial_history_base_lifecycle_0
vm_id = 27c42844-d940-40b1-9468-e1ea33f92c1e
|
| 108 | 2026-10-12T21:20:58.026Z | INFO | phd-runner: [MIGRATE_FROM - END]
elapsed_milliseconds = 6462
file = phd-tests/framework/src/test_vm/mod.rs
line = 609
path = phd_tests::migrate::from_base::serial_history
source = migration_serial_history_base
source_id = 6da8da09-f204-4716-ac65-7bea91e6272d
target = phd_framework::test_vm
target_id = 27c42844-d940-40b1-9468-e1ea33f92c1e
|
| 109 | 2026-10-12T21:20:58.026Z | INFO | phd-runner: [TEST - END]
elapsed_milliseconds = 59364
file = phd-tests/tests/src/migrate.rs
line = 40
path = phd_tests::migrate::from_base::serial_history
target = phd_tests::migrate::from_base
|
| 110 | 2026-10-12T21:20:58.027Z | INFO | phd-runner: [TEST_CLEANUP - END]
elapsed_milliseconds = 893
file = phd-tests/runner/src/fixtures.rs
line = 51
target = phd_runner::fixtures
|
| 111 | 2026-10-12T21:20:58.027Z | INFO | phd-runner: Starting test phd_tests::migrate::from_base::can_migrate_from_base
file = phd-tests/runner/src/execute.rs
line = 91
target = phd_runner::execute
|
| 112 | 2026-10-12T21:20:58.027Z | INFO | phd-runner: [TEST_SETUP - START]
file = phd-tests/runner/src/fixtures.rs
line = 41
target = phd_runner::fixtures
|
| 113 | 2026-10-12T21:20:58.027Z | INFO | phd-runner: [TEST_SETUP - END]
elapsed_milliseconds = 0
file = phd-tests/runner/src/fixtures.rs
line = 41
target = phd_runner::fixtures
|
| 114 | 2026-10-12T21:20:58.027Z | INFO | phd-runner: [TEST - START]
file = phd-tests/tests/src/migrate.rs
line = 34
path = phd_tests::migrate::from_base::can_migrate_from_base
target = phd_tests::migrate::from_base
|
| 115 | 2026-10-12T21:20:58.027Z | DEBG | phd-runner: [TEST - EVENT] Verified artifact already exists
file = phd-tests/framework/src/artifacts/store.rs
line = 45
path = /phd-artifacts/740187046a7267d0de72d3455070333547dbc0ea023531471fb2b2a61effa448/OVMF_CODE.fd
target = phd_framework::artifacts::store
|
| 116 | 2026-10-12T21:20:58.027Z | DEBG | phd-runner: [TEST - EVENT] Verified artifact already exists
file = phd-tests/framework/src/artifacts/store.rs
line = 45
path = /phd-artifacts/ba8007f74f9b54fbae3b2520da577831b4834778a498d732f091260c61aa7ca1/alpine.iso
target = phd_framework::artifacts::store
|
| 117 | 2026-10-12T21:20:58.028Z | DEBG | phd-runner: [TEST - EVENT] Verified artifact already exists
file = phd-tests/framework/src/artifacts/store.rs
line = 45
path = /phd-artifacts/ba8007f74f9b54fbae3b2520da577831b4834778a498d732f091260c61aa7ca1/alpine.iso
target = phd_framework::artifacts::store
|
| 118 | 2026-10-12T21:20:58.028Z | DEBG | phd-runner: [TEST - EVENT] executing ZFS command
args = ["/phd-artifacts/ba8007f74f9b54fbae3b2520da577831b4834778a498d732f091260c61aa7ca1/alpine.iso"]
file = phd-tests/framework/src/zfs.rs
line = 304
path = phd_tests::migrate::from_base::can_migrate_from_base
target = phd_framework::zfs
verb = list
|
| 119 | 2026-10-12T21:20:58.039Z | DEBG | phd-runner: [TEST - EVENT] parsing zfs list output
file = phd-tests/framework/src/zfs.rs
line = 238
path = phd_tests::migrate::from_base::can_migrate_from_base
stdout = NAME USED AVAIL REFER MOUNTPOINT\nphd-artifacts 1.30G 25.3T 1.30G /phd-artifacts\n
target = phd_framework::zfs
|
| 120 | 2026-10-12T21:20:58.039Z | DEBG | phd-runner: [TEST - EVENT] executing ZFS command
args = ["phd-artifacts@phd-af9dde2a-9dfa-44c6-be28-9d0eb7858da2"]
file = phd-tests/framework/src/zfs.rs
line = 304
path = phd_tests::migrate::from_base::can_migrate_from_base
target = phd_framework::zfs
verb = snapshot
|
| 121 | 2026-10-12T21:20:58.056Z | DEBG | phd-runner: [TEST - EVENT] executing ZFS command
args = ["phd-artifacts@phd-af9dde2a-9dfa-44c6-be28-9d0eb7858da2", "phd-artifacts/phd-clone-26644f85-804d-4308-9e9a-2d0ee9388cee"]
file = phd-tests/framework/src/zfs.rs
line = 304
path = phd_tests::migrate::from_base::can_migrate_from_base
target = phd_framework::zfs
verb = clone
|
| 122 | 2026-10-12T21:20:58.074Z | DEBG | phd-runner: [TEST - EVENT] executing ZFS command
args = ["phd-artifacts/phd-clone-26644f85-804d-4308-9e9a-2d0ee9388cee"]
file = phd-tests/framework/src/zfs.rs
line = 304
path = phd_tests::migrate::from_base::can_migrate_from_base
target = phd_framework::zfs
verb = list
|
| 123 | 2026-10-12T21:20:58.085Z | DEBG | phd-runner: [TEST - EVENT] parsing zfs list output
file = phd-tests/framework/src/zfs.rs
line = 238
path = phd_tests::migrate::from_base::can_migrate_from_base
stdout = NAME USED AVAIL REFER MOUNTPOINT\nphd-artifacts/phd-clone-26644f85-804d-4308-9e9a-2d0ee9388cee 0B 25.3T 1.30G /phd-artifacts/phd-clone-26644f85-804d-4308-9e9a-2d0ee9388cee\n
target = phd_framework::zfs
|
| 124 | 2026-10-12T21:20:58.086Z | INFO | phd-runner: [NEW - START]
file = phd-tests/framework/src/test_vm/mod.rs
line = 300
path = phd_tests::migrate::from_base::can_migrate_from_base
target = phd_framework::test_vm
|
| 125 | 2026-10-12T21:20:58.086Z | INFO | phd-runner: [NEW - EVENT] phd_framework::test_vm
environment = EnvironmentSpec { location: Local, propolis_artifact: "__BASE_PROPOLIS", metrics: None }
file = phd-tests/framework/src/test_vm/mod.rs
guest_os_kind = Alpine
line = 318
path = phd_tests::migrate::from_base::can_migrate_from_base
target = phd_framework::test_vm
vm_name = migration_from_base
|
| 126 | 2026-10-12T21:20:58.086Z | DEBG | phd-runner: [NEW - EVENT] Verified artifact already exists
file = phd-tests/framework/src/artifacts/store.rs
line = 45
path = /phd-artifacts/c0d9344f91d563c7ab06bccfd2aae4b75c245ada57f0262eac2fd4a28094086e/propolis-server
target = phd_framework::artifacts::store
|
| 127 | 2026-10-12T21:20:58.086Z | INFO | phd-runner: [NEW - EVENT] Launching Propolis server
bootrom_path = "/phd-artifacts/740187046a7267d0de72d3455070333547dbc0ea023531471fb2b2a61effa448/OVMF_CODE.fd"
file = phd-tests/framework/src/test_vm/server.rs
line = 66
path = phd_tests::migrate::from_base::can_migrate_from_base
server_addr = 127.0.0.1:9000
server_path = "/phd-artifacts/c0d9344f91d563c7ab06bccfd2aae4b75c245ada57f0262eac2fd4a28094086e/propolis-server"
target = phd_framework::test_vm::server
|
| 128 | 2026-10-12T21:20:58.086Z | INFO | phd-runner: [NEW - EVENT] Opening server log files
file = phd-tests/framework/src/log_config.rs
line = 84
path = phd_tests::migrate::from_base::can_migrate_from_base
stderr_path = "/tmp/propolis-phd/phd_tests::migrate::from_base::can_migrate_from_base/migration_from_base.stderr.log"
stdout_path = "/tmp/propolis-phd/phd_tests::migrate::from_base::can_migrate_from_base/migration_from_base.stdout.log"
target = phd_framework::log_config
|
| 129 | 2026-10-12T21:20:58.138Z | INFO | phd-runner: [NEW - EVENT] Launched server with pid 927
file = phd-tests/framework/src/test_vm/server.rs
line = 127
path = phd_tests::migrate::from_base::can_migrate_from_base
target = phd_framework::test_vm::server
|
| 130 | 2026-10-12T21:20:58.152Z | INFO | phd-runner: [NEW - END]
elapsed_milliseconds = 65
file = phd-tests/framework/src/test_vm/mod.rs
line = 300
path = phd_tests::migrate::from_base::can_migrate_from_base
target = phd_framework::test_vm
|
| 131 | 2026-10-12T21:20:58.152Z | INFO | phd-runner: [INSTANCE_ENSURE_INTERNAL - START]
file = phd-tests/framework/src/test_vm/mod.rs
line = 412
path = phd_tests::migrate::from_base::can_migrate_from_base
target = phd_framework::test_vm
vm = migration_from_base
vm_id = cad3f3bb-f795-40bd-a4bc-52102cbd6314
|
| 132 | 2026-10-12T21:20:58.153Z | INFO | phd-runner: [INSTANCE_ENSURE_INTERNAL - EVENT] retriable error from instance_spec_ensure
e = Communication Error: error sending request for url (http://127.0.0.1:9000/instance)
file = phd-tests/framework/src/test_vm/mod.rs
line = 455
path = phd_tests::migrate::from_base::can_migrate_from_base
target = phd_framework::test_vm
vm = migration_from_base
vm_id = cad3f3bb-f795-40bd-a4bc-52102cbd6314
|
| 133 | 2026-10-12T21:20:58.835Z | INFO | phd-runner: [SERIAL CONSOLE TASK - START]
file = phd-tests/framework/src/serial/mod.rs
line = 200
target = phd_framework::serial
|
| 134 | 2026-10-12T21:20:58.836Z | INFO | phd-runner: [INSTANCE_ENSURE_INTERNAL - EVENT] Started instance
file = phd-tests/framework/src/test_vm/mod.rs
instance_description.instance = Instance { properties: InstanceProperties { id: cad3f3bb-f795-40bd-a4bc-52102cbd6314, name: "phd-vm-cad3f3bb-f795-40bd-a4bc-52102cbd6314", description: "Pheidippides-managed VM", metadata: InstanceMetadata { silo_id: c9cff454-4e25-457a-ba2d-35266cce7470, project_id: 245cc679-36d4-4e24-845f-2cb528bfd9f7, sled_id: 5eb8f4de-f8a7-4527-b19b-6272729fbdb1, sled_serial: "5eb8f4de-f8a7-4527-b19b-6272729fbdb1", sled_revision: 1, sled_model: "pheidippes" } }, state: Creating }
line = 514
path = phd_tests::migrate::from_base::can_migrate_from_base
target = phd_framework::test_vm
vm = migration_from_base
vm_id = cad3f3bb-f795-40bd-a4bc-52102cbd6314
|
| 135 | 2026-10-12T21:20:58.836Z | INFO | phd-runner: [PUT_INSTANCE_STATE - START]
file = phd-tests/framework/src/test_vm/mod.rs
line = 575
path = phd_tests::migrate::from_base::can_migrate_from_base
target = phd_framework::test_vm
vm = migration_from_base
vm_id = cad3f3bb-f795-40bd-a4bc-52102cbd6314
|
| 136 | 2026-10-12T21:20:58.836Z | INFO | phd-runner: [PUT_INSTANCE_STATE - EVENT] Requesting instance state change
file = phd-tests/framework/src/test_vm/mod.rs
line = 580
path = phd_tests::migrate::from_base::can_migrate_from_base
state = Run
target = phd_framework::test_vm
vm = migration_from_base
vm_id = cad3f3bb-f795-40bd-a4bc-52102cbd6314
|
| 137 | 2026-10-12T21:20:58.837Z | INFO | phd-runner: [PUT_INSTANCE_STATE - END]
elapsed_milliseconds = 1
file = phd-tests/framework/src/test_vm/mod.rs
line = 575
path = phd_tests::migrate::from_base::can_migrate_from_base
target = phd_framework::test_vm
vm = migration_from_base
vm_id = cad3f3bb-f795-40bd-a4bc-52102cbd6314
|
| 138 | 2026-10-12T21:20:58.837Z | INFO | phd-runner: [WAIT_TO_BOOT - START]
file = phd-tests/framework/src/test_vm/mod.rs
line = 890
path = phd_tests::migrate::from_base::can_migrate_from_base
target = phd_framework::test_vm
|
| 139 | 2026-10-12T21:20:58.837Z | INFO | phd-runner: [WAIT_TO_BOOT - EVENT] waiting for guest to boot
file = phd-tests/framework/src/test_vm/mod.rs
line = 839
path = phd_tests::migrate::from_base::can_migrate_from_base
target = phd_framework::test_vm
timeout_duration = 300s
vm = migration_from_base
vm_id = cad3f3bb-f795-40bd-a4bc-52102cbd6314
|
| 140 | 2026-10-12T21:20:58.838Z | DEBG | phd-runner: [WAIT_TO_BOOT - EVENT] executing command in boot sequence
file = phd-tests/framework/src/test_vm/mod.rs
line = 847
path = phd_tests::migrate::from_base::can_migrate_from_base
step = WaitFor("localhost login: ")
target = phd_framework::test_vm
|
| 141 | 2026-10-12T21:20:58.838Z | INFO | phd-runner: [WAIT_FOR_SERIAL_OUTPUT - START]
file = phd-tests/framework/src/test_vm/mod.rs
line = 913
path = phd_tests::migrate::from_base::can_migrate_from_base
target = phd_framework::test_vm
vm = migration_from_base
vm_id = cad3f3bb-f795-40bd-a4bc-52102cbd6314
|
| 142 | 2026-10-12T21:20:58.838Z | INFO | phd-runner: [WAIT_FOR_SERIAL_OUTPUT - EVENT] Waiting for output on serial console
file = phd-tests/framework/src/test_vm/mod.rs
line = 920
path = phd_tests::migrate::from_base::can_migrate_from_base
target = phd_framework::test_vm
timeout_duration = CallerTimeout
vm = migration_from_base
vm_id = cad3f3bb-f795-40bd-a4bc-52102cbd6314
|
| 143 | 2026-10-12T21:21:03.346Z | INFO | phd-runner: [WAIT_FOR_SERIAL_OUTPUT - END]
elapsed_milliseconds = 4508
file = phd-tests/framework/src/test_vm/mod.rs
line = 913
path = phd_tests::migrate::from_base::can_migrate_from_base
target = phd_framework::test_vm
vm = migration_from_base
vm_id = cad3f3bb-f795-40bd-a4bc-52102cbd6314
|
| 144 | 2026-10-12T21:21:03.346Z | DEBG | phd-runner: [WAIT_TO_BOOT - EVENT] executing command in boot sequence
file = phd-tests/framework/src/test_vm/mod.rs
line = 847
path = phd_tests::migrate::from_base::can_migrate_from_base
step = WriteStr("root")
target = phd_framework::test_vm
|
| 145 | 2026-10-12T21:21:03.346Z | DEBG | phd-runner: [WAIT_TO_BOOT - EVENT] executing command in boot sequence
file = phd-tests/framework/src/test_vm/mod.rs
line = 847
path = phd_tests::migrate::from_base::can_migrate_from_base
step = WaitFor("localhost:~#")
target = phd_framework::test_vm
|
| 146 | 2026-10-12T21:21:03.346Z | INFO | phd-runner: [WAIT_FOR_SERIAL_OUTPUT - START]
file = phd-tests/framework/src/test_vm/mod.rs
line = 913
path = phd_tests::migrate::from_base::can_migrate_from_base
target = phd_framework::test_vm
vm = migration_from_base
vm_id = cad3f3bb-f795-40bd-a4bc-52102cbd6314
|
| 147 | 2026-10-12T21:21:03.346Z | INFO | phd-runner: [WAIT_FOR_SERIAL_OUTPUT - EVENT] Waiting for output on serial console
file = phd-tests/framework/src/test_vm/mod.rs
line = 920
path = phd_tests::migrate::from_base::can_migrate_from_base
target = phd_framework::test_vm
timeout_duration = CallerTimeout
vm = migration_from_base
vm_id = cad3f3bb-f795-40bd-a4bc-52102cbd6314
|
| 148 | 2026-10-12T21:21:03.365Z | INFO | phd-runner: [WAIT_FOR_SERIAL_OUTPUT - END]
elapsed_milliseconds = 18
file = phd-tests/framework/src/test_vm/mod.rs
line = 913
path = phd_tests::migrate::from_base::can_migrate_from_base
target = phd_framework::test_vm
vm = migration_from_base
vm_id = cad3f3bb-f795-40bd-a4bc-52102cbd6314
|
| 149 | 2026-10-12T21:21:03.365Z | DEBG | phd-runner: [WAIT_TO_BOOT - EVENT] executing command in boot sequence
file = phd-tests/framework/src/test_vm/mod.rs
line = 847
path = phd_tests::migrate::from_base::can_migrate_from_base
step = WriteStr("stty -F `tty` cols 9999")
target = phd_framework::test_vm
|
| 150 | 2026-10-12T21:21:03.365Z | DEBG | phd-runner: [WAIT_TO_BOOT - EVENT] executing command in boot sequence
file = phd-tests/framework/src/test_vm/mod.rs
line = 847
path = phd_tests::migrate::from_base::can_migrate_from_base
step = WaitFor("localhost:~#")
target = phd_framework::test_vm
|
| 151 | 2026-10-12T21:21:03.366Z | INFO | phd-runner: [WAIT_FOR_SERIAL_OUTPUT - START]
file = phd-tests/framework/src/test_vm/mod.rs
line = 913
path = phd_tests::migrate::from_base::can_migrate_from_base
target = phd_framework::test_vm
vm = migration_from_base
vm_id = cad3f3bb-f795-40bd-a4bc-52102cbd6314
|
| 152 | 2026-10-12T21:21:03.366Z | INFO | phd-runner: [WAIT_FOR_SERIAL_OUTPUT - EVENT] Waiting for output on serial console
file = phd-tests/framework/src/test_vm/mod.rs
line = 920
path = phd_tests::migrate::from_base::can_migrate_from_base
target = phd_framework::test_vm
timeout_duration = CallerTimeout
vm = migration_from_base
vm_id = cad3f3bb-f795-40bd-a4bc-52102cbd6314
|
| 153 | 2026-10-12T21:21:03.398Z | INFO | phd-runner: [WAIT_FOR_SERIAL_OUTPUT - END]
elapsed_milliseconds = 32
file = phd-tests/framework/src/test_vm/mod.rs
line = 913
path = phd_tests::migrate::from_base::can_migrate_from_base
target = phd_framework::test_vm
vm = migration_from_base
vm_id = cad3f3bb-f795-40bd-a4bc-52102cbd6314
|
| 154 | 2026-10-12T21:21:03.398Z | INFO | phd-runner: [WAIT_TO_BOOT - EVENT] Guest has booted
file = phd-tests/framework/src/test_vm/mod.rs
line = 887
path = phd_tests::migrate::from_base::can_migrate_from_base
target = phd_framework::test_vm
|
| 155 | 2026-10-12T21:21:03.398Z | INFO | phd-runner: [WAIT_TO_BOOT - END]
elapsed_milliseconds = 4560
file = phd-tests/framework/src/test_vm/mod.rs
line = 890
path = phd_tests::migrate::from_base::can_migrate_from_base
target = phd_framework::test_vm
|
| 156 | 2026-10-12T21:21:03.398Z | INFO | phd-runner: [WAIT_FOR_SERIAL_OUTPUT - START]
file = phd-tests/framework/src/test_vm/mod.rs
line = 913
path = phd_tests::migrate::from_base::can_migrate_from_base
target = phd_framework::test_vm
vm = migration_from_base
vm_id = cad3f3bb-f795-40bd-a4bc-52102cbd6314
|
| 157 | 2026-10-12T21:21:03.398Z | INFO | phd-runner: [WAIT_FOR_SERIAL_OUTPUT - EVENT] Waiting for output on serial console
file = phd-tests/framework/src/test_vm/mod.rs
line = 920
path = phd_tests::migrate::from_base::can_migrate_from_base
target = phd_framework::test_vm
timeout_duration = Explicit(15s)
vm = migration_from_base
vm_id = cad3f3bb-f795-40bd-a4bc-52102cbd6314
|
| 158 | 2026-10-12T21:21:03.409Z | INFO | phd-runner: [WAIT_FOR_SERIAL_OUTPUT - END]
elapsed_milliseconds = 10
file = phd-tests/framework/src/test_vm/mod.rs
line = 913
path = phd_tests::migrate::from_base::can_migrate_from_base
target = phd_framework::test_vm
vm = migration_from_base
vm_id = cad3f3bb-f795-40bd-a4bc-52102cbd6314
|
| 159 | 2026-10-12T21:21:03.409Z | INFO | phd-runner: [WAIT_FOR_SERIAL_OUTPUT - START]
file = phd-tests/framework/src/test_vm/mod.rs
line = 913
path = phd_tests::migrate::from_base::can_migrate_from_base
target = phd_framework::test_vm
vm = migration_from_base
vm_id = cad3f3bb-f795-40bd-a4bc-52102cbd6314
|
| 160 | 2026-10-12T21:21:03.409Z | INFO | phd-runner: [WAIT_FOR_SERIAL_OUTPUT - EVENT] Waiting for output on serial console
file = phd-tests/framework/src/test_vm/mod.rs
line = 920
path = phd_tests::migrate::from_base::can_migrate_from_base
target = phd_framework::test_vm
timeout_duration = Explicit(300s)
vm = migration_from_base
vm_id = cad3f3bb-f795-40bd-a4bc-52102cbd6314
|
| 161 | 2026-10-12T21:21:03.442Z | INFO | phd-runner: [WAIT_FOR_SERIAL_OUTPUT - END]
elapsed_milliseconds = 33
file = phd-tests/framework/src/test_vm/mod.rs
line = 913
path = phd_tests::migrate::from_base::can_migrate_from_base
target = phd_framework::test_vm
vm = migration_from_base
vm_id = cad3f3bb-f795-40bd-a4bc-52102cbd6314
|
| 162 | 2026-10-12T21:21:03.443Z | INFO | phd-runner: [WAIT_FOR_SERIAL_OUTPUT - START]
file = phd-tests/framework/src/test_vm/mod.rs
line = 913
path = phd_tests::migrate::from_base::can_migrate_from_base
target = phd_framework::test_vm
vm = migration_from_base
vm_id = cad3f3bb-f795-40bd-a4bc-52102cbd6314
|
| 163 | 2026-10-12T21:21:03.443Z | INFO | phd-runner: [WAIT_FOR_SERIAL_OUTPUT - EVENT] Waiting for output on serial console
file = phd-tests/framework/src/test_vm/mod.rs
line = 920
path = phd_tests::migrate::from_base::can_migrate_from_base
target = phd_framework::test_vm
timeout_duration = Explicit(15s)
vm = migration_from_base
vm_id = cad3f3bb-f795-40bd-a4bc-52102cbd6314
|
| 164 | 2026-10-12T21:21:03.454Z | INFO | phd-runner: [WAIT_FOR_SERIAL_OUTPUT - END]
elapsed_milliseconds = 10
file = phd-tests/framework/src/test_vm/mod.rs
line = 913
path = phd_tests::migrate::from_base::can_migrate_from_base
target = phd_framework::test_vm
vm = migration_from_base
vm_id = cad3f3bb-f795-40bd-a4bc-52102cbd6314
|
| 165 | 2026-10-12T21:21:03.454Z | INFO | phd-runner: [WAIT_FOR_SERIAL_OUTPUT - START]
file = phd-tests/framework/src/test_vm/mod.rs
line = 913
path = phd_tests::migrate::from_base::can_migrate_from_base
target = phd_framework::test_vm
vm = migration_from_base
vm_id = cad3f3bb-f795-40bd-a4bc-52102cbd6314
|
| 166 | 2026-10-12T21:21:03.454Z | INFO | phd-runner: [WAIT_FOR_SERIAL_OUTPUT - EVENT] Waiting for output on serial console
file = phd-tests/framework/src/test_vm/mod.rs
line = 920
path = phd_tests::migrate::from_base::can_migrate_from_base
target = phd_framework::test_vm
timeout_duration = Explicit(300s)
vm = migration_from_base
vm_id = cad3f3bb-f795-40bd-a4bc-52102cbd6314
|
| 167 | 2026-10-12T21:21:03.476Z | INFO | phd-runner: [WAIT_FOR_SERIAL_OUTPUT - END]
elapsed_milliseconds = 21
file = phd-tests/framework/src/test_vm/mod.rs
line = 913
path = phd_tests::migrate::from_base::can_migrate_from_base
target = phd_framework::test_vm
vm = migration_from_base
vm_id = cad3f3bb-f795-40bd-a4bc-52102cbd6314
|
| 168 | 2026-10-12T21:21:03.476Z | INFO | phd-runner: [WAIT_FOR_SERIAL_OUTPUT - START]
file = phd-tests/framework/src/test_vm/mod.rs
line = 913
path = phd_tests::migrate::from_base::can_migrate_from_base
target = phd_framework::test_vm
vm = migration_from_base
vm_id = cad3f3bb-f795-40bd-a4bc-52102cbd6314
|
| 169 | 2026-10-12T21:21:03.476Z | INFO | phd-runner: [WAIT_FOR_SERIAL_OUTPUT - EVENT] Waiting for output on serial console
file = phd-tests/framework/src/test_vm/mod.rs
line = 920
path = phd_tests::migrate::from_base::can_migrate_from_base
target = phd_framework::test_vm
timeout_duration = Explicit(15s)
vm = migration_from_base
vm_id = cad3f3bb-f795-40bd-a4bc-52102cbd6314
|
| 170 | 2026-10-12T21:21:03.487Z | INFO | phd-runner: [WAIT_FOR_SERIAL_OUTPUT - END]
elapsed_milliseconds = 10
file = phd-tests/framework/src/test_vm/mod.rs
line = 913
path = phd_tests::migrate::from_base::can_migrate_from_base
target = phd_framework::test_vm
vm = migration_from_base
vm_id = cad3f3bb-f795-40bd-a4bc-52102cbd6314
|
| 171 | 2026-10-12T21:21:03.487Z | INFO | phd-runner: [WAIT_FOR_SERIAL_OUTPUT - START]
file = phd-tests/framework/src/test_vm/mod.rs
line = 913
path = phd_tests::migrate::from_base::can_migrate_from_base
target = phd_framework::test_vm
vm = migration_from_base
vm_id = cad3f3bb-f795-40bd-a4bc-52102cbd6314
|
| 172 | 2026-10-12T21:21:03.487Z | INFO | phd-runner: [WAIT_FOR_SERIAL_OUTPUT - EVENT] Waiting for output on serial console
file = phd-tests/framework/src/test_vm/mod.rs
line = 920
path = phd_tests::migrate::from_base::can_migrate_from_base
target = phd_framework::test_vm
timeout_duration = Explicit(300s)
vm = migration_from_base
vm_id = cad3f3bb-f795-40bd-a4bc-52102cbd6314
|
| 173 | 2026-10-12T21:21:03.520Z | INFO | phd-runner: [WAIT_FOR_SERIAL_OUTPUT - END]
elapsed_milliseconds = 33
file = phd-tests/framework/src/test_vm/mod.rs
line = 913
path = phd_tests::migrate::from_base::can_migrate_from_base
target = phd_framework::test_vm
vm = migration_from_base
vm_id = cad3f3bb-f795-40bd-a4bc-52102cbd6314
|
| 174 | 2026-10-12T21:21:03.521Z | INFO | phd-runner: [WAIT_FOR_SERIAL_OUTPUT - START]
file = phd-tests/framework/src/test_vm/mod.rs
line = 913
path = phd_tests::migrate::from_base::can_migrate_from_base
target = phd_framework::test_vm
vm = migration_from_base
vm_id = cad3f3bb-f795-40bd-a4bc-52102cbd6314
|
| 175 | 2026-10-12T21:21:03.521Z | INFO | phd-runner: [WAIT_FOR_SERIAL_OUTPUT - EVENT] Waiting for output on serial console
file = phd-tests/framework/src/test_vm/mod.rs
line = 920
path = phd_tests::migrate::from_base::can_migrate_from_base
target = phd_framework::test_vm
timeout_duration = Explicit(15s)
vm = migration_from_base
vm_id = cad3f3bb-f795-40bd-a4bc-52102cbd6314
|
| 176 | 2026-10-12T21:21:03.531Z | INFO | phd-runner: [WAIT_FOR_SERIAL_OUTPUT - END]
elapsed_milliseconds = 10
file = phd-tests/framework/src/test_vm/mod.rs
line = 913
path = phd_tests::migrate::from_base::can_migrate_from_base
target = phd_framework::test_vm
vm = migration_from_base
vm_id = cad3f3bb-f795-40bd-a4bc-52102cbd6314
|
| 177 | 2026-10-12T21:21:03.532Z | INFO | phd-runner: [WAIT_FOR_SERIAL_OUTPUT - START]
file = phd-tests/framework/src/test_vm/mod.rs
line = 913
path = phd_tests::migrate::from_base::can_migrate_from_base
target = phd_framework::test_vm
vm = migration_from_base
vm_id = cad3f3bb-f795-40bd-a4bc-52102cbd6314
|
| 178 | 2026-10-12T21:21:03.532Z | INFO | phd-runner: [WAIT_FOR_SERIAL_OUTPUT - EVENT] Waiting for output on serial console
file = phd-tests/framework/src/test_vm/mod.rs
line = 920
path = phd_tests::migrate::from_base::can_migrate_from_base
target = phd_framework::test_vm
timeout_duration = Explicit(300s)
vm = migration_from_base
vm_id = cad3f3bb-f795-40bd-a4bc-52102cbd6314
|
| 179 | 2026-10-12T21:21:03.554Z | INFO | phd-runner: [WAIT_FOR_SERIAL_OUTPUT - END]
elapsed_milliseconds = 22
file = phd-tests/framework/src/test_vm/mod.rs
line = 913
path = phd_tests::migrate::from_base::can_migrate_from_base
target = phd_framework::test_vm
vm = migration_from_base
vm_id = cad3f3bb-f795-40bd-a4bc-52102cbd6314
|
| 180 | 2026-10-12T21:21:03.554Z | INFO | phd-runner: [WAIT_FOR_SERIAL_OUTPUT - START]
file = phd-tests/framework/src/test_vm/mod.rs
line = 913
path = phd_tests::migrate::from_base::can_migrate_from_base
target = phd_framework::test_vm
vm = migration_from_base
vm_id = cad3f3bb-f795-40bd-a4bc-52102cbd6314
|
| 181 | 2026-10-12T21:21:03.554Z | INFO | phd-runner: [WAIT_FOR_SERIAL_OUTPUT - EVENT] Waiting for output on serial console
file = phd-tests/framework/src/test_vm/mod.rs
line = 920
path = phd_tests::migrate::from_base::can_migrate_from_base
target = phd_framework::test_vm
timeout_duration = Explicit(15s)
vm = migration_from_base
vm_id = cad3f3bb-f795-40bd-a4bc-52102cbd6314
|
| 182 | 2026-10-12T21:21:03.565Z | INFO | phd-runner: [WAIT_FOR_SERIAL_OUTPUT - END]
elapsed_milliseconds = 10
file = phd-tests/framework/src/test_vm/mod.rs
line = 913
path = phd_tests::migrate::from_base::can_migrate_from_base
target = phd_framework::test_vm
vm = migration_from_base
vm_id = cad3f3bb-f795-40bd-a4bc-52102cbd6314
|
| 183 | 2026-10-12T21:21:03.565Z | INFO | phd-runner: [WAIT_FOR_SERIAL_OUTPUT - START]
file = phd-tests/framework/src/test_vm/mod.rs
line = 913
path = phd_tests::migrate::from_base::can_migrate_from_base
target = phd_framework::test_vm
vm = migration_from_base
vm_id = cad3f3bb-f795-40bd-a4bc-52102cbd6314
|
| 184 | 2026-10-12T21:21:03.565Z | INFO | phd-runner: [WAIT_FOR_SERIAL_OUTPUT - EVENT] Waiting for output on serial console
file = phd-tests/framework/src/test_vm/mod.rs
line = 920
path = phd_tests::migrate::from_base::can_migrate_from_base
target = phd_framework::test_vm
timeout_duration = Explicit(300s)
vm = migration_from_base
vm_id = cad3f3bb-f795-40bd-a4bc-52102cbd6314
|
| 185 | 2026-10-12T21:21:03.598Z | INFO | phd-runner: [WAIT_FOR_SERIAL_OUTPUT - END]
elapsed_milliseconds = 33
file = phd-tests/framework/src/test_vm/mod.rs
line = 913
path = phd_tests::migrate::from_base::can_migrate_from_base
target = phd_framework::test_vm
vm = migration_from_base
vm_id = cad3f3bb-f795-40bd-a4bc-52102cbd6314
|
| 186 | 2026-10-12T21:21:03.600Z | INFO | phd-runner: [WAIT_FOR_SERIAL_OUTPUT - START]
file = phd-tests/framework/src/test_vm/mod.rs
line = 913
path = phd_tests::migrate::from_base::can_migrate_from_base
target = phd_framework::test_vm
vm = migration_from_base
vm_id = cad3f3bb-f795-40bd-a4bc-52102cbd6314
|
| 187 | 2026-10-12T21:21:03.600Z | INFO | phd-runner: [WAIT_FOR_SERIAL_OUTPUT - EVENT] Waiting for output on serial console
file = phd-tests/framework/src/test_vm/mod.rs
line = 920
path = phd_tests::migrate::from_base::can_migrate_from_base
target = phd_framework::test_vm
timeout_duration = Explicit(15s)
vm = migration_from_base
vm_id = cad3f3bb-f795-40bd-a4bc-52102cbd6314
|
| 188 | 2026-10-12T21:21:03.609Z | INFO | phd-runner: [WAIT_FOR_SERIAL_OUTPUT - END]
elapsed_milliseconds = 9
file = phd-tests/framework/src/test_vm/mod.rs
line = 913
path = phd_tests::migrate::from_base::can_migrate_from_base
target = phd_framework::test_vm
vm = migration_from_base
vm_id = cad3f3bb-f795-40bd-a4bc-52102cbd6314
|
| 189 | 2026-10-12T21:21:03.610Z | INFO | phd-runner: [WAIT_FOR_SERIAL_OUTPUT - START]
file = phd-tests/framework/src/test_vm/mod.rs
line = 913
path = phd_tests::migrate::from_base::can_migrate_from_base
target = phd_framework::test_vm
vm = migration_from_base
vm_id = cad3f3bb-f795-40bd-a4bc-52102cbd6314
|
| 190 | 2026-10-12T21:21:03.610Z | INFO | phd-runner: [WAIT_FOR_SERIAL_OUTPUT - EVENT] Waiting for output on serial console
file = phd-tests/framework/src/test_vm/mod.rs
line = 920
path = phd_tests::migrate::from_base::can_migrate_from_base
target = phd_framework::test_vm
timeout_duration = Explicit(300s)
vm = migration_from_base
vm_id = cad3f3bb-f795-40bd-a4bc-52102cbd6314
|
| 191 | 2026-10-12T21:21:03.633Z | INFO | phd-runner: [WAIT_FOR_SERIAL_OUTPUT - END]
elapsed_milliseconds = 22
file = phd-tests/framework/src/test_vm/mod.rs
line = 913
path = phd_tests::migrate::from_base::can_migrate_from_base
target = phd_framework::test_vm
vm = migration_from_base
vm_id = cad3f3bb-f795-40bd-a4bc-52102cbd6314
|
| 192 | 2026-10-12T21:21:03.633Z | INFO | phd-runner: [TEST - EVENT] migrating to new Propolis artifact for lifecycle test
file = phd-tests/framework/src/lifecycle.rs
line = 73
path = phd_tests::migrate::from_base::can_migrate_from_base
propolis_artifact = __DEFAULT_PROPOLIS
target = phd_framework::lifecycle
vm_name = migration_from_base
|
| 193 | 2026-10-12T21:21:03.633Z | INFO | phd-runner: [NEW - START]
file = phd-tests/framework/src/test_vm/mod.rs
line = 300
path = phd_tests::migrate::from_base::can_migrate_from_base
target = phd_framework::test_vm
|
| 194 | 2026-10-12T21:21:03.633Z | INFO | phd-runner: [NEW - EVENT] phd_framework::test_vm
environment = EnvironmentSpec { location: Local, propolis_artifact: "__DEFAULT_PROPOLIS", metrics: None }
file = phd-tests/framework/src/test_vm/mod.rs
guest_os_kind = Alpine
line = 318
path = phd_tests::migrate::from_base::can_migrate_from_base
target = phd_framework::test_vm
vm_name = migration_from_base_lifecycle_0
|
| 195 | 2026-10-12T21:21:03.633Z | DEBG | phd-runner: [NEW - EVENT] Verified artifact already exists
file = phd-tests/framework/src/artifacts/store.rs
line = 45
path = /work/phd-test/propolis-server
target = phd_framework::artifacts::store
|
| 196 | 2026-10-12T21:21:03.633Z | INFO | phd-runner: [NEW - EVENT] Launching Propolis server
bootrom_path = "/phd-artifacts/740187046a7267d0de72d3455070333547dbc0ea023531471fb2b2a61effa448/OVMF_CODE.fd"
file = phd-tests/framework/src/test_vm/server.rs
line = 66
path = phd_tests::migrate::from_base::can_migrate_from_base
server_addr = 127.0.0.1:9002
server_path = "/work/phd-test/propolis-server"
target = phd_framework::test_vm::server
|
| 197 | 2026-10-12T21:21:03.633Z | INFO | phd-runner: [NEW - EVENT] Opening server log files
file = phd-tests/framework/src/log_config.rs
line = 84
path = phd_tests::migrate::from_base::can_migrate_from_base
stderr_path = "/tmp/propolis-phd/phd_tests::migrate::from_base::can_migrate_from_base/migration_from_base_lifecycle_0.stderr.log"
stdout_path = "/tmp/propolis-phd/phd_tests::migrate::from_base::can_migrate_from_base/migration_from_base_lifecycle_0.stdout.log"
target = phd_framework::log_config
|
| 198 | 2026-10-12T21:21:03.685Z | INFO | phd-runner: [NEW - EVENT] Launched server with pid 928
file = phd-tests/framework/src/test_vm/server.rs
line = 127
path = phd_tests::migrate::from_base::can_migrate_from_base
target = phd_framework::test_vm::server
|
| 199 | 2026-10-12T21:21:03.698Z | INFO | phd-runner: [NEW - END]
elapsed_milliseconds = 64
file = phd-tests/framework/src/test_vm/mod.rs
line = 300
path = phd_tests::migrate::from_base::can_migrate_from_base
target = phd_framework::test_vm
|
| 200 | 2026-10-12T21:21:03.698Z | INFO | phd-runner: [MIGRATE_FROM - START]
file = phd-tests/framework/src/test_vm/mod.rs
line = 609
path = phd_tests::migrate::from_base::can_migrate_from_base
source = migration_from_base
source_id = cad3f3bb-f795-40bd-a4bc-52102cbd6314
target = phd_framework::test_vm
target_id = 701d5ff2-f3b0-4266-9488-b72a5e3803fb
|
| 201 | 2026-10-12T21:21:03.698Z | INFO | phd-runner: [MIGRATE_FROM - EVENT] Migrating from source at address 127.0.0.1:9000
file = phd-tests/framework/src/test_vm/mod.rs
line = 642
migration_id = c31f7454-36f9-488e-91d9-147dd77b9506
path = phd_tests::migrate::from_base::can_migrate_from_base
source = migration_from_base
source_id = cad3f3bb-f795-40bd-a4bc-52102cbd6314
target = phd_framework::test_vm
target_id = 701d5ff2-f3b0-4266-9488-b72a5e3803fb
timeout_duration = 45s
|
| 202 | 2026-10-12T21:21:03.698Z | INFO | phd-runner: [INSTANCE_ENSURE_INTERNAL - START]
file = phd-tests/framework/src/test_vm/mod.rs
line = 412
path = phd_tests::migrate::from_base::can_migrate_from_base
source = migration_from_base
source_id = cad3f3bb-f795-40bd-a4bc-52102cbd6314
target = phd_framework::test_vm
target_id = 701d5ff2-f3b0-4266-9488-b72a5e3803fb
vm = migration_from_base_lifecycle_0
vm_id = 701d5ff2-f3b0-4266-9488-b72a5e3803fb
|
| 203 | 2026-10-12T21:21:03.699Z | INFO | phd-runner: [INSTANCE_ENSURE_INTERNAL - EVENT] retriable error from instance_spec_ensure
e = Communication Error: error sending request for url (http://127.0.0.1:9002/instance)
file = phd-tests/framework/src/test_vm/mod.rs
line = 455
path = phd_tests::migrate::from_base::can_migrate_from_base
source = migration_from_base
source_id = cad3f3bb-f795-40bd-a4bc-52102cbd6314
target = phd_framework::test_vm
target_id = 701d5ff2-f3b0-4266-9488-b72a5e3803fb
vm = migration_from_base_lifecycle_0
vm_id = 701d5ff2-f3b0-4266-9488-b72a5e3803fb
|
| 204 | 2026-10-12T21:21:04.429Z | INFO | phd-runner: [INSTANCE_ENSURE_INTERNAL - EVENT] Started instance
file = phd-tests/framework/src/test_vm/mod.rs
instance_description.instance = Instance { properties: InstanceProperties { id: 701d5ff2-f3b0-4266-9488-b72a5e3803fb, name: "phd-vm-701d5ff2-f3b0-4266-9488-b72a5e3803fb", description: "Pheidippides-managed VM", metadata: InstanceMetadata { silo_id: c9cff454-4e25-457a-ba2d-35266cce7470, project_id: 245cc679-36d4-4e24-845f-2cb528bfd9f7, sled_id: c40ad439-d058-4a88-ab42-59c9e4b052c1, sled_serial: "c40ad439-d058-4a88-ab42-59c9e4b052c1", sled_revision: 1, sled_model: "pheidippes" } }, state: Migrating }
line = 514
path = phd_tests::migrate::from_base::can_migrate_from_base
source = migration_from_base
source_id = cad3f3bb-f795-40bd-a4bc-52102cbd6314
target = phd_framework::test_vm
target_id = 701d5ff2-f3b0-4266-9488-b72a5e3803fb
vm = migration_from_base_lifecycle_0
vm_id = 701d5ff2-f3b0-4266-9488-b72a5e3803fb
|
| 205 | 2026-10-12T21:21:04.429Z | INFO | phd-runner: [MIGRATE - START]
file = phd-tests/framework/src/test_vm/mod.rs
line = 663
migration_id = c31f7454-36f9-488e-91d9-147dd77b9506
path = phd_tests::migrate::from_base::can_migrate_from_base
source = migration_from_base
source_id = cad3f3bb-f795-40bd-a4bc-52102cbd6314
target = phd_framework::test_vm
target_id = 701d5ff2-f3b0-4266-9488-b72a5e3803fb
|
| 206 | 2026-10-12T21:21:06.950Z | INFO | phd-runner: [SERIAL CONSOLE TASK - EVENT] serial socket control message
file = phd-tests/framework/src/serial/mod.rs
line = 275
s = {"Migrating":{"destination":"127.0.0.1:9002","from_start":7847}}
target = phd_framework::serial
|
| 207 | 2026-10-12T21:21:07.327Z | INFO | phd-runner: [MIGRATE_FROM - EVENT] Migration completed successfully
file = phd-tests/framework/src/test_vm/mod.rs
line = 676
path = phd_tests::migrate::from_base::can_migrate_from_base
source = migration_from_base
source_id = cad3f3bb-f795-40bd-a4bc-52102cbd6314
target = phd_framework::test_vm
target_id = 701d5ff2-f3b0-4266-9488-b72a5e3803fb
|
| 208 | 2026-10-12T21:21:07.327Z | INFO | phd-runner: [MIGRATE - END]
elapsed_milliseconds = 2897
file = phd-tests/framework/src/test_vm/mod.rs
line = 663
migration_id = c31f7454-36f9-488e-91d9-147dd77b9506
path = phd_tests::migrate::from_base::can_migrate_from_base
source = migration_from_base
source_id = cad3f3bb-f795-40bd-a4bc-52102cbd6314
target = phd_framework::test_vm
target_id = 701d5ff2-f3b0-4266-9488-b72a5e3803fb
|
| 209 | 2026-10-12T21:21:07.329Z | INFO | phd-runner: [VM CLEANUP - START]
file = phd-tests/framework/src/test_vm/mod.rs
line = 1172
path = phd_tests::migrate::from_base::can_migrate_from_base
target = phd_framework::test_vm
vm = migration_from_base
vm_id = cad3f3bb-f795-40bd-a4bc-52102cbd6314
|
| 210 | 2026-10-12T21:21:07.329Z | INFO | phd-runner: [WAIT_FOR_SERIAL_OUTPUT - START]
file = phd-tests/framework/src/test_vm/mod.rs
line = 913
path = phd_tests::migrate::from_base::can_migrate_from_base
target = phd_framework::test_vm
vm = migration_from_base_lifecycle_0
vm_id = 701d5ff2-f3b0-4266-9488-b72a5e3803fb
|
| 211 | 2026-10-12T21:21:07.329Z | INFO | phd-runner: [WAIT_FOR_SERIAL_OUTPUT - EVENT] Waiting for output on serial console
file = phd-tests/framework/src/test_vm/mod.rs
line = 920
path = phd_tests::migrate::from_base::can_migrate_from_base
target = phd_framework::test_vm
timeout_duration = Explicit(15s)
vm = migration_from_base_lifecycle_0
vm_id = 701d5ff2-f3b0-4266-9488-b72a5e3803fb
|
| 212 | 2026-10-12T21:21:07.331Z | DEBG | phd-runner: [VM CLEANUP - EVENT] Killing Propolis server process
file = phd-tests/framework/src/test_vm/server.rs
line = 177
path = phd_tests::migrate::from_base::can_migrate_from_base
self.address = 127.0.0.1:9000
target = phd_framework::test_vm::server
vm = migration_from_base
vm_id = cad3f3bb-f795-40bd-a4bc-52102cbd6314
|
| 213 | 2026-10-12T21:21:07.409Z | INFO | phd-runner: [VM CLEANUP - END]
elapsed_milliseconds = 79
file = phd-tests/framework/src/test_vm/mod.rs
line = 1172
path = phd_tests::migrate::from_base::can_migrate_from_base
target = phd_framework::test_vm
vm = migration_from_base
vm_id = cad3f3bb-f795-40bd-a4bc-52102cbd6314
|
| 214 | 2026-10-12T21:21:07.410Z | INFO | phd-runner: [INSTANCE_ENSURE_INTERNAL - END]
elapsed_milliseconds = 9257
file = phd-tests/framework/src/test_vm/mod.rs
line = 412
path = phd_tests::migrate::from_base::can_migrate_from_base
target = phd_framework::test_vm
vm = migration_from_base
vm_id = cad3f3bb-f795-40bd-a4bc-52102cbd6314
|
| 215 | 2026-10-12T21:21:07.410Z | INFO | phd-runner: [WAIT_FOR_SERIAL_OUTPUT - END]
elapsed_milliseconds = 80
file = phd-tests/framework/src/test_vm/mod.rs
line = 913
path = phd_tests::migrate::from_base::can_migrate_from_base
target = phd_framework::test_vm
vm = migration_from_base_lifecycle_0
vm_id = 701d5ff2-f3b0-4266-9488-b72a5e3803fb
|
| 216 | 2026-10-12T21:21:07.410Z | INFO | phd-runner: [WAIT_FOR_SERIAL_OUTPUT - START]
file = phd-tests/framework/src/test_vm/mod.rs
line = 913
path = phd_tests::migrate::from_base::can_migrate_from_base
target = phd_framework::test_vm
vm = migration_from_base_lifecycle_0
vm_id = 701d5ff2-f3b0-4266-9488-b72a5e3803fb
|
| 217 | 2026-10-12T21:21:07.410Z | INFO | phd-runner: [WAIT_FOR_SERIAL_OUTPUT - EVENT] Waiting for output on serial console
file = phd-tests/framework/src/test_vm/mod.rs
line = 920
path = phd_tests::migrate::from_base::can_migrate_from_base
target = phd_framework::test_vm
timeout_duration = Explicit(300s)
vm = migration_from_base_lifecycle_0
vm_id = 701d5ff2-f3b0-4266-9488-b72a5e3803fb
|
| 218 | 2026-10-12T21:21:07.442Z | INFO | phd-runner: [WAIT_FOR_SERIAL_OUTPUT - END]
elapsed_milliseconds = 31
file = phd-tests/framework/src/test_vm/mod.rs
line = 913
path = phd_tests::migrate::from_base::can_migrate_from_base
target = phd_framework::test_vm
vm = migration_from_base_lifecycle_0
vm_id = 701d5ff2-f3b0-4266-9488-b72a5e3803fb
|
| 219 | 2026-10-12T21:21:07.442Z | INFO | phd-runner: [WAIT_FOR_SERIAL_OUTPUT - START]
file = phd-tests/framework/src/test_vm/mod.rs
line = 913
path = phd_tests::migrate::from_base::can_migrate_from_base
target = phd_framework::test_vm
vm = migration_from_base_lifecycle_0
vm_id = 701d5ff2-f3b0-4266-9488-b72a5e3803fb
|
| 220 | 2026-10-12T21:21:07.442Z | INFO | phd-runner: [WAIT_FOR_SERIAL_OUTPUT - EVENT] Waiting for output on serial console
file = phd-tests/framework/src/test_vm/mod.rs
line = 920
path = phd_tests::migrate::from_base::can_migrate_from_base
target = phd_framework::test_vm
timeout_duration = Explicit(15s)
vm = migration_from_base_lifecycle_0
vm_id = 701d5ff2-f3b0-4266-9488-b72a5e3803fb
|
| 221 | 2026-10-12T21:21:07.453Z | INFO | phd-runner: [WAIT_FOR_SERIAL_OUTPUT - END]
elapsed_milliseconds = 10
file = phd-tests/framework/src/test_vm/mod.rs
line = 913
path = phd_tests::migrate::from_base::can_migrate_from_base
target = phd_framework::test_vm
vm = migration_from_base_lifecycle_0
vm_id = 701d5ff2-f3b0-4266-9488-b72a5e3803fb
|
| 222 | 2026-10-12T21:21:07.453Z | INFO | phd-runner: [WAIT_FOR_SERIAL_OUTPUT - START]
file = phd-tests/framework/src/test_vm/mod.rs
line = 913
path = phd_tests::migrate::from_base::can_migrate_from_base
target = phd_framework::test_vm
vm = migration_from_base_lifecycle_0
vm_id = 701d5ff2-f3b0-4266-9488-b72a5e3803fb
|
| 223 | 2026-10-12T21:21:07.453Z | INFO | phd-runner: [WAIT_FOR_SERIAL_OUTPUT - EVENT] Waiting for output on serial console
file = phd-tests/framework/src/test_vm/mod.rs
line = 920
path = phd_tests::migrate::from_base::can_migrate_from_base
target = phd_framework::test_vm
timeout_duration = Explicit(300s)
vm = migration_from_base_lifecycle_0
vm_id = 701d5ff2-f3b0-4266-9488-b72a5e3803fb
|
| 224 | 2026-10-12T21:21:07.487Z | INFO | phd-runner: [WAIT_FOR_SERIAL_OUTPUT - END]
elapsed_milliseconds = 34
file = phd-tests/framework/src/test_vm/mod.rs
line = 913
path = phd_tests::migrate::from_base::can_migrate_from_base
target = phd_framework::test_vm
vm = migration_from_base_lifecycle_0
vm_id = 701d5ff2-f3b0-4266-9488-b72a5e3803fb
|
| 225 | 2026-10-12T21:21:07.487Z | INFO | phd-runner: [WAIT_FOR_SERIAL_OUTPUT - START]
file = phd-tests/framework/src/test_vm/mod.rs
line = 913
path = phd_tests::migrate::from_base::can_migrate_from_base
target = phd_framework::test_vm
vm = migration_from_base_lifecycle_0
vm_id = 701d5ff2-f3b0-4266-9488-b72a5e3803fb
|
| 226 | 2026-10-12T21:21:07.487Z | INFO | phd-runner: [WAIT_FOR_SERIAL_OUTPUT - EVENT] Waiting for output on serial console
file = phd-tests/framework/src/test_vm/mod.rs
line = 920
path = phd_tests::migrate::from_base::can_migrate_from_base
target = phd_framework::test_vm
timeout_duration = Explicit(15s)
vm = migration_from_base_lifecycle_0
vm_id = 701d5ff2-f3b0-4266-9488-b72a5e3803fb
|
| 227 | 2026-10-12T21:21:07.498Z | INFO | phd-runner: [WAIT_FOR_SERIAL_OUTPUT - END]
elapsed_milliseconds = 10
file = phd-tests/framework/src/test_vm/mod.rs
line = 913
path = phd_tests::migrate::from_base::can_migrate_from_base
target = phd_framework::test_vm
vm = migration_from_base_lifecycle_0
vm_id = 701d5ff2-f3b0-4266-9488-b72a5e3803fb
|
| 228 | 2026-10-12T21:21:07.498Z | INFO | phd-runner: [WAIT_FOR_SERIAL_OUTPUT - START]
file = phd-tests/framework/src/test_vm/mod.rs
line = 913
path = phd_tests::migrate::from_base::can_migrate_from_base
target = phd_framework::test_vm
vm = migration_from_base_lifecycle_0
vm_id = 701d5ff2-f3b0-4266-9488-b72a5e3803fb
|
| 229 | 2026-10-12T21:21:07.498Z | INFO | phd-runner: [WAIT_FOR_SERIAL_OUTPUT - EVENT] Waiting for output on serial console
file = phd-tests/framework/src/test_vm/mod.rs
line = 920
path = phd_tests::migrate::from_base::can_migrate_from_base
target = phd_framework::test_vm
timeout_duration = Explicit(300s)
vm = migration_from_base_lifecycle_0
vm_id = 701d5ff2-f3b0-4266-9488-b72a5e3803fb
|
| 230 | 2026-10-12T21:21:07.532Z | INFO | phd-runner: [WAIT_FOR_SERIAL_OUTPUT - END]
elapsed_milliseconds = 33
file = phd-tests/framework/src/test_vm/mod.rs
line = 913
path = phd_tests::migrate::from_base::can_migrate_from_base
target = phd_framework::test_vm
vm = migration_from_base_lifecycle_0
vm_id = 701d5ff2-f3b0-4266-9488-b72a5e3803fb
|
| 231 | 2026-10-12T21:21:07.532Z | INFO | phd-runner: [WAIT_FOR_SERIAL_OUTPUT - START]
file = phd-tests/framework/src/test_vm/mod.rs
line = 913
path = phd_tests::migrate::from_base::can_migrate_from_base
target = phd_framework::test_vm
vm = migration_from_base_lifecycle_0
vm_id = 701d5ff2-f3b0-4266-9488-b72a5e3803fb
|
| 232 | 2026-10-12T21:21:07.532Z | INFO | phd-runner: [WAIT_FOR_SERIAL_OUTPUT - EVENT] Waiting for output on serial console
file = phd-tests/framework/src/test_vm/mod.rs
line = 920
path = phd_tests::migrate::from_base::can_migrate_from_base
target = phd_framework::test_vm
timeout_duration = Explicit(15s)
vm = migration_from_base_lifecycle_0
vm_id = 701d5ff2-f3b0-4266-9488-b72a5e3803fb
|
| 233 | 2026-10-12T21:21:07.543Z | INFO | phd-runner: [WAIT_FOR_SERIAL_OUTPUT - END]
elapsed_milliseconds = 11
file = phd-tests/framework/src/test_vm/mod.rs
line = 913
path = phd_tests::migrate::from_base::can_migrate_from_base
target = phd_framework::test_vm
vm = migration_from_base_lifecycle_0
vm_id = 701d5ff2-f3b0-4266-9488-b72a5e3803fb
|
| 234 | 2026-10-12T21:21:07.544Z | INFO | phd-runner: [WAIT_FOR_SERIAL_OUTPUT - START]
file = phd-tests/framework/src/test_vm/mod.rs
line = 913
path = phd_tests::migrate::from_base::can_migrate_from_base
target = phd_framework::test_vm
vm = migration_from_base_lifecycle_0
vm_id = 701d5ff2-f3b0-4266-9488-b72a5e3803fb
|
| 235 | 2026-10-12T21:21:07.544Z | INFO | phd-runner: [WAIT_FOR_SERIAL_OUTPUT - EVENT] Waiting for output on serial console
file = phd-tests/framework/src/test_vm/mod.rs
line = 920
path = phd_tests::migrate::from_base::can_migrate_from_base
target = phd_framework::test_vm
timeout_duration = Explicit(300s)
vm = migration_from_base_lifecycle_0
vm_id = 701d5ff2-f3b0-4266-9488-b72a5e3803fb
|
| 236 | 2026-10-12T21:21:07.578Z | INFO | phd-runner: [WAIT_FOR_SERIAL_OUTPUT - END]
elapsed_milliseconds = 34
file = phd-tests/framework/src/test_vm/mod.rs
line = 913
path = phd_tests::migrate::from_base::can_migrate_from_base
target = phd_framework::test_vm
vm = migration_from_base_lifecycle_0
vm_id = 701d5ff2-f3b0-4266-9488-b72a5e3803fb
|
| 237 | 2026-10-12T21:21:07.578Z | INFO | phd-runner: [WAIT_FOR_SERIAL_OUTPUT - START]
file = phd-tests/framework/src/test_vm/mod.rs
line = 913
path = phd_tests::migrate::from_base::can_migrate_from_base
target = phd_framework::test_vm
vm = migration_from_base_lifecycle_0
vm_id = 701d5ff2-f3b0-4266-9488-b72a5e3803fb
|
| 238 | 2026-10-12T21:21:07.578Z | INFO | phd-runner: [WAIT_FOR_SERIAL_OUTPUT - EVENT] Waiting for output on serial console
file = phd-tests/framework/src/test_vm/mod.rs
line = 920
path = phd_tests::migrate::from_base::can_migrate_from_base
target = phd_framework::test_vm
timeout_duration = Explicit(15s)
vm = migration_from_base_lifecycle_0
vm_id = 701d5ff2-f3b0-4266-9488-b72a5e3803fb
|
| 239 | 2026-10-12T21:21:07.589Z | INFO | phd-runner: [WAIT_FOR_SERIAL_OUTPUT - END]
elapsed_milliseconds = 10
file = phd-tests/framework/src/test_vm/mod.rs
line = 913
path = phd_tests::migrate::from_base::can_migrate_from_base
target = phd_framework::test_vm
vm = migration_from_base_lifecycle_0
vm_id = 701d5ff2-f3b0-4266-9488-b72a5e3803fb
|
| 240 | 2026-10-12T21:21:07.589Z | INFO | phd-runner: [WAIT_FOR_SERIAL_OUTPUT - START]
file = phd-tests/framework/src/test_vm/mod.rs
line = 913
path = phd_tests::migrate::from_base::can_migrate_from_base
target = phd_framework::test_vm
vm = migration_from_base_lifecycle_0
vm_id = 701d5ff2-f3b0-4266-9488-b72a5e3803fb
|
| 241 | 2026-10-12T21:21:07.589Z | INFO | phd-runner: [WAIT_FOR_SERIAL_OUTPUT - EVENT] Waiting for output on serial console
file = phd-tests/framework/src/test_vm/mod.rs
line = 920
path = phd_tests::migrate::from_base::can_migrate_from_base
target = phd_framework::test_vm
timeout_duration = Explicit(300s)
vm = migration_from_base_lifecycle_0
vm_id = 701d5ff2-f3b0-4266-9488-b72a5e3803fb
|
| 242 | 2026-10-12T21:21:07.633Z | INFO | phd-runner: [WAIT_FOR_SERIAL_OUTPUT - END]
elapsed_milliseconds = 43
file = phd-tests/framework/src/test_vm/mod.rs
line = 913
path = phd_tests::migrate::from_base::can_migrate_from_base
target = phd_framework::test_vm
vm = migration_from_base_lifecycle_0
vm_id = 701d5ff2-f3b0-4266-9488-b72a5e3803fb
|
| 243 | 2026-10-12T21:21:07.633Z | INFO | phd-runner: [WAIT_FOR_SERIAL_OUTPUT - START]
file = phd-tests/framework/src/test_vm/mod.rs
line = 913
path = phd_tests::migrate::from_base::can_migrate_from_base
target = phd_framework::test_vm
vm = migration_from_base_lifecycle_0
vm_id = 701d5ff2-f3b0-4266-9488-b72a5e3803fb
|
| 244 | 2026-10-12T21:21:07.634Z | INFO | phd-runner: [WAIT_FOR_SERIAL_OUTPUT - EVENT] Waiting for output on serial console
file = phd-tests/framework/src/test_vm/mod.rs
line = 920
path = phd_tests::migrate::from_base::can_migrate_from_base
target = phd_framework::test_vm
timeout_duration = Explicit(15s)
vm = migration_from_base_lifecycle_0
vm_id = 701d5ff2-f3b0-4266-9488-b72a5e3803fb
|
| 245 | 2026-10-12T21:21:07.644Z | INFO | phd-runner: [WAIT_FOR_SERIAL_OUTPUT - END]
elapsed_milliseconds = 10
file = phd-tests/framework/src/test_vm/mod.rs
line = 913
path = phd_tests::migrate::from_base::can_migrate_from_base
target = phd_framework::test_vm
vm = migration_from_base_lifecycle_0
vm_id = 701d5ff2-f3b0-4266-9488-b72a5e3803fb
|
| 246 | 2026-10-12T21:21:07.644Z | INFO | phd-runner: [WAIT_FOR_SERIAL_OUTPUT - START]
file = phd-tests/framework/src/test_vm/mod.rs
line = 913
path = phd_tests::migrate::from_base::can_migrate_from_base
target = phd_framework::test_vm
vm = migration_from_base_lifecycle_0
vm_id = 701d5ff2-f3b0-4266-9488-b72a5e3803fb
|
| 247 | 2026-10-12T21:21:07.644Z | INFO | phd-runner: [WAIT_FOR_SERIAL_OUTPUT - EVENT] Waiting for output on serial console
file = phd-tests/framework/src/test_vm/mod.rs
line = 920
path = phd_tests::migrate::from_base::can_migrate_from_base
target = phd_framework::test_vm
timeout_duration = Explicit(300s)
vm = migration_from_base_lifecycle_0
vm_id = 701d5ff2-f3b0-4266-9488-b72a5e3803fb
|
| 248 | 2026-10-12T21:21:07.677Z | INFO | phd-runner: [WAIT_FOR_SERIAL_OUTPUT - END]
elapsed_milliseconds = 32
file = phd-tests/framework/src/test_vm/mod.rs
line = 913
path = phd_tests::migrate::from_base::can_migrate_from_base
target = phd_framework::test_vm
vm = migration_from_base_lifecycle_0
vm_id = 701d5ff2-f3b0-4266-9488-b72a5e3803fb
|
| 249 | 2026-10-12T21:21:07.677Z | INFO | phd-runner: [WAIT_FOR_SERIAL_OUTPUT - START]
file = phd-tests/framework/src/test_vm/mod.rs
line = 913
path = phd_tests::migrate::from_base::can_migrate_from_base
target = phd_framework::test_vm
vm = migration_from_base_lifecycle_0
vm_id = 701d5ff2-f3b0-4266-9488-b72a5e3803fb
|
| 250 | 2026-10-12T21:21:07.677Z | INFO | phd-runner: [WAIT_FOR_SERIAL_OUTPUT - EVENT] Waiting for output on serial console
file = phd-tests/framework/src/test_vm/mod.rs
line = 920
path = phd_tests::migrate::from_base::can_migrate_from_base
target = phd_framework::test_vm
timeout_duration = Explicit(15s)
vm = migration_from_base_lifecycle_0
vm_id = 701d5ff2-f3b0-4266-9488-b72a5e3803fb
|
| 251 | 2026-10-12T21:21:07.688Z | INFO | phd-runner: [WAIT_FOR_SERIAL_OUTPUT - END]
elapsed_milliseconds = 10
file = phd-tests/framework/src/test_vm/mod.rs
line = 913
path = phd_tests::migrate::from_base::can_migrate_from_base
target = phd_framework::test_vm
vm = migration_from_base_lifecycle_0
vm_id = 701d5ff2-f3b0-4266-9488-b72a5e3803fb
|
| 252 | 2026-10-12T21:21:07.688Z | INFO | phd-runner: [WAIT_FOR_SERIAL_OUTPUT - START]
file = phd-tests/framework/src/test_vm/mod.rs
line = 913
path = phd_tests::migrate::from_base::can_migrate_from_base
target = phd_framework::test_vm
vm = migration_from_base_lifecycle_0
vm_id = 701d5ff2-f3b0-4266-9488-b72a5e3803fb
|
| 253 | 2026-10-12T21:21:07.688Z | INFO | phd-runner: [WAIT_FOR_SERIAL_OUTPUT - EVENT] Waiting for output on serial console
file = phd-tests/framework/src/test_vm/mod.rs
line = 920
path = phd_tests::migrate::from_base::can_migrate_from_base
target = phd_framework::test_vm
timeout_duration = Explicit(300s)
vm = migration_from_base_lifecycle_0
vm_id = 701d5ff2-f3b0-4266-9488-b72a5e3803fb
|
| 254 | 2026-10-12T21:21:07.721Z | INFO | phd-runner: [WAIT_FOR_SERIAL_OUTPUT - END]
elapsed_milliseconds = 32
file = phd-tests/framework/src/test_vm/mod.rs
line = 913
path = phd_tests::migrate::from_base::can_migrate_from_base
target = phd_framework::test_vm
vm = migration_from_base_lifecycle_0
vm_id = 701d5ff2-f3b0-4266-9488-b72a5e3803fb
|
| 255 | 2026-10-12T21:21:07.721Z | INFO | phd-runner: [WAIT_FOR_SERIAL_OUTPUT - START]
file = phd-tests/framework/src/test_vm/mod.rs
line = 913
path = phd_tests::migrate::from_base::can_migrate_from_base
target = phd_framework::test_vm
vm = migration_from_base_lifecycle_0
vm_id = 701d5ff2-f3b0-4266-9488-b72a5e3803fb
|
| 256 | 2026-10-12T21:21:07.721Z | INFO | phd-runner: [WAIT_FOR_SERIAL_OUTPUT - EVENT] Waiting for output on serial console
file = phd-tests/framework/src/test_vm/mod.rs
line = 920
path = phd_tests::migrate::from_base::can_migrate_from_base
target = phd_framework::test_vm
timeout_duration = Explicit(15s)
vm = migration_from_base_lifecycle_0
vm_id = 701d5ff2-f3b0-4266-9488-b72a5e3803fb
|
| 257 | 2026-10-12T21:21:07.732Z | INFO | phd-runner: [WAIT_FOR_SERIAL_OUTPUT - END]
elapsed_milliseconds = 10
file = phd-tests/framework/src/test_vm/mod.rs
line = 913
path = phd_tests::migrate::from_base::can_migrate_from_base
target = phd_framework::test_vm
vm = migration_from_base_lifecycle_0
vm_id = 701d5ff2-f3b0-4266-9488-b72a5e3803fb
|
| 258 | 2026-10-12T21:21:07.732Z | INFO | phd-runner: [WAIT_FOR_SERIAL_OUTPUT - START]
file = phd-tests/framework/src/test_vm/mod.rs
line = 913
path = phd_tests::migrate::from_base::can_migrate_from_base
target = phd_framework::test_vm
vm = migration_from_base_lifecycle_0
vm_id = 701d5ff2-f3b0-4266-9488-b72a5e3803fb
|
| 259 | 2026-10-12T21:21:07.732Z | INFO | phd-runner: [WAIT_FOR_SERIAL_OUTPUT - EVENT] Waiting for output on serial console
file = phd-tests/framework/src/test_vm/mod.rs
line = 920
path = phd_tests::migrate::from_base::can_migrate_from_base
target = phd_framework::test_vm
timeout_duration = Explicit(300s)
vm = migration_from_base_lifecycle_0
vm_id = 701d5ff2-f3b0-4266-9488-b72a5e3803fb
|
| 260 | 2026-10-12T21:21:07.765Z | INFO | phd-runner: [WAIT_FOR_SERIAL_OUTPUT - END]
elapsed_milliseconds = 32
file = phd-tests/framework/src/test_vm/mod.rs
line = 913
path = phd_tests::migrate::from_base::can_migrate_from_base
target = phd_framework::test_vm
vm = migration_from_base_lifecycle_0
vm_id = 701d5ff2-f3b0-4266-9488-b72a5e3803fb
|
| 261 | 2026-10-12T21:21:07.765Z | INFO | phd-runner: [VM CLEANUP - START]
file = phd-tests/framework/src/test_vm/mod.rs
line = 1172
path = phd_tests::migrate::from_base::can_migrate_from_base
target = phd_framework::test_vm
vm = migration_from_base_lifecycle_0
vm_id = 701d5ff2-f3b0-4266-9488-b72a5e3803fb
|
| 262 | 2026-10-12T21:21:07.765Z | DEBG | phd-runner: [SERIAL CONSOLE TASK - EVENT] serial console command channel was closed
file = phd-tests/framework/src/serial/mod.rs
line = 213
target = phd_framework::serial
|
| 263 | 2026-10-12T21:21:07.765Z | INFO | phd-runner: test phd_tests::migrate::from_base::can_migrate_from_base ... ok
file = phd-tests/runner/src/execute.rs
line = 141
target = phd_runner::execute
|
| 264 | 2026-10-12T21:21:07.765Z | INFO | phd-runner: [SERIAL CONSOLE TASK - END]
elapsed_milliseconds = 8930
file = phd-tests/framework/src/serial/mod.rs
line = 200
target = phd_framework::serial
|
| 265 | 2026-10-12T21:21:07.766Z | INFO | phd-runner: [TEST_CLEANUP - START]
file = phd-tests/runner/src/fixtures.rs
line = 51
target = phd_runner::fixtures
|
| 266 | 2026-10-12T21:21:07.767Z | DEBG | phd-runner: [VM CLEANUP - EVENT] trying to ensure Propolis server VM is destroyed
file = phd-tests/framework/src/test_vm/mod.rs
line = 1195
path = phd_tests::migrate::from_base::can_migrate_from_base
target = phd_framework::test_vm
vm = migration_from_base_lifecycle_0
vm_id = 701d5ff2-f3b0-4266-9488-b72a5e3803fb
|
| 267 | 2026-10-12T21:21:08.081Z | DEBG | phd-runner: [VM CLEANUP - EVENT] Killing Propolis server process
file = phd-tests/framework/src/test_vm/server.rs
line = 177
path = phd_tests::migrate::from_base::can_migrate_from_base
self.address = 127.0.0.1:9002
target = phd_framework::test_vm::server
vm = migration_from_base_lifecycle_0
vm_id = 701d5ff2-f3b0-4266-9488-b72a5e3803fb
|
| 268 | 2026-10-12T21:21:08.169Z | DEBG | phd-runner: [VM CLEANUP - EVENT] zfs clone dropped
file = phd-tests/framework/src/zfs.rs
line = 83
path = phd_tests::migrate::from_base::can_migrate_from_base
target = phd_framework::zfs
vm = migration_from_base_lifecycle_0
vm_id = 701d5ff2-f3b0-4266-9488-b72a5e3803fb
|
| 269 | 2026-10-12T21:21:08.169Z | DEBG | phd-runner: [VM CLEANUP - EVENT] executing ZFS command
args = ["phd-artifacts/phd-clone-26644f85-804d-4308-9e9a-2d0ee9388cee"]
file = phd-tests/framework/src/zfs.rs
line = 304
path = phd_tests::migrate::from_base::can_migrate_from_base
target = phd_framework::zfs
verb = destroy
vm = migration_from_base_lifecycle_0
vm_id = 701d5ff2-f3b0-4266-9488-b72a5e3803fb
|
| 270 | 2026-10-12T21:21:08.195Z | DEBG | phd-runner: [VM CLEANUP - EVENT] zfs snapshot dropped
file = phd-tests/framework/src/zfs.rs
line = 57
path = phd_tests::migrate::from_base::can_migrate_from_base
target = phd_framework::zfs
vm = migration_from_base_lifecycle_0
vm_id = 701d5ff2-f3b0-4266-9488-b72a5e3803fb
|
| 271 | 2026-10-12T21:21:08.195Z | DEBG | phd-runner: [VM CLEANUP - EVENT] executing ZFS command
args = ["phd-artifacts@phd-af9dde2a-9dfa-44c6-be28-9d0eb7858da2"]
file = phd-tests/framework/src/zfs.rs
line = 304
path = phd_tests::migrate::from_base::can_migrate_from_base
target = phd_framework::zfs
verb = destroy
vm = migration_from_base_lifecycle_0
vm_id = 701d5ff2-f3b0-4266-9488-b72a5e3803fb
|
| 272 | 2026-10-12T21:21:08.213Z | INFO | phd-runner: [VM CLEANUP - END]
elapsed_milliseconds = 448
file = phd-tests/framework/src/test_vm/mod.rs
line = 1172
path = phd_tests::migrate::from_base::can_migrate_from_base
target = phd_framework::test_vm
vm = migration_from_base_lifecycle_0
vm_id = 701d5ff2-f3b0-4266-9488-b72a5e3803fb
|
| 273 | 2026-10-12T21:21:08.214Z | INFO | phd-runner: [INSTANCE_ENSURE_INTERNAL - END]
elapsed_milliseconds = 4515
file = phd-tests/framework/src/test_vm/mod.rs
line = 412
path = phd_tests::migrate::from_base::can_migrate_from_base
source = migration_from_base
source_id = cad3f3bb-f795-40bd-a4bc-52102cbd6314
target = phd_framework::test_vm
target_id = 701d5ff2-f3b0-4266-9488-b72a5e3803fb
vm = migration_from_base_lifecycle_0
vm_id = 701d5ff2-f3b0-4266-9488-b72a5e3803fb
|
| 274 | 2026-10-12T21:21:08.214Z | INFO | phd-runner: [MIGRATE_FROM - END]
elapsed_milliseconds = 4515
file = phd-tests/framework/src/test_vm/mod.rs
line = 609
path = phd_tests::migrate::from_base::can_migrate_from_base
source = migration_from_base
source_id = cad3f3bb-f795-40bd-a4bc-52102cbd6314
target = phd_framework::test_vm
target_id = 701d5ff2-f3b0-4266-9488-b72a5e3803fb
|
| 275 | 2026-10-12T21:21:08.214Z | INFO | phd-runner: [TEST - END]
elapsed_milliseconds = 10186
file = phd-tests/tests/src/migrate.rs
line = 34
path = phd_tests::migrate::from_base::can_migrate_from_base
target = phd_tests::migrate::from_base
|
| 276 | 2026-10-12T21:21:08.214Z | INFO | phd-runner: [TEST_CLEANUP - END]
elapsed_milliseconds = 448
file = phd-tests/runner/src/fixtures.rs
line = 51
target = phd_runner::fixtures
|
| 277 | 2026-10-12T21:21:08.214Z | INFO | phd-runner: Starting test phd_tests::migrate::from_base::migration_from_base_and_back
file = phd-tests/runner/src/execute.rs
line = 91
target = phd_runner::execute
|
| 278 | 2026-10-12T21:21:08.214Z | INFO | phd-runner: [TEST_SETUP - START]
file = phd-tests/runner/src/fixtures.rs
line = 41
target = phd_runner::fixtures
|
| 279 | 2026-10-12T21:21:08.214Z | INFO | phd-runner: [TEST_SETUP - END]
elapsed_milliseconds = 0
file = phd-tests/runner/src/fixtures.rs
line = 41
target = phd_runner::fixtures
|
| 280 | 2026-10-12T21:21:08.214Z | INFO | phd-runner: [TEST - START]
file = phd-tests/tests/src/migrate.rs
line = 52
path = phd_tests::migrate::from_base::migration_from_base_and_back
target = phd_tests::migrate::from_base
|
| 281 | 2026-10-12T21:21:08.214Z | DEBG | phd-runner: [TEST - EVENT] Verified artifact already exists
file = phd-tests/framework/src/artifacts/store.rs
line = 45
path = /phd-artifacts/740187046a7267d0de72d3455070333547dbc0ea023531471fb2b2a61effa448/OVMF_CODE.fd
target = phd_framework::artifacts::store
|
| 282 | 2026-10-12T21:21:08.215Z | DEBG | phd-runner: [TEST - EVENT] Verified artifact already exists
file = phd-tests/framework/src/artifacts/store.rs
line = 45
path = /phd-artifacts/ba8007f74f9b54fbae3b2520da577831b4834778a498d732f091260c61aa7ca1/alpine.iso
target = phd_framework::artifacts::store
|
| 283 | 2026-10-12T21:21:08.215Z | DEBG | phd-runner: [TEST - EVENT] Verified artifact already exists
file = phd-tests/framework/src/artifacts/store.rs
line = 45
path = /phd-artifacts/ba8007f74f9b54fbae3b2520da577831b4834778a498d732f091260c61aa7ca1/alpine.iso
target = phd_framework::artifacts::store
|
| 284 | 2026-10-12T21:21:08.215Z | DEBG | phd-runner: [TEST - EVENT] executing ZFS command
args = ["/phd-artifacts/ba8007f74f9b54fbae3b2520da577831b4834778a498d732f091260c61aa7ca1/alpine.iso"]
file = phd-tests/framework/src/zfs.rs
line = 304
path = phd_tests::migrate::from_base::migration_from_base_and_back
target = phd_framework::zfs
verb = list
|
| 285 | 2026-10-12T21:21:08.227Z | DEBG | phd-runner: [TEST - EVENT] parsing zfs list output
file = phd-tests/framework/src/zfs.rs
line = 238
path = phd_tests::migrate::from_base::migration_from_base_and_back
stdout = NAME USED AVAIL REFER MOUNTPOINT\nphd-artifacts 1.30G 25.3T 1.30G /phd-artifacts\n
target = phd_framework::zfs
|
| 286 | 2026-10-12T21:21:08.227Z | DEBG | phd-runner: [TEST - EVENT] executing ZFS command
args = ["phd-artifacts@phd-b2bfc393-761b-4c59-a146-1839afd3d58c"]
file = phd-tests/framework/src/zfs.rs
line = 304
path = phd_tests::migrate::from_base::migration_from_base_and_back
target = phd_framework::zfs
verb = snapshot
|
| 287 | 2026-10-12T21:21:08.246Z | DEBG | phd-runner: [TEST - EVENT] executing ZFS command
args = ["phd-artifacts@phd-b2bfc393-761b-4c59-a146-1839afd3d58c", "phd-artifacts/phd-clone-fb775efb-c482-4d74-897c-a3a250ea9a7a"]
file = phd-tests/framework/src/zfs.rs
line = 304
path = phd_tests::migrate::from_base::migration_from_base_and_back
target = phd_framework::zfs
verb = clone
|
| 288 | 2026-10-12T21:21:08.264Z | DEBG | phd-runner: [TEST - EVENT] executing ZFS command
args = ["phd-artifacts/phd-clone-fb775efb-c482-4d74-897c-a3a250ea9a7a"]
file = phd-tests/framework/src/zfs.rs
line = 304
path = phd_tests::migrate::from_base::migration_from_base_and_back
target = phd_framework::zfs
verb = list
|
| 289 | 2026-10-12T21:21:08.276Z | DEBG | phd-runner: [TEST - EVENT] parsing zfs list output
file = phd-tests/framework/src/zfs.rs
line = 238
path = phd_tests::migrate::from_base::migration_from_base_and_back
stdout = NAME USED AVAIL REFER MOUNTPOINT\nphd-artifacts/phd-clone-fb775efb-c482-4d74-897c-a3a250ea9a7a 0B 25.3T 1.30G /phd-artifacts/phd-clone-fb775efb-c482-4d74-897c-a3a250ea9a7a\n
target = phd_framework::zfs
|
| 290 | 2026-10-12T21:21:08.277Z | INFO | phd-runner: [NEW - START]
file = phd-tests/framework/src/test_vm/mod.rs
line = 300
path = phd_tests::migrate::from_base::migration_from_base_and_back
target = phd_framework::test_vm
|
| 291 | 2026-10-12T21:21:08.277Z | INFO | phd-runner: [NEW - EVENT] phd_framework::test_vm
environment = EnvironmentSpec { location: Local, propolis_artifact: "__BASE_PROPOLIS", metrics: None }
file = phd-tests/framework/src/test_vm/mod.rs
guest_os_kind = Alpine
line = 318
path = phd_tests::migrate::from_base::migration_from_base_and_back
target = phd_framework::test_vm
vm_name = migration_from_base_and_back
|
| 292 | 2026-10-12T21:21:08.277Z | DEBG | phd-runner: [NEW - EVENT] Verified artifact already exists
file = phd-tests/framework/src/artifacts/store.rs
line = 45
path = /phd-artifacts/c0d9344f91d563c7ab06bccfd2aae4b75c245ada57f0262eac2fd4a28094086e/propolis-server
target = phd_framework::artifacts::store
|
| 293 | 2026-10-12T21:21:08.277Z | INFO | phd-runner: [NEW - EVENT] Launching Propolis server
bootrom_path = "/phd-artifacts/740187046a7267d0de72d3455070333547dbc0ea023531471fb2b2a61effa448/OVMF_CODE.fd"
file = phd-tests/framework/src/test_vm/server.rs
line = 66
path = phd_tests::migrate::from_base::migration_from_base_and_back
server_addr = 127.0.0.1:9000
server_path = "/phd-artifacts/c0d9344f91d563c7ab06bccfd2aae4b75c245ada57f0262eac2fd4a28094086e/propolis-server"
target = phd_framework::test_vm::server
|
| 294 | 2026-10-12T21:21:08.277Z | INFO | phd-runner: [NEW - EVENT] Opening server log files
file = phd-tests/framework/src/log_config.rs
line = 84
path = phd_tests::migrate::from_base::migration_from_base_and_back
stderr_path = "/tmp/propolis-phd/phd_tests::migrate::from_base::migration_from_base_and_back/migration_from_base_and_back.stderr.log"
stdout_path = "/tmp/propolis-phd/phd_tests::migrate::from_base::migration_from_base_and_back/migration_from_base_and_back.stdout.log"
target = phd_framework::log_config
|
| 295 | 2026-10-12T21:21:08.329Z | INFO | phd-runner: [NEW - EVENT] Launched server with pid 937
file = phd-tests/framework/src/test_vm/server.rs
line = 127
path = phd_tests::migrate::from_base::migration_from_base_and_back
target = phd_framework::test_vm::server
|
| 296 | 2026-10-12T21:21:08.344Z | INFO | phd-runner: [NEW - END]
elapsed_milliseconds = 66
file = phd-tests/framework/src/test_vm/mod.rs
line = 300
path = phd_tests::migrate::from_base::migration_from_base_and_back
target = phd_framework::test_vm
|
| 297 | 2026-10-12T21:21:08.344Z | INFO | phd-runner: [INSTANCE_ENSURE_INTERNAL - START]
file = phd-tests/framework/src/test_vm/mod.rs
line = 412
path = phd_tests::migrate::from_base::migration_from_base_and_back
target = phd_framework::test_vm
vm = migration_from_base_and_back
vm_id = b235aa81-80f7-4f5b-beb6-55ea58baf5b8
|
| 298 | 2026-10-12T21:21:08.344Z | INFO | phd-runner: [INSTANCE_ENSURE_INTERNAL - EVENT] retriable error from instance_spec_ensure
e = Communication Error: error sending request for url (http://127.0.0.1:9000/instance)
file = phd-tests/framework/src/test_vm/mod.rs
line = 455
path = phd_tests::migrate::from_base::migration_from_base_and_back
target = phd_framework::test_vm
vm = migration_from_base_and_back
vm_id = b235aa81-80f7-4f5b-beb6-55ea58baf5b8
|
| 299 | 2026-10-12T21:21:08.937Z | INFO | phd-runner: [SERIAL CONSOLE TASK - START]
file = phd-tests/framework/src/serial/mod.rs
line = 200
target = phd_framework::serial
|
| 300 | 2026-10-12T21:21:08.938Z | INFO | phd-runner: [INSTANCE_ENSURE_INTERNAL - EVENT] Started instance
file = phd-tests/framework/src/test_vm/mod.rs
instance_description.instance = Instance { properties: InstanceProperties { id: b235aa81-80f7-4f5b-beb6-55ea58baf5b8, name: "phd-vm-b235aa81-80f7-4f5b-beb6-55ea58baf5b8", description: "Pheidippides-managed VM", metadata: InstanceMetadata { silo_id: d0a0deb1-cd1f-4f1d-bfeb-a4bdb0d31b7f, project_id: 7692d34c-54b9-4fe5-aa51-b6d2f9557fb7, sled_id: 099f500f-baaa-4b43-9f7c-e2a9db11d600, sled_serial: "099f500f-baaa-4b43-9f7c-e2a9db11d600", sled_revision: 1, sled_model: "pheidippes" } }, state: Creating }
line = 514
path = phd_tests::migrate::from_base::migration_from_base_and_back
target = phd_framework::test_vm
vm = migration_from_base_and_back
vm_id = b235aa81-80f7-4f5b-beb6-55ea58baf5b8
|
| 301 | 2026-10-12T21:21:08.938Z | INFO | phd-runner: [PUT_INSTANCE_STATE - START]
file = phd-tests/framework/src/test_vm/mod.rs
line = 575
path = phd_tests::migrate::from_base::migration_from_base_and_back
target = phd_framework::test_vm
vm = migration_from_base_and_back
vm_id = b235aa81-80f7-4f5b-beb6-55ea58baf5b8
|
| 302 | 2026-10-12T21:21:08.938Z | INFO | phd-runner: [PUT_INSTANCE_STATE - EVENT] Requesting instance state change
file = phd-tests/framework/src/test_vm/mod.rs
line = 580
path = phd_tests::migrate::from_base::migration_from_base_and_back
state = Run
target = phd_framework::test_vm
vm = migration_from_base_and_back
vm_id = b235aa81-80f7-4f5b-beb6-55ea58baf5b8
|
| 303 | 2026-10-12T21:21:08.939Z | INFO | phd-runner: [PUT_INSTANCE_STATE - END]
elapsed_milliseconds = 1
file = phd-tests/framework/src/test_vm/mod.rs
line = 575
path = phd_tests::migrate::from_base::migration_from_base_and_back
target = phd_framework::test_vm
vm = migration_from_base_and_back
vm_id = b235aa81-80f7-4f5b-beb6-55ea58baf5b8
|
| 304 | 2026-10-12T21:21:08.939Z | INFO | phd-runner: [WAIT_TO_BOOT - START]
file = phd-tests/framework/src/test_vm/mod.rs
line = 890
path = phd_tests::migrate::from_base::migration_from_base_and_back
target = phd_framework::test_vm
|
| 305 | 2026-10-12T21:21:08.939Z | INFO | phd-runner: [WAIT_TO_BOOT - EVENT] waiting for guest to boot
file = phd-tests/framework/src/test_vm/mod.rs
line = 839
path = phd_tests::migrate::from_base::migration_from_base_and_back
target = phd_framework::test_vm
timeout_duration = 300s
vm = migration_from_base_and_back
vm_id = b235aa81-80f7-4f5b-beb6-55ea58baf5b8
|
| 306 | 2026-10-12T21:21:08.939Z | DEBG | phd-runner: [WAIT_TO_BOOT - EVENT] executing command in boot sequence
file = phd-tests/framework/src/test_vm/mod.rs
line = 847
path = phd_tests::migrate::from_base::migration_from_base_and_back
step = WaitFor("localhost login: ")
target = phd_framework::test_vm
|
| 307 | 2026-10-12T21:21:08.939Z | INFO | phd-runner: [WAIT_FOR_SERIAL_OUTPUT - START]
file = phd-tests/framework/src/test_vm/mod.rs
line = 913
path = phd_tests::migrate::from_base::migration_from_base_and_back
target = phd_framework::test_vm
vm = migration_from_base_and_back
vm_id = b235aa81-80f7-4f5b-beb6-55ea58baf5b8
|
| 308 | 2026-10-12T21:21:08.939Z | INFO | phd-runner: [WAIT_FOR_SERIAL_OUTPUT - EVENT] Waiting for output on serial console
file = phd-tests/framework/src/test_vm/mod.rs
line = 920
path = phd_tests::migrate::from_base::migration_from_base_and_back
target = phd_framework::test_vm
timeout_duration = CallerTimeout
vm = migration_from_base_and_back
vm_id = b235aa81-80f7-4f5b-beb6-55ea58baf5b8
|
| 309 | 2026-10-12T21:21:13.506Z | INFO | phd-runner: [WAIT_FOR_SERIAL_OUTPUT - END]
elapsed_milliseconds = 4567
file = phd-tests/framework/src/test_vm/mod.rs
line = 913
path = phd_tests::migrate::from_base::migration_from_base_and_back
target = phd_framework::test_vm
vm = migration_from_base_and_back
vm_id = b235aa81-80f7-4f5b-beb6-55ea58baf5b8
|
| 310 | 2026-10-12T21:21:13.507Z | DEBG | phd-runner: [WAIT_TO_BOOT - EVENT] executing command in boot sequence
file = phd-tests/framework/src/test_vm/mod.rs
line = 847
path = phd_tests::migrate::from_base::migration_from_base_and_back
step = WriteStr("root")
target = phd_framework::test_vm
|
| 311 | 2026-10-12T21:21:13.507Z | DEBG | phd-runner: [WAIT_TO_BOOT - EVENT] executing command in boot sequence
file = phd-tests/framework/src/test_vm/mod.rs
line = 847
path = phd_tests::migrate::from_base::migration_from_base_and_back
step = WaitFor("localhost:~#")
target = phd_framework::test_vm
|
| 312 | 2026-10-12T21:21:13.507Z | INFO | phd-runner: [WAIT_FOR_SERIAL_OUTPUT - START]
file = phd-tests/framework/src/test_vm/mod.rs
line = 913
path = phd_tests::migrate::from_base::migration_from_base_and_back
target = phd_framework::test_vm
vm = migration_from_base_and_back
vm_id = b235aa81-80f7-4f5b-beb6-55ea58baf5b8
|
| 313 | 2026-10-12T21:21:13.507Z | INFO | phd-runner: [WAIT_FOR_SERIAL_OUTPUT - EVENT] Waiting for output on serial console
file = phd-tests/framework/src/test_vm/mod.rs
line = 920
path = phd_tests::migrate::from_base::migration_from_base_and_back
target = phd_framework::test_vm
timeout_duration = CallerTimeout
vm = migration_from_base_and_back
vm_id = b235aa81-80f7-4f5b-beb6-55ea58baf5b8
|
| 314 | 2026-10-12T21:21:13.526Z | INFO | phd-runner: [WAIT_FOR_SERIAL_OUTPUT - END]
elapsed_milliseconds = 18
file = phd-tests/framework/src/test_vm/mod.rs
line = 913
path = phd_tests::migrate::from_base::migration_from_base_and_back
target = phd_framework::test_vm
vm = migration_from_base_and_back
vm_id = b235aa81-80f7-4f5b-beb6-55ea58baf5b8
|
| 315 | 2026-10-12T21:21:13.526Z | DEBG | phd-runner: [WAIT_TO_BOOT - EVENT] executing command in boot sequence
file = phd-tests/framework/src/test_vm/mod.rs
line = 847
path = phd_tests::migrate::from_base::migration_from_base_and_back
step = WriteStr("stty -F `tty` cols 9999")
target = phd_framework::test_vm
|
| 316 | 2026-10-12T21:21:13.526Z | DEBG | phd-runner: [WAIT_TO_BOOT - EVENT] executing command in boot sequence
file = phd-tests/framework/src/test_vm/mod.rs
line = 847
path = phd_tests::migrate::from_base::migration_from_base_and_back
step = WaitFor("localhost:~#")
target = phd_framework::test_vm
|
| 317 | 2026-10-12T21:21:13.526Z | INFO | phd-runner: [WAIT_FOR_SERIAL_OUTPUT - START]
file = phd-tests/framework/src/test_vm/mod.rs
line = 913
path = phd_tests::migrate::from_base::migration_from_base_and_back
target = phd_framework::test_vm
vm = migration_from_base_and_back
vm_id = b235aa81-80f7-4f5b-beb6-55ea58baf5b8
|
| 318 | 2026-10-12T21:21:13.526Z | INFO | phd-runner: [WAIT_FOR_SERIAL_OUTPUT - EVENT] Waiting for output on serial console
file = phd-tests/framework/src/test_vm/mod.rs
line = 920
path = phd_tests::migrate::from_base::migration_from_base_and_back
target = phd_framework::test_vm
timeout_duration = CallerTimeout
vm = migration_from_base_and_back
vm_id = b235aa81-80f7-4f5b-beb6-55ea58baf5b8
|
| 319 | 2026-10-12T21:21:13.559Z | INFO | phd-runner: [WAIT_FOR_SERIAL_OUTPUT - END]
elapsed_milliseconds = 32
file = phd-tests/framework/src/test_vm/mod.rs
line = 913
path = phd_tests::migrate::from_base::migration_from_base_and_back
target = phd_framework::test_vm
vm = migration_from_base_and_back
vm_id = b235aa81-80f7-4f5b-beb6-55ea58baf5b8
|
| 320 | 2026-10-12T21:21:13.559Z | INFO | phd-runner: [WAIT_TO_BOOT - EVENT] Guest has booted
file = phd-tests/framework/src/test_vm/mod.rs
line = 887
path = phd_tests::migrate::from_base::migration_from_base_and_back
target = phd_framework::test_vm
|
| 321 | 2026-10-12T21:21:13.559Z | INFO | phd-runner: [WAIT_TO_BOOT - END]
elapsed_milliseconds = 4619
file = phd-tests/framework/src/test_vm/mod.rs
line = 890
path = phd_tests::migrate::from_base::migration_from_base_and_back
target = phd_framework::test_vm
|
| 322 | 2026-10-12T21:21:13.559Z | INFO | phd-runner: [WAIT_FOR_SERIAL_OUTPUT - START]
file = phd-tests/framework/src/test_vm/mod.rs
line = 913
path = phd_tests::migrate::from_base::migration_from_base_and_back
target = phd_framework::test_vm
vm = migration_from_base_and_back
vm_id = b235aa81-80f7-4f5b-beb6-55ea58baf5b8
|
| 323 | 2026-10-12T21:21:13.559Z | INFO | phd-runner: [WAIT_FOR_SERIAL_OUTPUT - EVENT] Waiting for output on serial console
file = phd-tests/framework/src/test_vm/mod.rs
line = 920
path = phd_tests::migrate::from_base::migration_from_base_and_back
target = phd_framework::test_vm
timeout_duration = Explicit(15s)
vm = migration_from_base_and_back
vm_id = b235aa81-80f7-4f5b-beb6-55ea58baf5b8
|
| 324 | 2026-10-12T21:21:13.570Z | INFO | phd-runner: [WAIT_FOR_SERIAL_OUTPUT - END]
elapsed_milliseconds = 10
file = phd-tests/framework/src/test_vm/mod.rs
line = 913
path = phd_tests::migrate::from_base::migration_from_base_and_back
target = phd_framework::test_vm
vm = migration_from_base_and_back
vm_id = b235aa81-80f7-4f5b-beb6-55ea58baf5b8
|
| 325 | 2026-10-12T21:21:13.570Z | INFO | phd-runner: [WAIT_FOR_SERIAL_OUTPUT - START]
file = phd-tests/framework/src/test_vm/mod.rs
line = 913
path = phd_tests::migrate::from_base::migration_from_base_and_back
target = phd_framework::test_vm
vm = migration_from_base_and_back
vm_id = b235aa81-80f7-4f5b-beb6-55ea58baf5b8
|
| 326 | 2026-10-12T21:21:13.570Z | INFO | phd-runner: [WAIT_FOR_SERIAL_OUTPUT - EVENT] Waiting for output on serial console
file = phd-tests/framework/src/test_vm/mod.rs
line = 920
path = phd_tests::migrate::from_base::migration_from_base_and_back
target = phd_framework::test_vm
timeout_duration = Explicit(300s)
vm = migration_from_base_and_back
vm_id = b235aa81-80f7-4f5b-beb6-55ea58baf5b8
|
| 327 | 2026-10-12T21:21:13.603Z | INFO | phd-runner: [WAIT_FOR_SERIAL_OUTPUT - END]
elapsed_milliseconds = 33
file = phd-tests/framework/src/test_vm/mod.rs
line = 913
path = phd_tests::migrate::from_base::migration_from_base_and_back
target = phd_framework::test_vm
vm = migration_from_base_and_back
vm_id = b235aa81-80f7-4f5b-beb6-55ea58baf5b8
|
| 328 | 2026-10-12T21:21:13.603Z | INFO | phd-runner: [WAIT_FOR_SERIAL_OUTPUT - START]
file = phd-tests/framework/src/test_vm/mod.rs
line = 913
path = phd_tests::migrate::from_base::migration_from_base_and_back
target = phd_framework::test_vm
vm = migration_from_base_and_back
vm_id = b235aa81-80f7-4f5b-beb6-55ea58baf5b8
|
| 329 | 2026-10-12T21:21:13.603Z | INFO | phd-runner: [WAIT_FOR_SERIAL_OUTPUT - EVENT] Waiting for output on serial console
file = phd-tests/framework/src/test_vm/mod.rs
line = 920
path = phd_tests::migrate::from_base::migration_from_base_and_back
target = phd_framework::test_vm
timeout_duration = Explicit(15s)
vm = migration_from_base_and_back
vm_id = b235aa81-80f7-4f5b-beb6-55ea58baf5b8
|
| 330 | 2026-10-12T21:21:13.613Z | INFO | phd-runner: [WAIT_FOR_SERIAL_OUTPUT - END]
elapsed_milliseconds = 10
file = phd-tests/framework/src/test_vm/mod.rs
line = 913
path = phd_tests::migrate::from_base::migration_from_base_and_back
target = phd_framework::test_vm
vm = migration_from_base_and_back
vm_id = b235aa81-80f7-4f5b-beb6-55ea58baf5b8
|
| 331 | 2026-10-12T21:21:13.614Z | INFO | phd-runner: [WAIT_FOR_SERIAL_OUTPUT - START]
file = phd-tests/framework/src/test_vm/mod.rs
line = 913
path = phd_tests::migrate::from_base::migration_from_base_and_back
target = phd_framework::test_vm
vm = migration_from_base_and_back
vm_id = b235aa81-80f7-4f5b-beb6-55ea58baf5b8
|
| 332 | 2026-10-12T21:21:13.614Z | INFO | phd-runner: [WAIT_FOR_SERIAL_OUTPUT - EVENT] Waiting for output on serial console
file = phd-tests/framework/src/test_vm/mod.rs
line = 920
path = phd_tests::migrate::from_base::migration_from_base_and_back
target = phd_framework::test_vm
timeout_duration = Explicit(300s)
vm = migration_from_base_and_back
vm_id = b235aa81-80f7-4f5b-beb6-55ea58baf5b8
|
| 333 | 2026-10-12T21:21:13.647Z | INFO | phd-runner: [WAIT_FOR_SERIAL_OUTPUT - END]
elapsed_milliseconds = 32
file = phd-tests/framework/src/test_vm/mod.rs
line = 913
path = phd_tests::migrate::from_base::migration_from_base_and_back
target = phd_framework::test_vm
vm = migration_from_base_and_back
vm_id = b235aa81-80f7-4f5b-beb6-55ea58baf5b8
|
| 334 | 2026-10-12T21:21:13.647Z | INFO | phd-runner: [WAIT_FOR_SERIAL_OUTPUT - START]
file = phd-tests/framework/src/test_vm/mod.rs
line = 913
path = phd_tests::migrate::from_base::migration_from_base_and_back
target = phd_framework::test_vm
vm = migration_from_base_and_back
vm_id = b235aa81-80f7-4f5b-beb6-55ea58baf5b8
|
| 335 | 2026-10-12T21:21:13.647Z | INFO | phd-runner: [WAIT_FOR_SERIAL_OUTPUT - EVENT] Waiting for output on serial console
file = phd-tests/framework/src/test_vm/mod.rs
line = 920
path = phd_tests::migrate::from_base::migration_from_base_and_back
target = phd_framework::test_vm
timeout_duration = Explicit(15s)
vm = migration_from_base_and_back
vm_id = b235aa81-80f7-4f5b-beb6-55ea58baf5b8
|
| 336 | 2026-10-12T21:21:13.658Z | INFO | phd-runner: [WAIT_FOR_SERIAL_OUTPUT - END]
elapsed_milliseconds = 10
file = phd-tests/framework/src/test_vm/mod.rs
line = 913
path = phd_tests::migrate::from_base::migration_from_base_and_back
target = phd_framework::test_vm
vm = migration_from_base_and_back
vm_id = b235aa81-80f7-4f5b-beb6-55ea58baf5b8
|
| 337 | 2026-10-12T21:21:13.658Z | INFO | phd-runner: [WAIT_FOR_SERIAL_OUTPUT - START]
file = phd-tests/framework/src/test_vm/mod.rs
line = 913
path = phd_tests::migrate::from_base::migration_from_base_and_back
target = phd_framework::test_vm
vm = migration_from_base_and_back
vm_id = b235aa81-80f7-4f5b-beb6-55ea58baf5b8
|
| 338 | 2026-10-12T21:21:13.658Z | INFO | phd-runner: [WAIT_FOR_SERIAL_OUTPUT - EVENT] Waiting for output on serial console
file = phd-tests/framework/src/test_vm/mod.rs
line = 920
path = phd_tests::migrate::from_base::migration_from_base_and_back
target = phd_framework::test_vm
timeout_duration = Explicit(300s)
vm = migration_from_base_and_back
vm_id = b235aa81-80f7-4f5b-beb6-55ea58baf5b8
|
| 339 | 2026-10-12T21:21:13.691Z | INFO | phd-runner: [WAIT_FOR_SERIAL_OUTPUT - END]
elapsed_milliseconds = 32
file = phd-tests/framework/src/test_vm/mod.rs
line = 913
path = phd_tests::migrate::from_base::migration_from_base_and_back
target = phd_framework::test_vm
vm = migration_from_base_and_back
vm_id = b235aa81-80f7-4f5b-beb6-55ea58baf5b8
|
| 340 | 2026-10-12T21:21:13.691Z | INFO | phd-runner: [WAIT_FOR_SERIAL_OUTPUT - START]
file = phd-tests/framework/src/test_vm/mod.rs
line = 913
path = phd_tests::migrate::from_base::migration_from_base_and_back
target = phd_framework::test_vm
vm = migration_from_base_and_back
vm_id = b235aa81-80f7-4f5b-beb6-55ea58baf5b8
|
| 341 | 2026-10-12T21:21:13.691Z | INFO | phd-runner: [WAIT_FOR_SERIAL_OUTPUT - EVENT] Waiting for output on serial console
file = phd-tests/framework/src/test_vm/mod.rs
line = 920
path = phd_tests::migrate::from_base::migration_from_base_and_back
target = phd_framework::test_vm
timeout_duration = Explicit(15s)
vm = migration_from_base_and_back
vm_id = b235aa81-80f7-4f5b-beb6-55ea58baf5b8
|
| 342 | 2026-10-12T21:21:13.702Z | INFO | phd-runner: [WAIT_FOR_SERIAL_OUTPUT - END]
elapsed_milliseconds = 10
file = phd-tests/framework/src/test_vm/mod.rs
line = 913
path = phd_tests::migrate::from_base::migration_from_base_and_back
target = phd_framework::test_vm
vm = migration_from_base_and_back
vm_id = b235aa81-80f7-4f5b-beb6-55ea58baf5b8
|
| 343 | 2026-10-12T21:21:13.702Z | INFO | phd-runner: [WAIT_FOR_SERIAL_OUTPUT - START]
file = phd-tests/framework/src/test_vm/mod.rs
line = 913
path = phd_tests::migrate::from_base::migration_from_base_and_back
target = phd_framework::test_vm
vm = migration_from_base_and_back
vm_id = b235aa81-80f7-4f5b-beb6-55ea58baf5b8
|
| 344 | 2026-10-12T21:21:13.702Z | INFO | phd-runner: [WAIT_FOR_SERIAL_OUTPUT - EVENT] Waiting for output on serial console
file = phd-tests/framework/src/test_vm/mod.rs
line = 920
path = phd_tests::migrate::from_base::migration_from_base_and_back
target = phd_framework::test_vm
timeout_duration = Explicit(300s)
vm = migration_from_base_and_back
vm_id = b235aa81-80f7-4f5b-beb6-55ea58baf5b8
|
| 345 | 2026-10-12T21:21:13.736Z | INFO | phd-runner: [WAIT_FOR_SERIAL_OUTPUT - END]
elapsed_milliseconds = 33
file = phd-tests/framework/src/test_vm/mod.rs
line = 913
path = phd_tests::migrate::from_base::migration_from_base_and_back
target = phd_framework::test_vm
vm = migration_from_base_and_back
vm_id = b235aa81-80f7-4f5b-beb6-55ea58baf5b8
|
| 346 | 2026-10-12T21:21:13.736Z | INFO | phd-runner: [WAIT_FOR_SERIAL_OUTPUT - START]
file = phd-tests/framework/src/test_vm/mod.rs
line = 913
path = phd_tests::migrate::from_base::migration_from_base_and_back
target = phd_framework::test_vm
vm = migration_from_base_and_back
vm_id = b235aa81-80f7-4f5b-beb6-55ea58baf5b8
|
| 347 | 2026-10-12T21:21:13.736Z | INFO | phd-runner: [WAIT_FOR_SERIAL_OUTPUT - EVENT] Waiting for output on serial console
file = phd-tests/framework/src/test_vm/mod.rs
line = 920
path = phd_tests::migrate::from_base::migration_from_base_and_back
target = phd_framework::test_vm
timeout_duration = Explicit(15s)
vm = migration_from_base_and_back
vm_id = b235aa81-80f7-4f5b-beb6-55ea58baf5b8
|
| 348 | 2026-10-12T21:21:13.746Z | INFO | phd-runner: [WAIT_FOR_SERIAL_OUTPUT - END]
elapsed_milliseconds = 10
file = phd-tests/framework/src/test_vm/mod.rs
line = 913
path = phd_tests::migrate::from_base::migration_from_base_and_back
target = phd_framework::test_vm
vm = migration_from_base_and_back
vm_id = b235aa81-80f7-4f5b-beb6-55ea58baf5b8
|
| 349 | 2026-10-12T21:21:13.747Z | INFO | phd-runner: [WAIT_FOR_SERIAL_OUTPUT - START]
file = phd-tests/framework/src/test_vm/mod.rs
line = 913
path = phd_tests::migrate::from_base::migration_from_base_and_back
target = phd_framework::test_vm
vm = migration_from_base_and_back
vm_id = b235aa81-80f7-4f5b-beb6-55ea58baf5b8
|
| 350 | 2026-10-12T21:21:13.747Z | INFO | phd-runner: [WAIT_FOR_SERIAL_OUTPUT - EVENT] Waiting for output on serial console
file = phd-tests/framework/src/test_vm/mod.rs
line = 920
path = phd_tests::migrate::from_base::migration_from_base_and_back
target = phd_framework::test_vm
timeout_duration = Explicit(300s)
vm = migration_from_base_and_back
vm_id = b235aa81-80f7-4f5b-beb6-55ea58baf5b8
|
| 351 | 2026-10-12T21:21:13.780Z | INFO | phd-runner: [WAIT_FOR_SERIAL_OUTPUT - END]
elapsed_milliseconds = 33
file = phd-tests/framework/src/test_vm/mod.rs
line = 913
path = phd_tests::migrate::from_base::migration_from_base_and_back
target = phd_framework::test_vm
vm = migration_from_base_and_back
vm_id = b235aa81-80f7-4f5b-beb6-55ea58baf5b8
|
| 352 | 2026-10-12T21:21:13.780Z | INFO | phd-runner: [WAIT_FOR_SERIAL_OUTPUT - START]
file = phd-tests/framework/src/test_vm/mod.rs
line = 913
path = phd_tests::migrate::from_base::migration_from_base_and_back
target = phd_framework::test_vm
vm = migration_from_base_and_back
vm_id = b235aa81-80f7-4f5b-beb6-55ea58baf5b8
|
| 353 | 2026-10-12T21:21:13.780Z | INFO | phd-runner: [WAIT_FOR_SERIAL_OUTPUT - EVENT] Waiting for output on serial console
file = phd-tests/framework/src/test_vm/mod.rs
line = 920
path = phd_tests::migrate::from_base::migration_from_base_and_back
target = phd_framework::test_vm
timeout_duration = Explicit(15s)
vm = migration_from_base_and_back
vm_id = b235aa81-80f7-4f5b-beb6-55ea58baf5b8
|
| 354 | 2026-10-12T21:21:13.791Z | INFO | phd-runner: [WAIT_FOR_SERIAL_OUTPUT - END]
elapsed_milliseconds = 10
file = phd-tests/framework/src/test_vm/mod.rs
line = 913
path = phd_tests::migrate::from_base::migration_from_base_and_back
target = phd_framework::test_vm
vm = migration_from_base_and_back
vm_id = b235aa81-80f7-4f5b-beb6-55ea58baf5b8
|
| 355 | 2026-10-12T21:21:13.791Z | INFO | phd-runner: [WAIT_FOR_SERIAL_OUTPUT - START]
file = phd-tests/framework/src/test_vm/mod.rs
line = 913
path = phd_tests::migrate::from_base::migration_from_base_and_back
target = phd_framework::test_vm
vm = migration_from_base_and_back
vm_id = b235aa81-80f7-4f5b-beb6-55ea58baf5b8
|
| 356 | 2026-10-12T21:21:13.791Z | INFO | phd-runner: [WAIT_FOR_SERIAL_OUTPUT - EVENT] Waiting for output on serial console
file = phd-tests/framework/src/test_vm/mod.rs
line = 920
path = phd_tests::migrate::from_base::migration_from_base_and_back
target = phd_framework::test_vm
timeout_duration = Explicit(300s)
vm = migration_from_base_and_back
vm_id = b235aa81-80f7-4f5b-beb6-55ea58baf5b8
|
| 357 | 2026-10-12T21:21:13.824Z | INFO | phd-runner: [WAIT_FOR_SERIAL_OUTPUT - END]
elapsed_milliseconds = 33
file = phd-tests/framework/src/test_vm/mod.rs
line = 913
path = phd_tests::migrate::from_base::migration_from_base_and_back
target = phd_framework::test_vm
vm = migration_from_base_and_back
vm_id = b235aa81-80f7-4f5b-beb6-55ea58baf5b8
|
| 358 | 2026-10-12T21:21:13.825Z | INFO | phd-runner: [TEST - EVENT] migrating to new Propolis artifact for lifecycle test
file = phd-tests/framework/src/lifecycle.rs
line = 73
path = phd_tests::migrate::from_base::migration_from_base_and_back
propolis_artifact = __DEFAULT_PROPOLIS
target = phd_framework::lifecycle
vm_name = migration_from_base_and_back
|
| 359 | 2026-10-12T21:21:13.825Z | INFO | phd-runner: [NEW - START]
file = phd-tests/framework/src/test_vm/mod.rs
line = 300
path = phd_tests::migrate::from_base::migration_from_base_and_back
target = phd_framework::test_vm
|
| 360 | 2026-10-12T21:21:13.825Z | INFO | phd-runner: [NEW - EVENT] phd_framework::test_vm
environment = EnvironmentSpec { location: Local, propolis_artifact: "__DEFAULT_PROPOLIS", metrics: None }
file = phd-tests/framework/src/test_vm/mod.rs
guest_os_kind = Alpine
line = 318
path = phd_tests::migrate::from_base::migration_from_base_and_back
target = phd_framework::test_vm
vm_name = migration_from_base_and_back_lifecycle_0
|
| 361 | 2026-10-12T21:21:13.825Z | DEBG | phd-runner: [NEW - EVENT] Verified artifact already exists
file = phd-tests/framework/src/artifacts/store.rs
line = 45
path = /work/phd-test/propolis-server
target = phd_framework::artifacts::store
|
| 362 | 2026-10-12T21:21:13.825Z | INFO | phd-runner: [NEW - EVENT] Launching Propolis server
bootrom_path = "/phd-artifacts/740187046a7267d0de72d3455070333547dbc0ea023531471fb2b2a61effa448/OVMF_CODE.fd"
file = phd-tests/framework/src/test_vm/server.rs
line = 66
path = phd_tests::migrate::from_base::migration_from_base_and_back
server_addr = 127.0.0.1:9002
server_path = "/work/phd-test/propolis-server"
target = phd_framework::test_vm::server
|
| 363 | 2026-10-12T21:21:13.825Z | INFO | phd-runner: [NEW - EVENT] Opening server log files
file = phd-tests/framework/src/log_config.rs
line = 84
path = phd_tests::migrate::from_base::migration_from_base_and_back
stderr_path = "/tmp/propolis-phd/phd_tests::migrate::from_base::migration_from_base_and_back/migration_from_base_and_back_lifecycle_0.stderr.log"
stdout_path = "/tmp/propolis-phd/phd_tests::migrate::from_base::migration_from_base_and_back/migration_from_base_and_back_lifecycle_0.stdout.log"
target = phd_framework::log_config
|
| 364 | 2026-10-12T21:21:13.875Z | INFO | phd-runner: [NEW - EVENT] Launched server with pid 938
file = phd-tests/framework/src/test_vm/server.rs
line = 127
path = phd_tests::migrate::from_base::migration_from_base_and_back
target = phd_framework::test_vm::server
|
| 365 | 2026-10-12T21:21:13.889Z | INFO | phd-runner: [NEW - END]
elapsed_milliseconds = 63
file = phd-tests/framework/src/test_vm/mod.rs
line = 300
path = phd_tests::migrate::from_base::migration_from_base_and_back
target = phd_framework::test_vm
|
| 366 | 2026-10-12T21:21:13.889Z | INFO | phd-runner: [MIGRATE_FROM - START]
file = phd-tests/framework/src/test_vm/mod.rs
line = 609
path = phd_tests::migrate::from_base::migration_from_base_and_back
source = migration_from_base_and_back
source_id = b235aa81-80f7-4f5b-beb6-55ea58baf5b8
target = phd_framework::test_vm
target_id = 0197a0e2-afc7-4c9c-87e2-ab3807ae63ab
|
| 367 | 2026-10-12T21:21:13.889Z | INFO | phd-runner: [MIGRATE_FROM - EVENT] Migrating from source at address 127.0.0.1:9000
file = phd-tests/framework/src/test_vm/mod.rs
line = 642
migration_id = 7e8f604c-7a75-4e4d-9a64-4eee6c13e559
path = phd_tests::migrate::from_base::migration_from_base_and_back
source = migration_from_base_and_back
source_id = b235aa81-80f7-4f5b-beb6-55ea58baf5b8
target = phd_framework::test_vm
target_id = 0197a0e2-afc7-4c9c-87e2-ab3807ae63ab
timeout_duration = 45s
|
| 368 | 2026-10-12T21:21:13.889Z | INFO | phd-runner: [INSTANCE_ENSURE_INTERNAL - START]
file = phd-tests/framework/src/test_vm/mod.rs
line = 412
path = phd_tests::migrate::from_base::migration_from_base_and_back
source = migration_from_base_and_back
source_id = b235aa81-80f7-4f5b-beb6-55ea58baf5b8
target = phd_framework::test_vm
target_id = 0197a0e2-afc7-4c9c-87e2-ab3807ae63ab
vm = migration_from_base_and_back_lifecycle_0
vm_id = 0197a0e2-afc7-4c9c-87e2-ab3807ae63ab
|
| 369 | 2026-10-12T21:21:13.890Z | INFO | phd-runner: [INSTANCE_ENSURE_INTERNAL - EVENT] retriable error from instance_spec_ensure
e = Communication Error: error sending request for url (http://127.0.0.1:9002/instance)
file = phd-tests/framework/src/test_vm/mod.rs
line = 455
path = phd_tests::migrate::from_base::migration_from_base_and_back
source = migration_from_base_and_back
source_id = b235aa81-80f7-4f5b-beb6-55ea58baf5b8
target = phd_framework::test_vm
target_id = 0197a0e2-afc7-4c9c-87e2-ab3807ae63ab
vm = migration_from_base_and_back_lifecycle_0
vm_id = 0197a0e2-afc7-4c9c-87e2-ab3807ae63ab
|
| 370 | 2026-10-12T21:21:14.358Z | INFO | phd-runner: [INSTANCE_ENSURE_INTERNAL - EVENT] Started instance
file = phd-tests/framework/src/test_vm/mod.rs
instance_description.instance = Instance { properties: InstanceProperties { id: 0197a0e2-afc7-4c9c-87e2-ab3807ae63ab, name: "phd-vm-0197a0e2-afc7-4c9c-87e2-ab3807ae63ab", description: "Pheidippides-managed VM", metadata: InstanceMetadata { silo_id: d0a0deb1-cd1f-4f1d-bfeb-a4bdb0d31b7f, project_id: 7692d34c-54b9-4fe5-aa51-b6d2f9557fb7, sled_id: 31425707-1743-4264-a4c4-9db8cc5134df, sled_serial: "31425707-1743-4264-a4c4-9db8cc5134df", sled_revision: 1, sled_model: "pheidippes" } }, state: Migrating }
line = 514
path = phd_tests::migrate::from_base::migration_from_base_and_back
source = migration_from_base_and_back
source_id = b235aa81-80f7-4f5b-beb6-55ea58baf5b8
target = phd_framework::test_vm
target_id = 0197a0e2-afc7-4c9c-87e2-ab3807ae63ab
vm = migration_from_base_and_back_lifecycle_0
vm_id = 0197a0e2-afc7-4c9c-87e2-ab3807ae63ab
|
| 371 | 2026-10-12T21:21:14.359Z | INFO | phd-runner: [MIGRATE - START]
file = phd-tests/framework/src/test_vm/mod.rs
line = 663
migration_id = 7e8f604c-7a75-4e4d-9a64-4eee6c13e559
path = phd_tests::migrate::from_base::migration_from_base_and_back
source = migration_from_base_and_back
source_id = b235aa81-80f7-4f5b-beb6-55ea58baf5b8
target = phd_framework::test_vm
target_id = 0197a0e2-afc7-4c9c-87e2-ab3807ae63ab
|
| 372 | 2026-10-12T21:21:16.861Z | INFO | phd-runner: [SERIAL CONSOLE TASK - EVENT] serial socket control message
file = phd-tests/framework/src/serial/mod.rs
line = 275
s = {"Migrating":{"destination":"127.0.0.1:9002","from_start":7847}}
target = phd_framework::serial
|
| 373 | 2026-10-12T21:21:18.700Z | INFO | phd-runner: [MIGRATE_FROM - EVENT] Migration completed successfully
file = phd-tests/framework/src/test_vm/mod.rs
line = 676
path = phd_tests::migrate::from_base::migration_from_base_and_back
source = migration_from_base_and_back
source_id = b235aa81-80f7-4f5b-beb6-55ea58baf5b8
target = phd_framework::test_vm
target_id = 0197a0e2-afc7-4c9c-87e2-ab3807ae63ab
|
| 374 | 2026-10-12T21:21:18.700Z | INFO | phd-runner: [MIGRATE - END]
elapsed_milliseconds = 4341
file = phd-tests/framework/src/test_vm/mod.rs
line = 663
migration_id = 7e8f604c-7a75-4e4d-9a64-4eee6c13e559
path = phd_tests::migrate::from_base::migration_from_base_and_back
source = migration_from_base_and_back
source_id = b235aa81-80f7-4f5b-beb6-55ea58baf5b8
target = phd_framework::test_vm
target_id = 0197a0e2-afc7-4c9c-87e2-ab3807ae63ab
|
| 375 | 2026-10-12T21:21:18.703Z | INFO | phd-runner: [VM CLEANUP - START]
file = phd-tests/framework/src/test_vm/mod.rs
line = 1172
path = phd_tests::migrate::from_base::migration_from_base_and_back
target = phd_framework::test_vm
vm = migration_from_base_and_back
vm_id = b235aa81-80f7-4f5b-beb6-55ea58baf5b8
|
| 376 | 2026-10-12T21:21:18.703Z | INFO | phd-runner: [WAIT_FOR_SERIAL_OUTPUT - START]
file = phd-tests/framework/src/test_vm/mod.rs
line = 913
path = phd_tests::migrate::from_base::migration_from_base_and_back
target = phd_framework::test_vm
vm = migration_from_base_and_back_lifecycle_0
vm_id = 0197a0e2-afc7-4c9c-87e2-ab3807ae63ab
|
| 377 | 2026-10-12T21:21:18.703Z | INFO | phd-runner: [WAIT_FOR_SERIAL_OUTPUT - EVENT] Waiting for output on serial console
file = phd-tests/framework/src/test_vm/mod.rs
line = 920
path = phd_tests::migrate::from_base::migration_from_base_and_back
target = phd_framework::test_vm
timeout_duration = Explicit(15s)
vm = migration_from_base_and_back_lifecycle_0
vm_id = 0197a0e2-afc7-4c9c-87e2-ab3807ae63ab
|
| 378 | 2026-10-12T21:21:18.705Z | DEBG | phd-runner: [VM CLEANUP - EVENT] Killing Propolis server process
file = phd-tests/framework/src/test_vm/server.rs
line = 177
path = phd_tests::migrate::from_base::migration_from_base_and_back
self.address = 127.0.0.1:9000
target = phd_framework::test_vm::server
vm = migration_from_base_and_back
vm_id = b235aa81-80f7-4f5b-beb6-55ea58baf5b8
|
| 379 | 2026-10-12T21:21:18.786Z | INFO | phd-runner: [VM CLEANUP - END]
elapsed_milliseconds = 83
file = phd-tests/framework/src/test_vm/mod.rs
line = 1172
path = phd_tests::migrate::from_base::migration_from_base_and_back
target = phd_framework::test_vm
vm = migration_from_base_and_back
vm_id = b235aa81-80f7-4f5b-beb6-55ea58baf5b8
|
| 380 | 2026-10-12T21:21:18.787Z | INFO | phd-runner: [INSTANCE_ENSURE_INTERNAL - END]
elapsed_milliseconds = 10442
file = phd-tests/framework/src/test_vm/mod.rs
line = 412
path = phd_tests::migrate::from_base::migration_from_base_and_back
target = phd_framework::test_vm
vm = migration_from_base_and_back
vm_id = b235aa81-80f7-4f5b-beb6-55ea58baf5b8
|
| 381 | 2026-10-12T21:21:18.787Z | INFO | phd-runner: [WAIT_FOR_SERIAL_OUTPUT - END]
elapsed_milliseconds = 83
file = phd-tests/framework/src/test_vm/mod.rs
line = 913
path = phd_tests::migrate::from_base::migration_from_base_and_back
target = phd_framework::test_vm
vm = migration_from_base_and_back_lifecycle_0
vm_id = 0197a0e2-afc7-4c9c-87e2-ab3807ae63ab
|
| 382 | 2026-10-12T21:21:18.787Z | INFO | phd-runner: [WAIT_FOR_SERIAL_OUTPUT - START]
file = phd-tests/framework/src/test_vm/mod.rs
line = 913
path = phd_tests::migrate::from_base::migration_from_base_and_back
target = phd_framework::test_vm
vm = migration_from_base_and_back_lifecycle_0
vm_id = 0197a0e2-afc7-4c9c-87e2-ab3807ae63ab
|
| 383 | 2026-10-12T21:21:18.787Z | INFO | phd-runner: [WAIT_FOR_SERIAL_OUTPUT - EVENT] Waiting for output on serial console
file = phd-tests/framework/src/test_vm/mod.rs
line = 920
path = phd_tests::migrate::from_base::migration_from_base_and_back
target = phd_framework::test_vm
timeout_duration = Explicit(300s)
vm = migration_from_base_and_back_lifecycle_0
vm_id = 0197a0e2-afc7-4c9c-87e2-ab3807ae63ab
|
| 384 | 2026-10-12T21:21:18.816Z | INFO | phd-runner: [WAIT_FOR_SERIAL_OUTPUT - END]
elapsed_milliseconds = 28
file = phd-tests/framework/src/test_vm/mod.rs
line = 913
path = phd_tests::migrate::from_base::migration_from_base_and_back
target = phd_framework::test_vm
vm = migration_from_base_and_back_lifecycle_0
vm_id = 0197a0e2-afc7-4c9c-87e2-ab3807ae63ab
|
| 385 | 2026-10-12T21:21:18.816Z | INFO | phd-runner: [TEST - EVENT] migrating to new Propolis artifact for lifecycle test
file = phd-tests/framework/src/lifecycle.rs
line = 73
path = phd_tests::migrate::from_base::migration_from_base_and_back
propolis_artifact = __BASE_PROPOLIS
target = phd_framework::lifecycle
vm_name = migration_from_base_and_back
|
| 386 | 2026-10-12T21:21:18.816Z | INFO | phd-runner: [NEW - START]
file = phd-tests/framework/src/test_vm/mod.rs
line = 300
path = phd_tests::migrate::from_base::migration_from_base_and_back
target = phd_framework::test_vm
|
| 387 | 2026-10-12T21:21:18.816Z | INFO | phd-runner: [NEW - EVENT] phd_framework::test_vm
environment = EnvironmentSpec { location: Local, propolis_artifact: "__BASE_PROPOLIS", metrics: None }
file = phd-tests/framework/src/test_vm/mod.rs
guest_os_kind = Alpine
line = 318
path = phd_tests::migrate::from_base::migration_from_base_and_back
target = phd_framework::test_vm
vm_name = migration_from_base_and_back_lifecycle_1
|
| 388 | 2026-10-12T21:21:18.816Z | DEBG | phd-runner: [NEW - EVENT] Verified artifact already exists
file = phd-tests/framework/src/artifacts/store.rs
line = 45
path = /phd-artifacts/c0d9344f91d563c7ab06bccfd2aae4b75c245ada57f0262eac2fd4a28094086e/propolis-server
target = phd_framework::artifacts::store
|
| 389 | 2026-10-12T21:21:18.817Z | INFO | phd-runner: [NEW - EVENT] Launching Propolis server
bootrom_path = "/phd-artifacts/740187046a7267d0de72d3455070333547dbc0ea023531471fb2b2a61effa448/OVMF_CODE.fd"
file = phd-tests/framework/src/test_vm/server.rs
line = 66
path = phd_tests::migrate::from_base::migration_from_base_and_back
server_addr = 127.0.0.1:9004
server_path = "/phd-artifacts/c0d9344f91d563c7ab06bccfd2aae4b75c245ada57f0262eac2fd4a28094086e/propolis-server"
target = phd_framework::test_vm::server
|
| 390 | 2026-10-12T21:21:18.817Z | INFO | phd-runner: [NEW - EVENT] Opening server log files
file = phd-tests/framework/src/log_config.rs
line = 84
path = phd_tests::migrate::from_base::migration_from_base_and_back
stderr_path = "/tmp/propolis-phd/phd_tests::migrate::from_base::migration_from_base_and_back/migration_from_base_and_back_lifecycle_1.stderr.log"
stdout_path = "/tmp/propolis-phd/phd_tests::migrate::from_base::migration_from_base_and_back/migration_from_base_and_back_lifecycle_1.stdout.log"
target = phd_framework::log_config
|
| 391 | 2026-10-12T21:21:18.869Z | INFO | phd-runner: [NEW - EVENT] Launched server with pid 940
file = phd-tests/framework/src/test_vm/server.rs
line = 127
path = phd_tests::migrate::from_base::migration_from_base_and_back
target = phd_framework::test_vm::server
|
| 392 | 2026-10-12T21:21:18.886Z | INFO | phd-runner: [NEW - END]
elapsed_milliseconds = 69
file = phd-tests/framework/src/test_vm/mod.rs
line = 300
path = phd_tests::migrate::from_base::migration_from_base_and_back
target = phd_framework::test_vm
|
| 393 | 2026-10-12T21:21:18.886Z | INFO | phd-runner: [MIGRATE_FROM - START]
file = phd-tests/framework/src/test_vm/mod.rs
line = 609
path = phd_tests::migrate::from_base::migration_from_base_and_back
source = migration_from_base_and_back_lifecycle_0
source_id = 0197a0e2-afc7-4c9c-87e2-ab3807ae63ab
target = phd_framework::test_vm
target_id = 05b8a7c9-3675-4664-bb44-eea3c3cf7cf3
|
| 394 | 2026-10-12T21:21:18.886Z | INFO | phd-runner: [MIGRATE_FROM - EVENT] Migrating from source at address 127.0.0.1:9002
file = phd-tests/framework/src/test_vm/mod.rs
line = 642
migration_id = 15e113c9-1982-4cce-b433-80f9d2571abd
path = phd_tests::migrate::from_base::migration_from_base_and_back
source = migration_from_base_and_back_lifecycle_0
source_id = 0197a0e2-afc7-4c9c-87e2-ab3807ae63ab
target = phd_framework::test_vm
target_id = 05b8a7c9-3675-4664-bb44-eea3c3cf7cf3
timeout_duration = 45s
|
| 395 | 2026-10-12T21:21:18.887Z | INFO | phd-runner: [INSTANCE_ENSURE_INTERNAL - START]
file = phd-tests/framework/src/test_vm/mod.rs
line = 412
path = phd_tests::migrate::from_base::migration_from_base_and_back
source = migration_from_base_and_back_lifecycle_0
source_id = 0197a0e2-afc7-4c9c-87e2-ab3807ae63ab
target = phd_framework::test_vm
target_id = 05b8a7c9-3675-4664-bb44-eea3c3cf7cf3
vm = migration_from_base_and_back_lifecycle_1
vm_id = 05b8a7c9-3675-4664-bb44-eea3c3cf7cf3
|
| 396 | 2026-10-12T21:21:18.887Z | INFO | phd-runner: [INSTANCE_ENSURE_INTERNAL - EVENT] retriable error from instance_spec_ensure
e = Communication Error: error sending request for url (http://127.0.0.1:9004/instance)
file = phd-tests/framework/src/test_vm/mod.rs
line = 455
path = phd_tests::migrate::from_base::migration_from_base_and_back
source = migration_from_base_and_back_lifecycle_0
source_id = 0197a0e2-afc7-4c9c-87e2-ab3807ae63ab
target = phd_framework::test_vm
target_id = 05b8a7c9-3675-4664-bb44-eea3c3cf7cf3
vm = migration_from_base_and_back_lifecycle_1
vm_id = 05b8a7c9-3675-4664-bb44-eea3c3cf7cf3
|
| 397 | 2026-10-12T21:21:19.295Z | INFO | phd-runner: [INSTANCE_ENSURE_INTERNAL - EVENT] Started instance
file = phd-tests/framework/src/test_vm/mod.rs
instance_description.instance = Instance { properties: InstanceProperties { id: 05b8a7c9-3675-4664-bb44-eea3c3cf7cf3, name: "phd-vm-05b8a7c9-3675-4664-bb44-eea3c3cf7cf3", description: "Pheidippides-managed VM", metadata: InstanceMetadata { silo_id: d0a0deb1-cd1f-4f1d-bfeb-a4bdb0d31b7f, project_id: 7692d34c-54b9-4fe5-aa51-b6d2f9557fb7, sled_id: 10954ecf-1435-4cdf-8166-12d7860ea7bb, sled_serial: "10954ecf-1435-4cdf-8166-12d7860ea7bb", sled_revision: 1, sled_model: "pheidippes" } }, state: Migrating }
line = 514
path = phd_tests::migrate::from_base::migration_from_base_and_back
source = migration_from_base_and_back_lifecycle_0
source_id = 0197a0e2-afc7-4c9c-87e2-ab3807ae63ab
target = phd_framework::test_vm
target_id = 05b8a7c9-3675-4664-bb44-eea3c3cf7cf3
vm = migration_from_base_and_back_lifecycle_1
vm_id = 05b8a7c9-3675-4664-bb44-eea3c3cf7cf3
|
| 398 | 2026-10-12T21:21:19.295Z | INFO | phd-runner: [MIGRATE - START]
file = phd-tests/framework/src/test_vm/mod.rs
line = 663
migration_id = 15e113c9-1982-4cce-b433-80f9d2571abd
path = phd_tests::migrate::from_base::migration_from_base_and_back
source = migration_from_base_and_back_lifecycle_0
source_id = 0197a0e2-afc7-4c9c-87e2-ab3807ae63ab
target = phd_framework::test_vm
target_id = 05b8a7c9-3675-4664-bb44-eea3c3cf7cf3
|
| 399 | 2026-10-12T21:21:21.785Z | INFO | phd-runner: [SERIAL CONSOLE TASK - EVENT] serial socket control message
file = phd-tests/framework/src/serial/mod.rs
line = 275
s = {"Migrating":{"destination":"127.0.0.1:9004","from_start":7894}}
target = phd_framework::serial
|
| 400 | 2026-10-12T21:21:23.642Z | INFO | phd-runner: [MIGRATE_FROM - EVENT] Migration completed successfully
file = phd-tests/framework/src/test_vm/mod.rs
line = 676
path = phd_tests::migrate::from_base::migration_from_base_and_back
source = migration_from_base_and_back_lifecycle_0
source_id = 0197a0e2-afc7-4c9c-87e2-ab3807ae63ab
target = phd_framework::test_vm
target_id = 05b8a7c9-3675-4664-bb44-eea3c3cf7cf3
|
| 401 | 2026-10-12T21:21:23.642Z | INFO | phd-runner: [MIGRATE - END]
elapsed_milliseconds = 4347
file = phd-tests/framework/src/test_vm/mod.rs
line = 663
migration_id = 15e113c9-1982-4cce-b433-80f9d2571abd
path = phd_tests::migrate::from_base::migration_from_base_and_back
source = migration_from_base_and_back_lifecycle_0
source_id = 0197a0e2-afc7-4c9c-87e2-ab3807ae63ab
target = phd_framework::test_vm
target_id = 05b8a7c9-3675-4664-bb44-eea3c3cf7cf3
|
| 402 | 2026-10-12T21:21:23.645Z | INFO | phd-runner: [VM CLEANUP - START]
file = phd-tests/framework/src/test_vm/mod.rs
line = 1172
path = phd_tests::migrate::from_base::migration_from_base_and_back
target = phd_framework::test_vm
vm = migration_from_base_and_back_lifecycle_0
vm_id = 0197a0e2-afc7-4c9c-87e2-ab3807ae63ab
|
| 403 | 2026-10-12T21:21:23.645Z | INFO | phd-runner: [WAIT_FOR_SERIAL_OUTPUT - START]
file = phd-tests/framework/src/test_vm/mod.rs
line = 913
path = phd_tests::migrate::from_base::migration_from_base_and_back
target = phd_framework::test_vm
vm = migration_from_base_and_back_lifecycle_1
vm_id = 05b8a7c9-3675-4664-bb44-eea3c3cf7cf3
|
| 404 | 2026-10-12T21:21:23.645Z | INFO | phd-runner: [WAIT_FOR_SERIAL_OUTPUT - EVENT] Waiting for output on serial console
file = phd-tests/framework/src/test_vm/mod.rs
line = 920
path = phd_tests::migrate::from_base::migration_from_base_and_back
target = phd_framework::test_vm
timeout_duration = Explicit(15s)
vm = migration_from_base_and_back_lifecycle_1
vm_id = 05b8a7c9-3675-4664-bb44-eea3c3cf7cf3
|
| 405 | 2026-10-12T21:21:23.647Z | DEBG | phd-runner: [VM CLEANUP - EVENT] Killing Propolis server process
file = phd-tests/framework/src/test_vm/server.rs
line = 177
path = phd_tests::migrate::from_base::migration_from_base_and_back
self.address = 127.0.0.1:9002
target = phd_framework::test_vm::server
vm = migration_from_base_and_back_lifecycle_0
vm_id = 0197a0e2-afc7-4c9c-87e2-ab3807ae63ab
|
| 406 | 2026-10-12T21:21:23.740Z | INFO | phd-runner: [VM CLEANUP - END]
elapsed_milliseconds = 94
file = phd-tests/framework/src/test_vm/mod.rs
line = 1172
path = phd_tests::migrate::from_base::migration_from_base_and_back
target = phd_framework::test_vm
vm = migration_from_base_and_back_lifecycle_0
vm_id = 0197a0e2-afc7-4c9c-87e2-ab3807ae63ab
|
| 407 | 2026-10-12T21:21:23.741Z | INFO | phd-runner: [INSTANCE_ENSURE_INTERNAL - END]
elapsed_milliseconds = 9851
file = phd-tests/framework/src/test_vm/mod.rs
line = 412
path = phd_tests::migrate::from_base::migration_from_base_and_back
source = migration_from_base_and_back
source_id = b235aa81-80f7-4f5b-beb6-55ea58baf5b8
target = phd_framework::test_vm
target_id = 0197a0e2-afc7-4c9c-87e2-ab3807ae63ab
vm = migration_from_base_and_back_lifecycle_0
vm_id = 0197a0e2-afc7-4c9c-87e2-ab3807ae63ab
|
| 408 | 2026-10-12T21:21:23.741Z | INFO | phd-runner: [MIGRATE_FROM - END]
elapsed_milliseconds = 9851
file = phd-tests/framework/src/test_vm/mod.rs
line = 609
path = phd_tests::migrate::from_base::migration_from_base_and_back
source = migration_from_base_and_back
source_id = b235aa81-80f7-4f5b-beb6-55ea58baf5b8
target = phd_framework::test_vm
target_id = 0197a0e2-afc7-4c9c-87e2-ab3807ae63ab
|
| 409 | 2026-10-12T21:21:23.847Z | INFO | phd-runner: [WAIT_FOR_SERIAL_OUTPUT - END]
elapsed_milliseconds = 201
file = phd-tests/framework/src/test_vm/mod.rs
line = 913
path = phd_tests::migrate::from_base::migration_from_base_and_back
target = phd_framework::test_vm
vm = migration_from_base_and_back_lifecycle_1
vm_id = 05b8a7c9-3675-4664-bb44-eea3c3cf7cf3
|
| 410 | 2026-10-12T21:21:23.847Z | INFO | phd-runner: [WAIT_FOR_SERIAL_OUTPUT - START]
file = phd-tests/framework/src/test_vm/mod.rs
line = 913
path = phd_tests::migrate::from_base::migration_from_base_and_back
target = phd_framework::test_vm
vm = migration_from_base_and_back_lifecycle_1
vm_id = 05b8a7c9-3675-4664-bb44-eea3c3cf7cf3
|
| 411 | 2026-10-12T21:21:23.847Z | INFO | phd-runner: [WAIT_FOR_SERIAL_OUTPUT - EVENT] Waiting for output on serial console
file = phd-tests/framework/src/test_vm/mod.rs
line = 920
path = phd_tests::migrate::from_base::migration_from_base_and_back
target = phd_framework::test_vm
timeout_duration = Explicit(300s)
vm = migration_from_base_and_back_lifecycle_1
vm_id = 05b8a7c9-3675-4664-bb44-eea3c3cf7cf3
|
| 412 | 2026-10-12T21:21:23.879Z | INFO | phd-runner: [WAIT_FOR_SERIAL_OUTPUT - END]
elapsed_milliseconds = 32
file = phd-tests/framework/src/test_vm/mod.rs
line = 913
path = phd_tests::migrate::from_base::migration_from_base_and_back
target = phd_framework::test_vm
vm = migration_from_base_and_back_lifecycle_1
vm_id = 05b8a7c9-3675-4664-bb44-eea3c3cf7cf3
|
| 413 | 2026-10-12T21:21:23.879Z | INFO | phd-runner: [TEST - EVENT] migrating to new Propolis artifact for lifecycle test
file = phd-tests/framework/src/lifecycle.rs
line = 73
path = phd_tests::migrate::from_base::migration_from_base_and_back
propolis_artifact = __DEFAULT_PROPOLIS
target = phd_framework::lifecycle
vm_name = migration_from_base_and_back
|
| 414 | 2026-10-12T21:21:23.880Z | INFO | phd-runner: [NEW - START]
file = phd-tests/framework/src/test_vm/mod.rs
line = 300
path = phd_tests::migrate::from_base::migration_from_base_and_back
target = phd_framework::test_vm
|
| 415 | 2026-10-12T21:21:23.880Z | INFO | phd-runner: [NEW - EVENT] phd_framework::test_vm
environment = EnvironmentSpec { location: Local, propolis_artifact: "__DEFAULT_PROPOLIS", metrics: None }
file = phd-tests/framework/src/test_vm/mod.rs
guest_os_kind = Alpine
line = 318
path = phd_tests::migrate::from_base::migration_from_base_and_back
target = phd_framework::test_vm
vm_name = migration_from_base_and_back_lifecycle_2
|
| 416 | 2026-10-12T21:21:23.880Z | DEBG | phd-runner: [NEW - EVENT] Verified artifact already exists
file = phd-tests/framework/src/artifacts/store.rs
line = 45
path = /work/phd-test/propolis-server
target = phd_framework::artifacts::store
|
| 417 | 2026-10-12T21:21:23.880Z | INFO | phd-runner: [NEW - EVENT] Launching Propolis server
bootrom_path = "/phd-artifacts/740187046a7267d0de72d3455070333547dbc0ea023531471fb2b2a61effa448/OVMF_CODE.fd"
file = phd-tests/framework/src/test_vm/server.rs
line = 66
path = phd_tests::migrate::from_base::migration_from_base_and_back
server_addr = 127.0.0.1:9006
server_path = "/work/phd-test/propolis-server"
target = phd_framework::test_vm::server
|
| 418 | 2026-10-12T21:21:23.880Z | INFO | phd-runner: [NEW - EVENT] Opening server log files
file = phd-tests/framework/src/log_config.rs
line = 84
path = phd_tests::migrate::from_base::migration_from_base_and_back
stderr_path = "/tmp/propolis-phd/phd_tests::migrate::from_base::migration_from_base_and_back/migration_from_base_and_back_lifecycle_2.stderr.log"
stdout_path = "/tmp/propolis-phd/phd_tests::migrate::from_base::migration_from_base_and_back/migration_from_base_and_back_lifecycle_2.stdout.log"
target = phd_framework::log_config
|
| 419 | 2026-10-12T21:21:23.934Z | INFO | phd-runner: [NEW - EVENT] Launched server with pid 942
file = phd-tests/framework/src/test_vm/server.rs
line = 127
path = phd_tests::migrate::from_base::migration_from_base_and_back
target = phd_framework::test_vm::server
|
| 420 | 2026-10-12T21:21:23.948Z | INFO | phd-runner: [NEW - END]
elapsed_milliseconds = 68
file = phd-tests/framework/src/test_vm/mod.rs
line = 300
path = phd_tests::migrate::from_base::migration_from_base_and_back
target = phd_framework::test_vm
|
| 421 | 2026-10-12T21:21:23.948Z | INFO | phd-runner: [MIGRATE_FROM - START]
file = phd-tests/framework/src/test_vm/mod.rs
line = 609
path = phd_tests::migrate::from_base::migration_from_base_and_back
source = migration_from_base_and_back_lifecycle_1
source_id = 05b8a7c9-3675-4664-bb44-eea3c3cf7cf3
target = phd_framework::test_vm
target_id = d133f725-f0c6-4cd3-9d70-106f35a9d77f
|
| 422 | 2026-10-12T21:21:23.948Z | INFO | phd-runner: [MIGRATE_FROM - EVENT] Migrating from source at address 127.0.0.1:9004
file = phd-tests/framework/src/test_vm/mod.rs
line = 642
migration_id = cf56d57f-1682-49b4-8dc1-b1f47912f1a7
path = phd_tests::migrate::from_base::migration_from_base_and_back
source = migration_from_base_and_back_lifecycle_1
source_id = 05b8a7c9-3675-4664-bb44-eea3c3cf7cf3
target = phd_framework::test_vm
target_id = d133f725-f0c6-4cd3-9d70-106f35a9d77f
timeout_duration = 45s
|
| 423 | 2026-10-12T21:21:23.948Z | INFO | phd-runner: [INSTANCE_ENSURE_INTERNAL - START]
file = phd-tests/framework/src/test_vm/mod.rs
line = 412
path = phd_tests::migrate::from_base::migration_from_base_and_back
source = migration_from_base_and_back_lifecycle_1
source_id = 05b8a7c9-3675-4664-bb44-eea3c3cf7cf3
target = phd_framework::test_vm
target_id = d133f725-f0c6-4cd3-9d70-106f35a9d77f
vm = migration_from_base_and_back_lifecycle_2
vm_id = d133f725-f0c6-4cd3-9d70-106f35a9d77f
|
| 424 | 2026-10-12T21:21:23.949Z | INFO | phd-runner: [INSTANCE_ENSURE_INTERNAL - EVENT] retriable error from instance_spec_ensure
e = Communication Error: error sending request for url (http://127.0.0.1:9006/instance)
file = phd-tests/framework/src/test_vm/mod.rs
line = 455
path = phd_tests::migrate::from_base::migration_from_base_and_back
source = migration_from_base_and_back_lifecycle_1
source_id = 05b8a7c9-3675-4664-bb44-eea3c3cf7cf3
target = phd_framework::test_vm
target_id = d133f725-f0c6-4cd3-9d70-106f35a9d77f
vm = migration_from_base_and_back_lifecycle_2
vm_id = d133f725-f0c6-4cd3-9d70-106f35a9d77f
|
| 425 | 2026-10-12T21:21:24.602Z | INFO | phd-runner: [INSTANCE_ENSURE_INTERNAL - EVENT] Started instance
file = phd-tests/framework/src/test_vm/mod.rs
instance_description.instance = Instance { properties: InstanceProperties { id: d133f725-f0c6-4cd3-9d70-106f35a9d77f, name: "phd-vm-d133f725-f0c6-4cd3-9d70-106f35a9d77f", description: "Pheidippides-managed VM", metadata: InstanceMetadata { silo_id: d0a0deb1-cd1f-4f1d-bfeb-a4bdb0d31b7f, project_id: 7692d34c-54b9-4fe5-aa51-b6d2f9557fb7, sled_id: 8e2f22fc-9be5-4451-9d90-8a8920239131, sled_serial: "8e2f22fc-9be5-4451-9d90-8a8920239131", sled_revision: 1, sled_model: "pheidippes" } }, state: Migrating }
line = 514
path = phd_tests::migrate::from_base::migration_from_base_and_back
source = migration_from_base_and_back_lifecycle_1
source_id = 05b8a7c9-3675-4664-bb44-eea3c3cf7cf3
target = phd_framework::test_vm
target_id = d133f725-f0c6-4cd3-9d70-106f35a9d77f
vm = migration_from_base_and_back_lifecycle_2
vm_id = d133f725-f0c6-4cd3-9d70-106f35a9d77f
|
| 426 | 2026-10-12T21:21:24.602Z | INFO | phd-runner: [MIGRATE - START]
file = phd-tests/framework/src/test_vm/mod.rs
line = 663
migration_id = cf56d57f-1682-49b4-8dc1-b1f47912f1a7
path = phd_tests::migrate::from_base::migration_from_base_and_back
source = migration_from_base_and_back_lifecycle_1
source_id = 05b8a7c9-3675-4664-bb44-eea3c3cf7cf3
target = phd_framework::test_vm
target_id = d133f725-f0c6-4cd3-9d70-106f35a9d77f
|
| 427 | 2026-10-12T21:21:27.131Z | INFO | phd-runner: [SERIAL CONSOLE TASK - EVENT] serial socket control message
file = phd-tests/framework/src/serial/mod.rs
line = 275
s = {"Migrating":{"destination":"127.0.0.1:9006","from_start":7941}}
target = phd_framework::serial
|
| 428 | 2026-10-12T21:21:27.171Z | INFO | phd-runner: [MIGRATE_FROM - EVENT] Migration completed successfully
file = phd-tests/framework/src/test_vm/mod.rs
line = 676
path = phd_tests::migrate::from_base::migration_from_base_and_back
source = migration_from_base_and_back_lifecycle_1
source_id = 05b8a7c9-3675-4664-bb44-eea3c3cf7cf3
target = phd_framework::test_vm
target_id = d133f725-f0c6-4cd3-9d70-106f35a9d77f
|
| 429 | 2026-10-12T21:21:27.171Z | INFO | phd-runner: [MIGRATE - END]
elapsed_milliseconds = 2568
file = phd-tests/framework/src/test_vm/mod.rs
line = 663
migration_id = cf56d57f-1682-49b4-8dc1-b1f47912f1a7
path = phd_tests::migrate::from_base::migration_from_base_and_back
source = migration_from_base_and_back_lifecycle_1
source_id = 05b8a7c9-3675-4664-bb44-eea3c3cf7cf3
target = phd_framework::test_vm
target_id = d133f725-f0c6-4cd3-9d70-106f35a9d77f
|
| 430 | 2026-10-12T21:21:27.173Z | INFO | phd-runner: [VM CLEANUP - START]
file = phd-tests/framework/src/test_vm/mod.rs
line = 1172
path = phd_tests::migrate::from_base::migration_from_base_and_back
target = phd_framework::test_vm
vm = migration_from_base_and_back_lifecycle_1
vm_id = 05b8a7c9-3675-4664-bb44-eea3c3cf7cf3
|
| 431 | 2026-10-12T21:21:27.174Z | INFO | phd-runner: [WAIT_FOR_SERIAL_OUTPUT - START]
file = phd-tests/framework/src/test_vm/mod.rs
line = 913
path = phd_tests::migrate::from_base::migration_from_base_and_back
target = phd_framework::test_vm
vm = migration_from_base_and_back_lifecycle_2
vm_id = d133f725-f0c6-4cd3-9d70-106f35a9d77f
|
| 432 | 2026-10-12T21:21:27.174Z | INFO | phd-runner: [WAIT_FOR_SERIAL_OUTPUT - EVENT] Waiting for output on serial console
file = phd-tests/framework/src/test_vm/mod.rs
line = 920
path = phd_tests::migrate::from_base::migration_from_base_and_back
target = phd_framework::test_vm
timeout_duration = Explicit(15s)
vm = migration_from_base_and_back_lifecycle_2
vm_id = d133f725-f0c6-4cd3-9d70-106f35a9d77f
|
| 433 | 2026-10-12T21:21:27.175Z | DEBG | phd-runner: [VM CLEANUP - EVENT] Killing Propolis server process
file = phd-tests/framework/src/test_vm/server.rs
line = 177
path = phd_tests::migrate::from_base::migration_from_base_and_back
self.address = 127.0.0.1:9004
target = phd_framework::test_vm::server
vm = migration_from_base_and_back_lifecycle_1
vm_id = 05b8a7c9-3675-4664-bb44-eea3c3cf7cf3
|
| 434 | 2026-10-12T21:21:27.254Z | INFO | phd-runner: [VM CLEANUP - END]
elapsed_milliseconds = 80
file = phd-tests/framework/src/test_vm/mod.rs
line = 1172
path = phd_tests::migrate::from_base::migration_from_base_and_back
target = phd_framework::test_vm
vm = migration_from_base_and_back_lifecycle_1
vm_id = 05b8a7c9-3675-4664-bb44-eea3c3cf7cf3
|
| 435 | 2026-10-12T21:21:27.255Z | INFO | phd-runner: [INSTANCE_ENSURE_INTERNAL - END]
elapsed_milliseconds = 8367
file = phd-tests/framework/src/test_vm/mod.rs
line = 412
path = phd_tests::migrate::from_base::migration_from_base_and_back
source = migration_from_base_and_back_lifecycle_0
source_id = 0197a0e2-afc7-4c9c-87e2-ab3807ae63ab
target = phd_framework::test_vm
target_id = 05b8a7c9-3675-4664-bb44-eea3c3cf7cf3
vm = migration_from_base_and_back_lifecycle_1
vm_id = 05b8a7c9-3675-4664-bb44-eea3c3cf7cf3
|
| 436 | 2026-10-12T21:21:27.255Z | INFO | phd-runner: [MIGRATE_FROM - END]
elapsed_milliseconds = 8367
file = phd-tests/framework/src/test_vm/mod.rs
line = 609
path = phd_tests::migrate::from_base::migration_from_base_and_back
source = migration_from_base_and_back_lifecycle_0
source_id = 0197a0e2-afc7-4c9c-87e2-ab3807ae63ab
target = phd_framework::test_vm
target_id = 05b8a7c9-3675-4664-bb44-eea3c3cf7cf3
|
| 437 | 2026-10-12T21:21:27.255Z | INFO | phd-runner: [WAIT_FOR_SERIAL_OUTPUT - END]
elapsed_milliseconds = 81
file = phd-tests/framework/src/test_vm/mod.rs
line = 913
path = phd_tests::migrate::from_base::migration_from_base_and_back
target = phd_framework::test_vm
vm = migration_from_base_and_back_lifecycle_2
vm_id = d133f725-f0c6-4cd3-9d70-106f35a9d77f
|
| 438 | 2026-10-12T21:21:27.255Z | INFO | phd-runner: [WAIT_FOR_SERIAL_OUTPUT - START]
file = phd-tests/framework/src/test_vm/mod.rs
line = 913
path = phd_tests::migrate::from_base::migration_from_base_and_back
target = phd_framework::test_vm
vm = migration_from_base_and_back_lifecycle_2
vm_id = d133f725-f0c6-4cd3-9d70-106f35a9d77f
|
| 439 | 2026-10-12T21:21:27.255Z | INFO | phd-runner: [WAIT_FOR_SERIAL_OUTPUT - EVENT] Waiting for output on serial console
file = phd-tests/framework/src/test_vm/mod.rs
line = 920
path = phd_tests::migrate::from_base::migration_from_base_and_back
target = phd_framework::test_vm
timeout_duration = Explicit(300s)
vm = migration_from_base_and_back_lifecycle_2
vm_id = d133f725-f0c6-4cd3-9d70-106f35a9d77f
|
| 440 | 2026-10-12T21:21:27.287Z | INFO | phd-runner: [WAIT_FOR_SERIAL_OUTPUT - END]
elapsed_milliseconds = 31
file = phd-tests/framework/src/test_vm/mod.rs
line = 913
path = phd_tests::migrate::from_base::migration_from_base_and_back
target = phd_framework::test_vm
vm = migration_from_base_and_back_lifecycle_2
vm_id = d133f725-f0c6-4cd3-9d70-106f35a9d77f
|
| 441 | 2026-10-12T21:21:27.287Z | INFO | phd-runner: [VM CLEANUP - START]
file = phd-tests/framework/src/test_vm/mod.rs
line = 1172
path = phd_tests::migrate::from_base::migration_from_base_and_back
target = phd_framework::test_vm
vm = migration_from_base_and_back_lifecycle_2
vm_id = d133f725-f0c6-4cd3-9d70-106f35a9d77f
|
| 442 | 2026-10-12T21:21:27.287Z | DEBG | phd-runner: [SERIAL CONSOLE TASK - EVENT] serial console command channel was closed
file = phd-tests/framework/src/serial/mod.rs
line = 213
target = phd_framework::serial
|
| 443 | 2026-10-12T21:21:27.287Z | INFO | phd-runner: test phd_tests::migrate::from_base::migration_from_base_and_back ... ok
file = phd-tests/runner/src/execute.rs
line = 141
target = phd_runner::execute
|
| 444 | 2026-10-12T21:21:27.287Z | INFO | phd-runner: [SERIAL CONSOLE TASK - END]
elapsed_milliseconds = 18349
file = phd-tests/framework/src/serial/mod.rs
line = 200
target = phd_framework::serial
|
| 445 | 2026-10-12T21:21:27.288Z | INFO | phd-runner: [TEST_CLEANUP - START]
file = phd-tests/runner/src/fixtures.rs
line = 51
target = phd_runner::fixtures
|
| 446 | 2026-10-12T21:21:27.289Z | DEBG | phd-runner: [VM CLEANUP - EVENT] trying to ensure Propolis server VM is destroyed
file = phd-tests/framework/src/test_vm/mod.rs
line = 1195
path = phd_tests::migrate::from_base::migration_from_base_and_back
target = phd_framework::test_vm
vm = migration_from_base_and_back_lifecycle_2
vm_id = d133f725-f0c6-4cd3-9d70-106f35a9d77f
|
| 447 | 2026-10-12T21:21:28.019Z | DEBG | phd-runner: [VM CLEANUP - EVENT] Killing Propolis server process
file = phd-tests/framework/src/test_vm/server.rs
line = 177
path = phd_tests::migrate::from_base::migration_from_base_and_back
self.address = 127.0.0.1:9006
target = phd_framework::test_vm::server
vm = migration_from_base_and_back_lifecycle_2
vm_id = d133f725-f0c6-4cd3-9d70-106f35a9d77f
|
| 448 | 2026-10-12T21:21:28.108Z | DEBG | phd-runner: [VM CLEANUP - EVENT] zfs clone dropped
file = phd-tests/framework/src/zfs.rs
line = 83
path = phd_tests::migrate::from_base::migration_from_base_and_back
target = phd_framework::zfs
vm = migration_from_base_and_back_lifecycle_2
vm_id = d133f725-f0c6-4cd3-9d70-106f35a9d77f
|
| 449 | 2026-10-12T21:21:28.108Z | DEBG | phd-runner: [VM CLEANUP - EVENT] executing ZFS command
args = ["phd-artifacts/phd-clone-fb775efb-c482-4d74-897c-a3a250ea9a7a"]
file = phd-tests/framework/src/zfs.rs
line = 304
path = phd_tests::migrate::from_base::migration_from_base_and_back
target = phd_framework::zfs
verb = destroy
vm = migration_from_base_and_back_lifecycle_2
vm_id = d133f725-f0c6-4cd3-9d70-106f35a9d77f
|
| 450 | 2026-10-12T21:21:28.137Z | DEBG | phd-runner: [VM CLEANUP - EVENT] zfs snapshot dropped
file = phd-tests/framework/src/zfs.rs
line = 57
path = phd_tests::migrate::from_base::migration_from_base_and_back
target = phd_framework::zfs
vm = migration_from_base_and_back_lifecycle_2
vm_id = d133f725-f0c6-4cd3-9d70-106f35a9d77f
|
| 451 | 2026-10-12T21:21:28.137Z | DEBG | phd-runner: [VM CLEANUP - EVENT] executing ZFS command
args = ["phd-artifacts@phd-b2bfc393-761b-4c59-a146-1839afd3d58c"]
file = phd-tests/framework/src/zfs.rs
line = 304
path = phd_tests::migrate::from_base::migration_from_base_and_back
target = phd_framework::zfs
verb = destroy
vm = migration_from_base_and_back_lifecycle_2
vm_id = d133f725-f0c6-4cd3-9d70-106f35a9d77f
|
| 452 | 2026-10-12T21:21:28.160Z | INFO | phd-runner: [VM CLEANUP - END]
elapsed_milliseconds = 873
file = phd-tests/framework/src/test_vm/mod.rs
line = 1172
path = phd_tests::migrate::from_base::migration_from_base_and_back
target = phd_framework::test_vm
vm = migration_from_base_and_back_lifecycle_2
vm_id = d133f725-f0c6-4cd3-9d70-106f35a9d77f
|
| 453 | 2026-10-12T21:21:28.161Z | INFO | phd-runner: [INSTANCE_ENSURE_INTERNAL - END]
elapsed_milliseconds = 4211
file = phd-tests/framework/src/test_vm/mod.rs
line = 412
path = phd_tests::migrate::from_base::migration_from_base_and_back
source = migration_from_base_and_back_lifecycle_1
source_id = 05b8a7c9-3675-4664-bb44-eea3c3cf7cf3
target = phd_framework::test_vm
target_id = d133f725-f0c6-4cd3-9d70-106f35a9d77f
vm = migration_from_base_and_back_lifecycle_2
vm_id = d133f725-f0c6-4cd3-9d70-106f35a9d77f
|
| 454 | 2026-10-12T21:21:28.161Z | INFO | phd-runner: [TEST_CLEANUP - END]
elapsed_milliseconds = 873
file = phd-tests/runner/src/fixtures.rs
line = 51
target = phd_runner::fixtures
|
| 455 | 2026-10-12T21:21:28.161Z | INFO | phd-runner: [MIGRATE_FROM - END]
elapsed_milliseconds = 4212
file = phd-tests/framework/src/test_vm/mod.rs
line = 609
path = phd_tests::migrate::from_base::migration_from_base_and_back
source = migration_from_base_and_back_lifecycle_1
source_id = 05b8a7c9-3675-4664-bb44-eea3c3cf7cf3
target = phd_framework::test_vm
target_id = d133f725-f0c6-4cd3-9d70-106f35a9d77f
|
| 456 | 2026-10-12T21:21:28.161Z | INFO | phd-runner: [TEST - END]
elapsed_milliseconds = 19945
file = phd-tests/tests/src/migrate.rs
line = 52
path = phd_tests::migrate::from_base::migration_from_base_and_back
target = phd_tests::migrate::from_base
|
| 457 | 2026-10-12T21:21:28.161Z | INFO | phd-runner: [EXECUTION_CLEANUP - START]
file = phd-tests/runner/src/fixtures.rs
line = 35
target = phd_runner::fixtures
|
| 458 | 2026-10-12T21:21:28.161Z | INFO | phd-runner: [EXECUTION_CLEANUP - END]
elapsed_milliseconds = 0
file = phd-tests/runner/src/fixtures.rs
line = 35
target = phd_runner::fixtures
|
| 459 | | test result: ok. 3 passed; 0 failed; 0 skipped; 0 not run; finished in 89.50s |
| 460 | | |
| 461 | 2026-10-12T21:21:28.163Z | DEBG | phd-runner: phd_runner
exit_code = 0
file = phd-tests/runner/src/main.rs
line = 41
target = phd_runner
|