Max level shown:
12026-10-17T05:30:24.091ZINFOphd-runner: phd_runner file = phd-tests/runner/src/main.rs line = 36 runner_args = ProcessArgs { command: Run(RunOptions { propolis_server_cmd: "/work/phd-test/propolis-server", base_propolis_branch: Some("master"), base_propolis_commit: None, base_propolis_cmd: None, crucible_downstairs_cmd: None, crucible_downstairs_commit: Some(Auto), tmp_directory: "/tmp/propolis-phd", artifact_directory: Some("/phd-artifacts"), output_mode: TmpFile, default_guest_cpus: 2, default_guest_memory_mib: 512, artifact_toml_path: "/work/phd-test/artifacts.toml", default_guest_artifact: "alpine", default_bootrom_artifact: "ovmf", include_filter: ["phd_tests::migrate::from_base"], exclude_filter: [], max_buildomat_wait_secs: 1200, manual_stop_on_failure: false }), disable_ansi: false, emit_bunyan: true } target = phd_runner
22026-10-17T05:30:24.120ZDEBGphd-runner: Created new artifact store from manifest file = phd-tests/framework/src/artifacts/store.rs line = 219 store = Store { local_dir: "/phd-artifacts", artifacts: {"alpine": Mutex { data: StoredArtifact { description: Artifact { filename: "alpine.iso", kind: GuestOs(Alpine), source: RemoteServer { sha256: "ba8007f74f9b54fbae3b2520da577831b4834778a498d732f091260c61aa7ca1" }, untar: None }, cached_path: None } }, "ovmf": Mutex { data: StoredArtifact { description: Artifact { filename: "OVMF_CODE.fd", kind: Bootrom, source: Buildomat(BuildomatArtifact { repo: Repo("oxidecomputer/edk2"), series: Series("image_debug"), commit: Commit("bf64f45b1a58e69d126a3c6ca1e4512c88668132"), sha256: "740187046a7267d0de72d3455070333547dbc0ea023531471fb2b2a61effa448" }), untar: None }, cached_path: None } }}, downloader: DownloadConfig { timeout: 600s, buildomat_backoff: ExponentialBackoff { current_interval: 1s, initial_interval: 1s, randomization_factor: 0.5, multiplier: 1.5, max_interval: 60s, start_time: Instant { tv_sec: 258, tv_nsec: 899237131 }, max_elapsed_time: Some(1200s), clock: SystemClock }, remote_server_uris: ["https://oxide-omicron-build.s3.amazonaws.com"] } } target = phd_framework::artifacts::store
32026-10-17T05:30:24.120ZINFOphd-runner: Adding Propolis server from local command file = phd-tests/framework/src/artifacts/store.rs line = 227 propolis_server_cmd = /work/phd-test/propolis-server target = phd_framework::artifacts::store
42026-10-17T05:30:24.122ZINFOphd-runner: Adding crucible-downstairs from Buildomat Git revision commit = ad8a31742adc45e925e63443a5b43c8e30604022 file = phd-tests/framework/src/artifacts/store.rs line = 311 target = phd_framework::artifacts::store
52026-10-17T05:30:24.127ZDEBGphd-runner: Downloading file from Buildomat... file = phd-tests/framework/src/artifacts/buildomat.rs line = 215 target = phd_framework::artifacts::buildomat timeout = 600s uri = https://buildomat.eng.oxide.computer/public/file/oxidecomputer/crucible/nightly-image/ad8a31742adc45e925e63443a5b43c8e30604022/crucible-nightly.sha256.txt
62026-10-17T05:30:26.232ZINFOphd-runner: Adding 'current' Propolis server from Buildomat Git branch 'master' file = phd-tests/framework/src/artifacts/store.rs line = 248 target = phd_framework::artifacts::store
72026-10-17T05:30:27.039ZDEBGphd-runner: Downloading file from Buildomat... file = phd-tests/framework/src/artifacts/buildomat.rs line = 215 target = phd_framework::artifacts::buildomat timeout = 600s uri = https://buildomat.eng.oxide.computer/public/file/oxidecomputer/propolis/phd_build/3b60af56ed99c4497f02ac9fe014c76adfcf978b/propolis-server.sha256.txt
82026-10-17T05:30:27.199ZINFOphd-runner: [EXECUTION_SETUP - START] file = phd-tests/runner/src/fixtures.rs line = 25 target = phd_runner::fixtures
92026-10-17T05:30:27.200ZINFOphd-runner: [EXECUTION_SETUP - END] elapsed_milliseconds = 0 file = phd-tests/runner/src/fixtures.rs line = 25 target = phd_runner::fixtures
102026-10-17T05:30:27.202ZINFOphd-runner: Running 3 test(s) file = phd-tests/runner/src/execute.rs line = 83 target = phd_runner::execute
112026-10-17T05:30:27.203ZINFOphd-runner: Starting test phd_tests::migrate::from_base::serial_history file = phd-tests/runner/src/execute.rs line = 91 target = phd_runner::execute
122026-10-17T05:30:27.203ZINFOphd-runner: [TEST_SETUP - START] file = phd-tests/runner/src/fixtures.rs line = 41 target = phd_runner::fixtures
132026-10-17T05:30:27.203ZINFOphd-runner: [TEST_SETUP - END] elapsed_milliseconds = 0 file = phd-tests/runner/src/fixtures.rs line = 41 target = phd_runner::fixtures
142026-10-17T05:30:27.204ZINFOphd-runner: [TEST - START] file = phd-tests/tests/src/migrate.rs line = 40 path = phd_tests::migrate::from_base::serial_history target = phd_tests::migrate::from_base
152026-10-17T05:30:27.206ZDEBGphd-runner: [TEST - EVENT] checking for existing copy of artifact file = phd-tests/framework/src/artifacts/store.rs line = 89 maybe_path = /phd-artifacts/740187046a7267d0de72d3455070333547dbc0ea023531471fb2b2a61effa448/OVMF_CODE.fd path = phd_tests::migrate::from_base::serial_history target = phd_framework::artifacts::store
162026-10-17T05:30:27.208ZDEBGphd-runner: [TEST - EVENT] Downloading file from Buildomat... file = phd-tests/framework/src/artifacts/buildomat.rs line = 215 path = phd_tests::migrate::from_base::serial_history target = phd_framework::artifacts::buildomat timeout = 600s uri = https://buildomat.eng.oxide.computer/public/file/oxidecomputer/edk2/image_debug/bf64f45b1a58e69d126a3c6ca1e4512c88668132/OVMF_CODE.fd
172026-10-17T05:30:27.672ZDEBGphd-runner: [TEST - EVENT] checking for existing copy of artifact file = phd-tests/framework/src/artifacts/store.rs line = 89 maybe_path = /phd-artifacts/ba8007f74f9b54fbae3b2520da577831b4834778a498d732f091260c61aa7ca1/alpine.iso path = phd_tests::migrate::from_base::serial_history target = phd_framework::artifacts::store
182026-10-17T05:30:27.686ZDEBGphd-runner: [TEST - EVENT] Downloading alpine.iso from https://oxide-omicron-build.s3.amazonaws.com/alpine.iso file = phd-tests/framework/src/artifacts/store.rs line = 614 path = phd_tests::migrate::from_base::serial_history target = phd_framework::artifacts::store timeout = 600s
192026-10-17T05:30:34.695ZDEBGphd-runner: [TEST - EVENT] Verified artifact already exists file = phd-tests/framework/src/artifacts/store.rs line = 45 path = /phd-artifacts/ba8007f74f9b54fbae3b2520da577831b4834778a498d732f091260c61aa7ca1/alpine.iso target = phd_framework::artifacts::store
202026-10-17T05:30:34.695ZDEBGphd-runner: [TEST - EVENT] executing ZFS command args = ["/phd-artifacts/ba8007f74f9b54fbae3b2520da577831b4834778a498d732f091260c61aa7ca1/alpine.iso"] file = phd-tests/framework/src/zfs.rs line = 304 path = phd_tests::migrate::from_base::serial_history target = phd_framework::zfs verb = list
212026-10-17T05:30:34.712ZDEBGphd-runner: [TEST - EVENT] parsing zfs list output file = phd-tests/framework/src/zfs.rs line = 238 path = phd_tests::migrate::from_base::serial_history stdout = NAME USED AVAIL REFER MOUNTPOINT\nphd-artifacts 3.88M 25.3T 2M /phd-artifacts\n target = phd_framework::zfs
222026-10-17T05:30:34.713ZDEBGphd-runner: [TEST - EVENT] executing ZFS command args = ["phd-artifacts@phd-53a9d8ae-61f3-432b-bd3d-2557bd0641fa"] file = phd-tests/framework/src/zfs.rs line = 304 path = phd_tests::migrate::from_base::serial_history target = phd_framework::zfs verb = snapshot
232026-10-17T05:30:34.737ZDEBGphd-runner: [TEST - EVENT] executing ZFS command args = ["phd-artifacts@phd-53a9d8ae-61f3-432b-bd3d-2557bd0641fa", "phd-artifacts/phd-clone-28428e34-4776-4fd6-a79d-f190f99febed"] file = phd-tests/framework/src/zfs.rs line = 304 path = phd_tests::migrate::from_base::serial_history target = phd_framework::zfs verb = clone
242026-10-17T05:30:34.754ZDEBGphd-runner: [TEST - EVENT] executing ZFS command args = ["phd-artifacts/phd-clone-28428e34-4776-4fd6-a79d-f190f99febed"] file = phd-tests/framework/src/zfs.rs line = 304 path = phd_tests::migrate::from_base::serial_history target = phd_framework::zfs verb = list
252026-10-17T05:30:34.764ZDEBGphd-runner: [TEST - EVENT] parsing zfs list output file = phd-tests/framework/src/zfs.rs line = 238 path = phd_tests::migrate::from_base::serial_history stdout = NAME USED AVAIL REFER MOUNTPOINT\nphd-artifacts/phd-clone-28428e34-4776-4fd6-a79d-f190f99febed 0B 25.3T 49.0M /phd-artifacts/phd-clone-28428e34-4776-4fd6-a79d-f190f99febed\n target = phd_framework::zfs
262026-10-17T05:30:34.769ZINFOphd-runner: [NEW - START] file = phd-tests/framework/src/test_vm/mod.rs line = 300 path = phd_tests::migrate::from_base::serial_history target = phd_framework::test_vm
272026-10-17T05:30:34.769ZINFOphd-runner: [NEW - EVENT] phd_framework::test_vm environment = EnvironmentSpec { location: Local, propolis_artifact: "__BASE_PROPOLIS", metrics: None } file = phd-tests/framework/src/test_vm/mod.rs guest_os_kind = Alpine line = 318 path = phd_tests::migrate::from_base::serial_history target = phd_framework::test_vm vm_name = migration_serial_history_base
282026-10-17T05:30:34.769ZDEBGphd-runner: [NEW - EVENT] checking for existing copy of artifact file = phd-tests/framework/src/artifacts/store.rs line = 89 maybe_path = /phd-artifacts/739eeb04a4728b2e7609b038a587b5de0d939c2a02cf61882a60d42a6ba676e1/propolis-server.tar.gz path = phd_tests::migrate::from_base::serial_history target = phd_framework::artifacts::store
292026-10-17T05:30:34.769ZDEBGphd-runner: [NEW - EVENT] Downloading file from Buildomat... file = phd-tests/framework/src/artifacts/buildomat.rs line = 215 path = phd_tests::migrate::from_base::serial_history target = phd_framework::artifacts::buildomat timeout = 600s uri = https://buildomat.eng.oxide.computer/public/file/oxidecomputer/propolis/phd_build/3b60af56ed99c4497f02ac9fe014c76adfcf978b/propolis-server.tar.gz
302026-10-17T05:30:55.912ZDEBGphd-runner: [NEW - EVENT] Extracting artifact from tarball extracted_path = /phd-artifacts/739eeb04a4728b2e7609b038a587b5de0d939c2a02cf61882a60d42a6ba676e1/propolis-server file = phd-tests/framework/src/artifacts/store.rs line = 160 path = phd_tests::migrate::from_base::serial_history target = phd_framework::artifacts::store untar_path = propolis-server
312026-10-17T05:30:55.912ZDEBGphd-runner: [NEW - EVENT] Extracting gzipped tarball... file = phd-tests/framework/src/artifacts/store.rs line = 514 path = phd_tests::migrate::from_base::serial_history target = phd_framework::artifacts::store
322026-10-17T05:31:21.152ZINFOphd-runner: [NEW - EVENT] Launching Propolis server bootrom_path = "/phd-artifacts/740187046a7267d0de72d3455070333547dbc0ea023531471fb2b2a61effa448/OVMF_CODE.fd" file = phd-tests/framework/src/test_vm/server.rs line = 66 path = phd_tests::migrate::from_base::serial_history server_addr = 127.0.0.1:9000 server_path = "/phd-artifacts/739eeb04a4728b2e7609b038a587b5de0d939c2a02cf61882a60d42a6ba676e1/propolis-server" target = phd_framework::test_vm::server
332026-10-17T05:31:21.152ZINFOphd-runner: [NEW - EVENT] Opening server log files file = phd-tests/framework/src/log_config.rs line = 84 path = phd_tests::migrate::from_base::serial_history stderr_path = "/tmp/propolis-phd/phd_tests::migrate::from_base::serial_history/migration_serial_history_base.stderr.log" stdout_path = "/tmp/propolis-phd/phd_tests::migrate::from_base::serial_history/migration_serial_history_base.stdout.log" target = phd_framework::log_config
342026-10-17T05:31:21.312ZINFOphd-runner: [NEW - EVENT] Launched server with pid 917 file = phd-tests/framework/src/test_vm/server.rs line = 127 path = phd_tests::migrate::from_base::serial_history target = phd_framework::test_vm::server
352026-10-17T05:31:21.328ZINFOphd-runner: [INSTANCE_ENSURE_INTERNAL - START] file = phd-tests/framework/src/test_vm/mod.rs line = 412 path = phd_tests::migrate::from_base::serial_history target = phd_framework::test_vm vm = migration_serial_history_base vm_id = 526ee8b6-40a6-4729-9e14-a92a0a760baa
362026-10-17T05:31:21.341ZINFOphd-runner: [INSTANCE_ENSURE_INTERNAL - EVENT] retriable error from instance_spec_ensure e = Communication Error: error sending request for url (http://127.0.0.1:9000/instance) file = phd-tests/framework/src/test_vm/mod.rs line = 455 path = phd_tests::migrate::from_base::serial_history target = phd_framework::test_vm vm = migration_serial_history_base vm_id = 526ee8b6-40a6-4729-9e14-a92a0a760baa
372026-10-17T05:31:21.345ZINFOphd-runner: [NEW - END] elapsed_milliseconds = 46567 file = phd-tests/framework/src/test_vm/mod.rs line = 300 path = phd_tests::migrate::from_base::serial_history target = phd_framework::test_vm
382026-10-17T05:31:21.632ZERROphd-runner: [INSTANCE_ENSURE_INTERNAL - EVENT] permanent error from instance_spec_ensure e = Error Response: status: 400 Bad Request; headers: {"content-type": "application/json", "x-request-id": "c6c8a244-e511-4ed5-8c6f-b5544b98535d", "content-length": "122", "date": "Sat, 17 Oct 2026 05:31:21 GMT"}; value: Error { error_code: None, message: "server does not support this API version: 7.0.0", request_id: "c6c8a244-e511-4ed5-8c6f-b5544b98535d" } file = phd-tests/framework/src/test_vm/mod.rs line = 459 path = phd_tests::migrate::from_base::serial_history target = phd_framework::test_vm vm = migration_serial_history_base vm_id = 526ee8b6-40a6-4729-9e14-a92a0a760baa
392026-10-17T05:31:21.647ZDEBGphd-runner: [TEST - EVENT] Killing Propolis server process file = phd-tests/framework/src/test_vm/server.rs line = 177 path = phd_tests::migrate::from_base::serial_history self.address = 127.0.0.1:9000 target = phd_framework::test_vm::server
402026-10-17T05:31:21.664ZDEBGphd-runner: [TEST - EVENT] zfs clone dropped file = phd-tests/framework/src/zfs.rs line = 83 path = phd_tests::migrate::from_base::serial_history target = phd_framework::zfs
412026-10-17T05:31:21.664ZDEBGphd-runner: [TEST - EVENT] executing ZFS command args = ["phd-artifacts/phd-clone-28428e34-4776-4fd6-a79d-f190f99febed"] file = phd-tests/framework/src/zfs.rs line = 304 path = phd_tests::migrate::from_base::serial_history target = phd_framework::zfs verb = destroy
422026-10-17T05:31:21.696ZDEBGphd-runner: [TEST - EVENT] zfs snapshot dropped file = phd-tests/framework/src/zfs.rs line = 57 path = phd_tests::migrate::from_base::serial_history target = phd_framework::zfs
432026-10-17T05:31:21.696ZDEBGphd-runner: [TEST - EVENT] executing ZFS command args = ["phd-artifacts@phd-53a9d8ae-61f3-432b-bd3d-2557bd0641fa"] file = phd-tests/framework/src/zfs.rs line = 304 path = phd_tests::migrate::from_base::serial_history target = phd_framework::zfs verb = destroy
442026-10-17T05:31:22.759ZINFOphd-runner: [INSTANCE_ENSURE_INTERNAL - END] elapsed_milliseconds = 1430 file = phd-tests/framework/src/test_vm/mod.rs line = 412 path = phd_tests::migrate::from_base::serial_history target = phd_framework::test_vm vm = migration_serial_history_base vm_id = 526ee8b6-40a6-4729-9e14-a92a0a760baa
452026-10-17T05:31:22.759ZINFOphd-runner: [TEST - END] elapsed_milliseconds = 55546 file = phd-tests/tests/src/migrate.rs line = 40 path = phd_tests::migrate::from_base::serial_history target = phd_tests::migrate::from_base
462026-10-17T05:31:22.762ZINFOphd-runner: test phd_tests::migrate::from_base::serial_history ... FAILED: Error Response: status: 400 Bad Request; headers: {"content-type": "application/json", "x-request-id": "c6c8a244-e511-4ed5-8c6f-b5544b98535d", "content-length": "122", "date": "Sat, 17 Oct 2026 05:31:21 GMT"}; value: Error { error_code: None, message: "server does not support this API version: 7.0.0", request_id: "c6c8a244-e511-4ed5-8c6f-b5544b98535d" } Stack backtrace: 0: <anyhow::Error as core::convert::From<progenitor_client::progenitor_client::Error<propolis_client::types::Error>>>::from at /home/build/.cargo/registry/src/index.crates.io-1949cf8c6b5b557f/anyhow-1.0.104/src/backtrace.rs:10:14 1: <core::result::Result<phd_framework::serial::SerialConsole, anyhow::Error> as core::ops::try_trait::FromResidual<core::result::Result<core::convert::Infallible, progenitor_client::progenitor_client::Error<propolis_client::types::Error>>>>::from_residual at /rustc/8bab26f4f68e0e26f0bb7960be334d5b520ea452/library/core/src/result.rs:2189:27 2: <phd_framework::test_vm::TestVm>::instance_ensure_internal::{closure#0}::{closure#0} at ./oxidecomputer/propolis/phd-tests/framework/src/test_vm/mod.rs:471:9 3: <tracing::instrument::Instrumented<<phd_framework::test_vm::TestVm>::instance_ensure_internal::{closure#0}::{closure#0}> as core::future::future::Future>::poll at /home/build/.cargo/registry/src/index.crates.io-1949cf8c6b5b557f/tracing-0.1.40/src/instrument.rs:321:15 4: <phd_framework::test_vm::TestVm>::instance_ensure_internal::{closure#0} at ./oxidecomputer/propolis/phd-tests/framework/src/test_vm/mod.rs:412:5 5: <phd_framework::test_vm::TestVm>::instance_ensure::{closure#0} at ./oxidecomputer/propolis/phd-tests/framework/src/test_vm/mod.rs:549:22 6: <phd_framework::test_vm::TestVm>::launch::{closure#0} at ./oxidecomputer/propolis/phd-tests/framework/src/test_vm/mod.rs:537:32 7: phd_tests::migrate::run_serial_history_test::{closure#0} at ./oxidecomputer/propolis/phd-tests/tests/src/migrate.rs:354:21 8: phd_tests::migrate::from_base::serial_history::{closure#0}::{closure#0} at ./oxidecomputer/propolis/phd-tests/tests/src/migrate.rs:46:10 9: <tracing::instrument::Instrumented<phd_tests::migrate::from_base::serial_history::{closure#0}::{closure#0}> as core::future::future::Future>::poll at /home/build/.cargo/registry/src/index.crates.io-1949cf8c6b5b557f/tracing-0.1.40/src/instrument.rs:321:15 10: phd_tests::migrate::from_base::serial_history::{closure#0} at ./oxidecomputer/propolis/phd-tests/tests/src/migrate.rs:40:5 11: <core::pin::Pin<alloc::boxed::Box<dyn core::future::future::Future<Output = phd_testcase::TestOutcome> + core::marker::Send>> as core::future::future::Future>::poll at /rustc/8bab26f4f68e0e26f0bb7960be334d5b520ea452/library/core/src/future/future.rs:133:9 12: <phd_testcase::TestCase>::run::{closure#0} at ./oxidecomputer/propolis/phd-tests/testcase/src/lib.rs:79:32 13: phd_runner::execute::run_tests_with_ctx::{closure#0}::{closure#0}::{closure#0} at /home/build/.cargo/registry/src/index.crates.io-1949cf8c6b5b557f/tokio-1.52.3/src/macros/select.rs:705:49 14: <core::future::poll_fn::PollFn<phd_runner::execute::run_tests_with_ctx::{closure#0}::{closure#0}::{closure#0}> as core::future::future::Future>::poll at /rustc/8bab26f4f68e0e26f0bb7960be334d5b520ea452/library/core/src/future/poll_fn.rs:151:9 15: phd_runner::execute::run_tests_with_ctx::{closure#0}::{closure#0} at ./oxidecomputer/propolis/phd-tests/runner/src/execute.rs:117:13 16: <tokio::runtime::task::core::Core<phd_runner::execute::run_tests_with_ctx::{closure#0}::{closure#0}, alloc::sync::Arc<tokio::runtime::scheduler::multi_thread::handle::Handle>>>::poll::{closure#0} at /home/build/.cargo/registry/src/index.crates.io-1949cf8c6b5b557f/tokio-1.52.3/src/runtime/task/core.rs:375:24 17: <tokio::loom::std::unsafe_cell::UnsafeCell<tokio::runtime::task::core::Stage<phd_runner::execute::run_tests_with_ctx::{closure#0}::{closure#0}>>>::with_mut::<core::task::poll::Poll<phd_testcase::TestOutcome>, <tokio::runtime::task::core::Core<phd_runner::execute::run_tests_with_ctx::{closure#0}::{closure#0}, alloc::sync::Arc<tokio::runtime::scheduler::multi_thread::handle::Handle>>>::poll::{closure#0}> at /home/build/.cargo/registry/src/index.crates.io-1949cf8c6b5b557f/tokio-1.52.3/src/loom/std/unsafe_cell.rs:16:9 18: <tokio::runtime::task::core::Core<phd_runner::execute::run_tests_with_ctx::{closure#0}::{closure#0}, alloc::sync::Arc<tokio::runtime::scheduler::multi_thread::handle::Handle>>>::poll at /home/build/.cargo/registry/src/index.crates.io-1949cf8c6b5b557f/tokio-1.52.3/src/runtime/task/core.rs:364:30 19: tokio::runtime::task::harness::poll_future::<phd_runner::execute::run_tests_with_ctx::{closure#0}::{closure#0}, alloc::sync::Arc<tokio::runtime::scheduler::multi_thread::handle::Handle>>::{closure#0} at /home/build/.cargo/registry/src/index.crates.io-1949cf8c6b5b557f/tokio-1.52.3/src/runtime/task/harness.rs:535:30 20: <core::panic::unwind_safe::AssertUnwindSafe<tokio::runtime::task::harness::poll_future<phd_runner::execute::run_tests_with_ctx::{closure#0}::{closure#0}, alloc::sync::Arc<tokio::runtime::scheduler::multi_thread::handle::Handle>>::{closure#0}> as core::ops::function::FnOnce<()>>::call_once at /rustc/8bab26f4f68e0e26f0bb7960be334d5b520ea452/library/core/src/panic/unwind_safe.rs:275:9 21: std::panicking::catch_unwind::do_call::<core::panic::unwind_safe::AssertUnwindSafe<tokio::runtime::task::harness::poll_future<phd_runner::execute::run_tests_with_ctx::{closure#0}::{closure#0}, alloc::sync::Arc<tokio::runtime::scheduler::multi_thread::handle::Handle>>::{closure#0}>, core::task::poll::Poll<phd_testcase::TestOutcome>> at /rustc/8bab26f4f68e0e26f0bb7960be334d5b520ea452/library/std/src/panicking.rs:581:40 22: __rust_try 23: std::panicking::catch_unwind::<core::task::poll::Poll<phd_testcase::TestOutcome>, core::panic::unwind_safe::AssertUnwindSafe<tokio::runtime::task::harness::poll_future<phd_runner::execute::run_tests_with_ctx::{closure#0}::{closure#0}, alloc::sync::Arc<tokio::runtime::scheduler::multi_thread::handle::Handle>>::{closure#0}>> at /rustc/8bab26f4f68e0e26f0bb7960be334d5b520ea452/library/std/src/panicking.rs:544:19 24: std::panic::catch_unwind::<core::panic::unwind_safe::AssertUnwindSafe<tokio::runtime::task::harness::poll_future<phd_runner::execute::run_tests_with_ctx::{closure#0}::{closure#0}, alloc::sync::Arc<tokio::runtime::scheduler::multi_thread::handle::Handle>>::{closure#0}>, core::task::poll::Poll<phd_testcase::TestOutcome>> at /rustc/8bab26f4f68e0e26f0bb7960be334d5b520ea452/library/std/src/panic.rs:359:14 25: tokio::runtime::task::harness::poll_future::<phd_runner::execute::run_tests_with_ctx::{closure#0}::{closure#0}, alloc::sync::Arc<tokio::runtime::scheduler::multi_thread::handle::Handle>> at /home/build/.cargo/registry/src/index.crates.io-1949cf8c6b5b557f/tokio-1.52.3/src/runtime/task/harness.rs:523:18 26: <tokio::runtime::task::harness::Harness<phd_runner::execute::run_tests_with_ctx::{closure#0}::{closure#0}, alloc::sync::Arc<tokio::runtime::scheduler::multi_thread::handle::Handle>>>::poll_inner at /home/build/.cargo/registry/src/index.crates.io-1949cf8c6b5b557f/tokio-1.52.3/src/runtime/task/harness.rs:210:27 27: <tokio::runtime::task::harness::Harness<phd_runner::execute::run_tests_with_ctx::{closure#0}::{closure#0}, alloc::sync::Arc<tokio::runtime::scheduler::multi_thread::handle::Handle>>>::poll at /home/build/.cargo/registry/src/index.crates.io-1949cf8c6b5b557f/tokio-1.52.3/src/runtime/task/harness.rs:155:20 28: tokio::runtime::task::raw::poll::<phd_runner::execute::run_tests_with_ctx::{closure#0}::{closure#0}, alloc::sync::Arc<tokio::runtime::scheduler::multi_thread::handle::Handle>> at /home/build/.cargo/registry/src/index.crates.io-1949cf8c6b5b557f/tokio-1.52.3/src/runtime/task/raw.rs:337:13 29: <tokio::runtime::task::raw::RawTask>::poll at /home/build/.cargo/registry/src/index.crates.io-1949cf8c6b5b557f/tokio-1.52.3/src/runtime/task/raw.rs:267:18 30: <tokio::runtime::task::LocalNotified<alloc::sync::Arc<tokio::runtime::scheduler::multi_thread::handle::Handle>>>::run at /home/build/.cargo/registry/src/index.crates.io-1949cf8c6b5b557f/tokio-1.52.3/src/runtime/task/mod.rs:510:13 31: <tokio::runtime::scheduler::multi_thread::worker::Context>::run_task::{closure#0} at /home/build/.cargo/registry/src/index.crates.io-1949cf8c6b5b557f/tokio-1.52.3/src/runtime/scheduler/multi_thread/worker.rs:761:22 32: tokio::task::coop::with_budget::<core::result::Result<alloc::boxed::Box<tokio::runtime::scheduler::multi_thread::worker::Core>, ()>, <tokio::runtime::scheduler::multi_thread::worker::Context>::run_task::{closure#0}> at /home/build/.cargo/registry/src/index.crates.io-1949cf8c6b5b557f/tokio-1.52.3/src/task/coop/mod.rs:167:5 33: tokio::task::coop::budget::<core::result::Result<alloc::boxed::Box<tokio::runtime::scheduler::multi_thread::worker::Core>, ()>, <tokio::runtime::scheduler::multi_thread::worker::Context>::run_task::{closure#0}> at /home/build/.cargo/registry/src/index.crates.io-1949cf8c6b5b557f/tokio-1.52.3/src/task/coop/mod.rs:133:5 34: <tokio::runtime::scheduler::multi_thread::worker::Context>::run_task at /home/build/.cargo/registry/src/index.crates.io-1949cf8c6b5b557f/tokio-1.52.3/src/runtime/scheduler/multi_thread/worker.rs:675:9 35: <tokio::runtime::scheduler::multi_thread::worker::Context>::run at /home/build/.cargo/registry/src/index.crates.io-1949cf8c6b5b557f/tokio-1.52.3/src/runtime/scheduler/multi_thread/worker.rs:585:29 36: tokio::runtime::scheduler::multi_thread::worker::run::{closure#0}::{closure#0} at /home/build/.cargo/registry/src/index.crates.io-1949cf8c6b5b557f/tokio-1.52.3/src/runtime/scheduler/multi_thread/worker.rs:550:24 37: <tokio::runtime::context::scoped::Scoped<tokio::runtime::scheduler::Context>>::set::<tokio::runtime::scheduler::multi_thread::worker::run::{closure#0}::{closure#0}, ()> at /home/build/.cargo/registry/src/index.crates.io-1949cf8c6b5b557f/tokio-1.52.3/src/runtime/context/scoped.rs:40:9 38: tokio::runtime::context::set_scheduler::<(), tokio::runtime::scheduler::multi_thread::worker::run::{closure#0}::{closure#0}>::{closure#0} at /home/build/.cargo/registry/src/index.crates.io-1949cf8c6b5b557f/tokio-1.52.3/src/runtime/context.rs:181:38 39: <std::thread::local::LocalKey<tokio::runtime::context::Context>>::try_with::<tokio::runtime::context::set_scheduler<(), tokio::runtime::scheduler::multi_thread::worker::run::{closure#0}::{closure#0}>::{closure#0}, ()> at /rustc/8bab26f4f68e0e26f0bb7960be334d5b520ea452/library/std/src/thread/local.rs:462:12 40: <std::thread::local::LocalKey<tokio::runtime::context::Context>>::with::<tokio::runtime::context::set_scheduler<(), tokio::runtime::scheduler::multi_thread::worker::run::{closure#0}::{closure#0}>::{closure#0}, ()> at /rustc/8bab26f4f68e0e26f0bb7960be334d5b520ea452/library/std/src/thread/local.rs:426:20 41: tokio::runtime::context::set_scheduler::<(), tokio::runtime::scheduler::multi_thread::worker::run::{closure#0}::{closure#0}> at /home/build/.cargo/registry/src/index.crates.io-1949cf8c6b5b557f/tokio-1.52.3/src/runtime/context.rs:181:17 42: tokio::runtime::scheduler::multi_thread::worker::run::{closure#0} at /home/build/.cargo/registry/src/index.crates.io-1949cf8c6b5b557f/tokio-1.52.3/src/runtime/scheduler/multi_thread/worker.rs:545:9 43: tokio::runtime::context::runtime::enter_runtime::<tokio::runtime::scheduler::multi_thread::worker::run::{closure#0}, ()> at /home/build/.cargo/registry/src/index.crates.io-1949cf8c6b5b557f/tokio-1.52.3/src/runtime/context/runtime.rs:65:16 44: tokio::runtime::scheduler::multi_thread::worker::run at /home/build/.cargo/registry/src/index.crates.io-1949cf8c6b5b557f/tokio-1.52.3/src/runtime/scheduler/multi_thread/worker.rs:537:5 45: <tokio::runtime::scheduler::multi_thread::worker::Launch>::launch::{closure#0} at /home/build/.cargo/registry/src/index.crates.io-1949cf8c6b5b557f/tokio-1.52.3/src/runtime/scheduler/multi_thread/worker.rs:503:45 46: <tokio::runtime::blocking::task::BlockingTask<<tokio::runtime::scheduler::multi_thread::worker::Launch>::launch::{closure#0}> as core::future::future::Future>::poll at /home/build/.cargo/registry/src/index.crates.io-1949cf8c6b5b557f/tokio-1.52.3/src/runtime/blocking/task.rs:42:21 47: <tokio::runtime::task::core::Core<tokio::runtime::blocking::task::BlockingTask<<tokio::runtime::scheduler::multi_thread::worker::Launch>::launch::{closure#0}>, tokio::runtime::blocking::schedule::BlockingSchedule>>::poll::{closure#0} at /home/build/.cargo/registry/src/index.crates.io-1949cf8c6b5b557f/tokio-1.52.3/src/runtime/task/core.rs:375:24 48: <tokio::loom::std::unsafe_cell::UnsafeCell<tokio::runtime::task::core::Stage<tokio::runtime::blocking::task::BlockingTask<<tokio::runtime::scheduler::multi_thread::worker::Launch>::launch::{closure#0}>>>>::with_mut::<core::task::poll::Poll<()>, <tokio::runtime::task::core::Core<tokio::runtime::blocking::task::BlockingTask<<tokio::runtime::scheduler::multi_thread::worker::Launch>::launch::{closure#0}>, tokio::runtime::blocking::schedule::BlockingSchedule>>::poll::{closure#0}> at /home/build/.cargo/registry/src/index.crates.io-1949cf8c6b5b557f/tokio-1.52.3/src/loom/std/unsafe_cell.rs:16:9 49: <tokio::runtime::task::core::Core<tokio::runtime::blocking::task::BlockingTask<<tokio::runtime::scheduler::multi_thread::worker::Launch>::launch::{closure#0}>, tokio::runtime::blocking::schedule::BlockingSchedule>>::poll at /home/build/.cargo/registry/src/index.crates.io-1949cf8c6b5b557f/tokio-1.52.3/src/runtime/task/core.rs:364:30 50: tokio::runtime::task::harness::poll_future::<tokio::runtime::blocking::task::BlockingTask<<tokio::runtime::scheduler::multi_thread::worker::Launch>::launch::{closure#0}>, tokio::runtime::blocking::schedule::BlockingSchedule>::{closure#0} at /home/build/.cargo/registry/src/index.crates.io-1949cf8c6b5b557f/tokio-1.52.3/src/runtime/task/harness.rs:535:30 51: <core::panic::unwind_safe::AssertUnwindSafe<tokio::runtime::task::harness::poll_future<tokio::runtime::blocking::task::BlockingTask<<tokio::runtime::scheduler::multi_thread::worker::Launch>::launch::{closure#0}>, tokio::runtime::blocking::schedule::BlockingSchedule>::{closure#0}> as core::ops::function::FnOnce<()>>::call_once at /rustc/8bab26f4f68e0e26f0bb7960be334d5b520ea452/library/core/src/panic/unwind_safe.rs:275:9 52: std::panicking::catch_unwind::do_call::<core::panic::unwind_safe::AssertUnwindSafe<tokio::runtime::task::harness::poll_future<tokio::runtime::blocking::task::BlockingTask<<tokio::runtime::scheduler::multi_thread::worker::Launch>::launch::{closure#0}>, tokio::runtime::blocking::schedule::BlockingSchedule>::{closure#0}>, core::task::poll::Poll<()>> at /rustc/8bab26f4f68e0e26f0bb7960be334d5b520ea452/library/std/src/panicking.rs:581:40 53: __rust_try 54: std::panicking::catch_unwind::<core::task::poll::Poll<()>, core::panic::unwind_safe::AssertUnwindSafe<tokio::runtime::task::harness::poll_future<tokio::runtime::blocking::task::BlockingTask<<tokio::runtime::scheduler::multi_thread::worker::Launch>::launch::{closure#0}>, tokio::runtime::blocking::schedule::BlockingSchedule>::{closure#0}>> at /rustc/8bab26f4f68e0e26f0bb7960be334d5b520ea452/library/std/src/panicking.rs:544:19 55: std::panic::catch_unwind::<core::panic::unwind_safe::AssertUnwindSafe<tokio::runtime::task::harness::poll_future<tokio::runtime::blocking::task::BlockingTask<<tokio::runtime::scheduler::multi_thread::worker::Launch>::launch::{closure#0}>, tokio::runtime::blocking::schedule::BlockingSchedule>::{closure#0}>, core::task::poll::Poll<()>> at /rustc/8bab26f4f68e0e26f0bb7960be334d5b520ea452/library/std/src/panic.rs:359:14 56: tokio::runtime::task::harness::poll_future::<tokio::runtime::blocking::task::BlockingTask<<tokio::runtime::scheduler::multi_thread::worker::Launch>::launch::{closure#0}>, tokio::runtime::blocking::schedule::BlockingSchedule> at /home/build/.cargo/registry/src/index.crates.io-1949cf8c6b5b557f/tokio-1.52.3/src/runtime/task/harness.rs:523:18 57: <tokio::runtime::task::harness::Harness<tokio::runtime::blocking::task::BlockingTask<<tokio::runtime::scheduler::multi_thread::worker::Launch>::launch::{closure#0}>, tokio::runtime::blocking::schedule::BlockingSchedule>>::poll_inner at /home/build/.cargo/registry/src/index.crates.io-1949cf8c6b5b557f/tokio-1.52.3/src/runtime/task/harness.rs:210:27 58: <tokio::runtime::task::harness::Harness<tokio::runtime::blocking::task::BlockingTask<<tokio::runtime::scheduler::multi_thread::worker::Launch>::launch::{closure#0}>, tokio::runtime::blocking::schedule::BlockingSchedule>>::poll at /home/build/.cargo/registry/src/index.crates.io-1949cf8c6b5b557f/tokio-1.52.3/src/runtime/task/harness.rs:155:20 59: tokio::runtime::task::raw::poll::<tokio::runtime::blocking::task::BlockingTask<<tokio::runtime::scheduler::multi_thread::worker::Launch>::launch::{closure#0}>, tokio::runtime::blocking::schedule::BlockingSchedule> at /home/build/.cargo/registry/src/index.crates.io-1949cf8c6b5b557f/tokio-1.52.3/src/runtime/task/raw.rs:337:13 60: <tokio::runtime::task::raw::RawTask>::poll at /home/build/.cargo/registry/src/index.crates.io-1949cf8c6b5b557f/tokio-1.52.3/src/runtime/task/raw.rs:267:18 61: <tokio::runtime::task::UnownedTask<tokio::runtime::blocking::schedule::BlockingSchedule>>::run at /home/build/.cargo/registry/src/index.crates.io-1949cf8c6b5b557f/tokio-1.52.3/src/runtime/task/mod.rs:547:13 62: <tokio::runtime::blocking::pool::Task>::run at /home/build/.cargo/registry/src/index.crates.io-1949cf8c6b5b557f/tokio-1.52.3/src/runtime/blocking/pool.rs:161:19 63: <tokio::runtime::blocking::pool::Inner>::run at /home/build/.cargo/registry/src/index.crates.io-1949cf8c6b5b557f/tokio-1.52.3/src/runtime/blocking/pool.rs:518:22 64: <tokio::runtime::blocking::pool::Spawner>::spawn_thread::{closure#0} at /home/build/.cargo/registry/src/index.crates.io-1949cf8c6b5b557f/tokio-1.52.3/src/runtime/blocking/pool.rs:474:47 65: std::sys::backtrace::__rust_begin_short_backtrace::<<tokio::runtime::blocking::pool::Spawner>::spawn_thread::{closure#0}, ()> at /rustc/8bab26f4f68e0e26f0bb7960be334d5b520ea452/library/std/src/sys/backtrace.rs:166:18 66: std::thread::lifecycle::spawn_unchecked::<<tokio::runtime::blocking::pool::Spawner>::spawn_thread::{closure#0}, ()>::{closure#1}::{closure#0} at /rustc/8bab26f4f68e0e26f0bb7960be334d5b520ea452/library/std/src/thread/lifecycle.rs:70:13 67: <core::panic::unwind_safe::AssertUnwindSafe<std::thread::lifecycle::spawn_unchecked<<tokio::runtime::blocking::pool::Spawner>::spawn_thread::{closure#0}, ()>::{closure#1}::{closure#0}> as core::ops::function::FnOnce<()>>::call_once at /rustc/8bab26f4f68e0e26f0bb7960be334d5b520ea452/library/core/src/panic/unwind_safe.rs:275:9 68: std::panicking::catch_unwind::do_call::<core::panic::unwind_safe::AssertUnwindSafe<std::thread::lifecycle::spawn_unchecked<<tokio::runtime::blocking::pool::Spawner>::spawn_thread::{closure#0}, ()>::{closure#1}::{closure#0}>, ()> at /rustc/8bab26f4f68e0e26f0bb7960be334d5b520ea452/library/std/src/panicking.rs:581:40 69: __rust_try 70: std::panicking::catch_unwind::<(), core::panic::unwind_safe::AssertUnwindSafe<std::thread::lifecycle::spawn_unchecked<<tokio::runtime::blocking::pool::Spawner>::spawn_thread::{closure#0}, ()>::{closure#1}::{closure#0}>> at /rustc/8bab26f4f68e0e26f0bb7960be334d5b520ea452/library/std/src/panicking.rs:544:19 71: std::panic::catch_unwind::<core::panic::unwind_safe::AssertUnwindSafe<std::thread::lifecycle::spawn_unchecked<<tokio::runtime::blocking::pool::Spawner>::spawn_thread::{closure#0}, ()>::{closure#1}::{closure#0}>, ()> at /rustc/8bab26f4f68e0e26f0bb7960be334d5b520ea452/library/std/src/panic.rs:359:14 72: std::thread::lifecycle::spawn_unchecked::<<tokio::runtime::blocking::pool::Spawner>::spawn_thread::{closure#0}, ()>::{closure#1} at /rustc/8bab26f4f68e0e26f0bb7960be334d5b520ea452/library/std/src/thread/lifecycle.rs:68:26 73: <std::thread::lifecycle::spawn_unchecked<<tokio::runtime::blocking::pool::Spawner>::spawn_thread::{closure#0}, ()>::{closure#1} as core::ops::function::FnOnce<()>>::call_once::{shim:vtable#0} at /rustc/8bab26f4f68e0e26f0bb7960be334d5b520ea452/library/core/src/ops/function.rs:250:5 74: <alloc::boxed::Box<dyn core::ops::function::FnOnce<(), Output = ()> + core::marker::Send> as core::ops::function::FnOnce<()>>::call_once at /rustc/8bab26f4f68e0e26f0bb7960be334d5b520ea452/library/alloc/src/boxed.rs:2275:9 75: <std::sys::thread::unix::Thread>::new::thread_start at /rustc/8bab26f4f68e0e26f0bb7960be334d5b520ea452/library/std/src/sys/thread/unix.rs:118:17 76: _thrp_setup 77: <unknown> file = phd-tests/runner/src/execute.rs line = 141 target = phd_runner::execute
472026-10-17T05:31:22.762ZINFOphd-runner: [TEST_CLEANUP - START] file = phd-tests/runner/src/fixtures.rs line = 51 target = phd_runner::fixtures
482026-10-17T05:31:22.767ZINFOphd-runner: [TEST_CLEANUP - END] elapsed_milliseconds = 4 file = phd-tests/runner/src/fixtures.rs line = 51 target = phd_runner::fixtures
492026-10-17T05:31:22.767ZINFOphd-runner: Starting test phd_tests::migrate::from_base::can_migrate_from_base file = phd-tests/runner/src/execute.rs line = 91 target = phd_runner::execute
502026-10-17T05:31:22.767ZINFOphd-runner: [TEST_SETUP - START] file = phd-tests/runner/src/fixtures.rs line = 41 target = phd_runner::fixtures
512026-10-17T05:31:22.767ZINFOphd-runner: [TEST_SETUP - END] elapsed_milliseconds = 0 file = phd-tests/runner/src/fixtures.rs line = 41 target = phd_runner::fixtures
522026-10-17T05:31:22.767ZINFOphd-runner: [TEST - START] file = phd-tests/tests/src/migrate.rs line = 34 path = phd_tests::migrate::from_base::can_migrate_from_base target = phd_tests::migrate::from_base
532026-10-17T05:31:22.767ZDEBGphd-runner: [TEST - EVENT] Verified artifact already exists file = phd-tests/framework/src/artifacts/store.rs line = 45 path = /phd-artifacts/740187046a7267d0de72d3455070333547dbc0ea023531471fb2b2a61effa448/OVMF_CODE.fd target = phd_framework::artifacts::store
542026-10-17T05:31:22.767ZDEBGphd-runner: [TEST - EVENT] Verified artifact already exists file = phd-tests/framework/src/artifacts/store.rs line = 45 path = /phd-artifacts/ba8007f74f9b54fbae3b2520da577831b4834778a498d732f091260c61aa7ca1/alpine.iso target = phd_framework::artifacts::store
552026-10-17T05:31:22.767ZDEBGphd-runner: [TEST - EVENT] Verified artifact already exists file = phd-tests/framework/src/artifacts/store.rs line = 45 path = /phd-artifacts/ba8007f74f9b54fbae3b2520da577831b4834778a498d732f091260c61aa7ca1/alpine.iso target = phd_framework::artifacts::store
562026-10-17T05:31:22.767ZDEBGphd-runner: [TEST - EVENT] executing ZFS command args = ["/phd-artifacts/ba8007f74f9b54fbae3b2520da577831b4834778a498d732f091260c61aa7ca1/alpine.iso"] file = phd-tests/framework/src/zfs.rs line = 304 path = phd_tests::migrate::from_base::can_migrate_from_base target = phd_framework::zfs verb = list
572026-10-17T05:31:22.778ZDEBGphd-runner: [TEST - EVENT] parsing zfs list output file = phd-tests/framework/src/zfs.rs line = 238 path = phd_tests::migrate::from_base::can_migrate_from_base stdout = NAME USED AVAIL REFER MOUNTPOINT\nphd-artifacts 1.31G 25.3T 1.31G /phd-artifacts\n target = phd_framework::zfs
582026-10-17T05:31:22.778ZDEBGphd-runner: [TEST - EVENT] executing ZFS command args = ["phd-artifacts@phd-15f2338a-e680-4247-9aee-82d59017720c"] file = phd-tests/framework/src/zfs.rs line = 304 path = phd_tests::migrate::from_base::can_migrate_from_base target = phd_framework::zfs verb = snapshot
592026-10-17T05:31:22.795ZDEBGphd-runner: [TEST - EVENT] executing ZFS command args = ["phd-artifacts@phd-15f2338a-e680-4247-9aee-82d59017720c", "phd-artifacts/phd-clone-f1f438f2-2076-4a3c-bb29-522fb97499f5"] file = phd-tests/framework/src/zfs.rs line = 304 path = phd_tests::migrate::from_base::can_migrate_from_base target = phd_framework::zfs verb = clone
602026-10-17T05:31:22.812ZDEBGphd-runner: [TEST - EVENT] executing ZFS command args = ["phd-artifacts/phd-clone-f1f438f2-2076-4a3c-bb29-522fb97499f5"] file = phd-tests/framework/src/zfs.rs line = 304 path = phd_tests::migrate::from_base::can_migrate_from_base target = phd_framework::zfs verb = list
612026-10-17T05:31:22.824ZDEBGphd-runner: [TEST - EVENT] parsing zfs list output file = phd-tests/framework/src/zfs.rs line = 238 path = phd_tests::migrate::from_base::can_migrate_from_base stdout = NAME USED AVAIL REFER MOUNTPOINT\nphd-artifacts/phd-clone-f1f438f2-2076-4a3c-bb29-522fb97499f5 0B 25.3T 1.31G /phd-artifacts/phd-clone-f1f438f2-2076-4a3c-bb29-522fb97499f5\n target = phd_framework::zfs
622026-10-17T05:31:22.825ZINFOphd-runner: [NEW - START] file = phd-tests/framework/src/test_vm/mod.rs line = 300 path = phd_tests::migrate::from_base::can_migrate_from_base target = phd_framework::test_vm
632026-10-17T05:31:22.825ZINFOphd-runner: [NEW - EVENT] phd_framework::test_vm environment = EnvironmentSpec { location: Local, propolis_artifact: "__BASE_PROPOLIS", metrics: None } file = phd-tests/framework/src/test_vm/mod.rs guest_os_kind = Alpine line = 318 path = phd_tests::migrate::from_base::can_migrate_from_base target = phd_framework::test_vm vm_name = migration_from_base
642026-10-17T05:31:22.825ZDEBGphd-runner: [NEW - EVENT] Verified artifact already exists file = phd-tests/framework/src/artifacts/store.rs line = 45 path = /phd-artifacts/739eeb04a4728b2e7609b038a587b5de0d939c2a02cf61882a60d42a6ba676e1/propolis-server target = phd_framework::artifacts::store
652026-10-17T05:31:22.825ZINFOphd-runner: [NEW - EVENT] Launching Propolis server bootrom_path = "/phd-artifacts/740187046a7267d0de72d3455070333547dbc0ea023531471fb2b2a61effa448/OVMF_CODE.fd" file = phd-tests/framework/src/test_vm/server.rs line = 66 path = phd_tests::migrate::from_base::can_migrate_from_base server_addr = 127.0.0.1:9000 server_path = "/phd-artifacts/739eeb04a4728b2e7609b038a587b5de0d939c2a02cf61882a60d42a6ba676e1/propolis-server" target = phd_framework::test_vm::server
662026-10-17T05:31:22.825ZINFOphd-runner: [NEW - EVENT] Opening server log files file = phd-tests/framework/src/log_config.rs line = 84 path = phd_tests::migrate::from_base::can_migrate_from_base stderr_path = "/tmp/propolis-phd/phd_tests::migrate::from_base::can_migrate_from_base/migration_from_base.stderr.log" stdout_path = "/tmp/propolis-phd/phd_tests::migrate::from_base::can_migrate_from_base/migration_from_base.stdout.log" target = phd_framework::log_config
672026-10-17T05:31:22.880ZINFOphd-runner: [NEW - EVENT] Launched server with pid 925 file = phd-tests/framework/src/test_vm/server.rs line = 127 path = phd_tests::migrate::from_base::can_migrate_from_base target = phd_framework::test_vm::server
682026-10-17T05:31:22.894ZINFOphd-runner: [NEW - END] elapsed_milliseconds = 69 file = phd-tests/framework/src/test_vm/mod.rs line = 300 path = phd_tests::migrate::from_base::can_migrate_from_base target = phd_framework::test_vm
692026-10-17T05:31:22.894ZINFOphd-runner: [INSTANCE_ENSURE_INTERNAL - START] file = phd-tests/framework/src/test_vm/mod.rs line = 412 path = phd_tests::migrate::from_base::can_migrate_from_base target = phd_framework::test_vm vm = migration_from_base vm_id = 3b1bbc53-ed33-49b2-beec-7189d329f240
702026-10-17T05:31:22.895ZINFOphd-runner: [INSTANCE_ENSURE_INTERNAL - EVENT] retriable error from instance_spec_ensure e = Communication Error: error sending request for url (http://127.0.0.1:9000/instance) file = phd-tests/framework/src/test_vm/mod.rs line = 455 path = phd_tests::migrate::from_base::can_migrate_from_base target = phd_framework::test_vm vm = migration_from_base vm_id = 3b1bbc53-ed33-49b2-beec-7189d329f240
712026-10-17T05:31:23.307ZERROphd-runner: [INSTANCE_ENSURE_INTERNAL - EVENT] permanent error from instance_spec_ensure e = Error Response: status: 400 Bad Request; headers: {"content-type": "application/json", "x-request-id": "3a1a5fee-d4f9-4bac-a032-344d1fbb901c", "content-length": "122", "date": "Sat, 17 Oct 2026 05:31:23 GMT"}; value: Error { error_code: None, message: "server does not support this API version: 7.0.0", request_id: "3a1a5fee-d4f9-4bac-a032-344d1fbb901c" } file = phd-tests/framework/src/test_vm/mod.rs line = 459 path = phd_tests::migrate::from_base::can_migrate_from_base target = phd_framework::test_vm vm = migration_from_base vm_id = 3b1bbc53-ed33-49b2-beec-7189d329f240
722026-10-17T05:31:23.307ZDEBGphd-runner: [TEST - EVENT] Killing Propolis server process file = phd-tests/framework/src/test_vm/server.rs line = 177 path = phd_tests::migrate::from_base::can_migrate_from_base self.address = 127.0.0.1:9000 target = phd_framework::test_vm::server
732026-10-17T05:31:23.319ZDEBGphd-runner: [TEST - EVENT] zfs clone dropped file = phd-tests/framework/src/zfs.rs line = 83 path = phd_tests::migrate::from_base::can_migrate_from_base target = phd_framework::zfs
742026-10-17T05:31:23.319ZDEBGphd-runner: [TEST - EVENT] executing ZFS command args = ["phd-artifacts/phd-clone-f1f438f2-2076-4a3c-bb29-522fb97499f5"] file = phd-tests/framework/src/zfs.rs line = 304 path = phd_tests::migrate::from_base::can_migrate_from_base target = phd_framework::zfs verb = destroy
752026-10-17T05:31:23.352ZDEBGphd-runner: [TEST - EVENT] zfs snapshot dropped file = phd-tests/framework/src/zfs.rs line = 57 path = phd_tests::migrate::from_base::can_migrate_from_base target = phd_framework::zfs
762026-10-17T05:31:23.352ZDEBGphd-runner: [TEST - EVENT] executing ZFS command args = ["phd-artifacts@phd-15f2338a-e680-4247-9aee-82d59017720c"] file = phd-tests/framework/src/zfs.rs line = 304 path = phd_tests::migrate::from_base::can_migrate_from_base target = phd_framework::zfs verb = destroy
772026-10-17T05:31:23.373ZINFOphd-runner: [INSTANCE_ENSURE_INTERNAL - END] elapsed_milliseconds = 478 file = phd-tests/framework/src/test_vm/mod.rs line = 412 path = phd_tests::migrate::from_base::can_migrate_from_base target = phd_framework::test_vm vm = migration_from_base vm_id = 3b1bbc53-ed33-49b2-beec-7189d329f240
782026-10-17T05:31:23.373ZINFOphd-runner: [TEST - END] elapsed_milliseconds = 605 file = phd-tests/tests/src/migrate.rs line = 34 path = phd_tests::migrate::from_base::can_migrate_from_base target = phd_tests::migrate::from_base
792026-10-17T05:31:23.374ZINFOphd-runner: test phd_tests::migrate::from_base::can_migrate_from_base ... FAILED: Error Response: status: 400 Bad Request; headers: {"content-type": "application/json", "x-request-id": "3a1a5fee-d4f9-4bac-a032-344d1fbb901c", "content-length": "122", "date": "Sat, 17 Oct 2026 05:31:23 GMT"}; value: Error { error_code: None, message: "server does not support this API version: 7.0.0", request_id: "3a1a5fee-d4f9-4bac-a032-344d1fbb901c" } Stack backtrace: 0: <anyhow::Error as core::convert::From<progenitor_client::progenitor_client::Error<propolis_client::types::Error>>>::from at /home/build/.cargo/registry/src/index.crates.io-1949cf8c6b5b557f/anyhow-1.0.104/src/backtrace.rs:10:14 1: <core::result::Result<phd_framework::serial::SerialConsole, anyhow::Error> as core::ops::try_trait::FromResidual<core::result::Result<core::convert::Infallible, progenitor_client::progenitor_client::Error<propolis_client::types::Error>>>>::from_residual at /rustc/8bab26f4f68e0e26f0bb7960be334d5b520ea452/library/core/src/result.rs:2189:27 2: <phd_framework::test_vm::TestVm>::instance_ensure_internal::{closure#0}::{closure#0} at ./oxidecomputer/propolis/phd-tests/framework/src/test_vm/mod.rs:471:9 3: <tracing::instrument::Instrumented<<phd_framework::test_vm::TestVm>::instance_ensure_internal::{closure#0}::{closure#0}> as core::future::future::Future>::poll at /home/build/.cargo/registry/src/index.crates.io-1949cf8c6b5b557f/tracing-0.1.40/src/instrument.rs:321:15 4: <phd_framework::test_vm::TestVm>::instance_ensure_internal::{closure#0} at ./oxidecomputer/propolis/phd-tests/framework/src/test_vm/mod.rs:412:5 5: <phd_framework::test_vm::TestVm>::instance_ensure::{closure#0} at ./oxidecomputer/propolis/phd-tests/framework/src/test_vm/mod.rs:549:22 6: <phd_framework::test_vm::TestVm>::launch::{closure#0} at ./oxidecomputer/propolis/phd-tests/framework/src/test_vm/mod.rs:537:32 7: phd_tests::migrate::run_smoke_test::{closure#0} at ./oxidecomputer/propolis/phd-tests/tests/src/migrate.rs:322:21 8: phd_tests::migrate::from_base::can_migrate_from_base::{closure#0}::{closure#0} at ./oxidecomputer/propolis/phd-tests/tests/src/migrate.rs:37:14 9: <tracing::instrument::Instrumented<phd_tests::migrate::from_base::can_migrate_from_base::{closure#0}::{closure#0}> as core::future::future::Future>::poll at /home/build/.cargo/registry/src/index.crates.io-1949cf8c6b5b557f/tracing-0.1.40/src/instrument.rs:321:15 10: phd_tests::migrate::from_base::can_migrate_from_base::{closure#0} at ./oxidecomputer/propolis/phd-tests/tests/src/migrate.rs:34:5 11: <core::pin::Pin<alloc::boxed::Box<dyn core::future::future::Future<Output = phd_testcase::TestOutcome> + core::marker::Send>> as core::future::future::Future>::poll at /rustc/8bab26f4f68e0e26f0bb7960be334d5b520ea452/library/core/src/future/future.rs:133:9 12: <phd_testcase::TestCase>::run::{closure#0} at ./oxidecomputer/propolis/phd-tests/testcase/src/lib.rs:79:32 13: phd_runner::execute::run_tests_with_ctx::{closure#0}::{closure#0}::{closure#0} at /home/build/.cargo/registry/src/index.crates.io-1949cf8c6b5b557f/tokio-1.52.3/src/macros/select.rs:705:49 14: <core::future::poll_fn::PollFn<phd_runner::execute::run_tests_with_ctx::{closure#0}::{closure#0}::{closure#0}> as core::future::future::Future>::poll at /rustc/8bab26f4f68e0e26f0bb7960be334d5b520ea452/library/core/src/future/poll_fn.rs:151:9 15: phd_runner::execute::run_tests_with_ctx::{closure#0}::{closure#0} at ./oxidecomputer/propolis/phd-tests/runner/src/execute.rs:117:13 16: <tokio::runtime::task::core::Core<phd_runner::execute::run_tests_with_ctx::{closure#0}::{closure#0}, alloc::sync::Arc<tokio::runtime::scheduler::multi_thread::handle::Handle>>>::poll::{closure#0} at /home/build/.cargo/registry/src/index.crates.io-1949cf8c6b5b557f/tokio-1.52.3/src/runtime/task/core.rs:375:24 17: <tokio::loom::std::unsafe_cell::UnsafeCell<tokio::runtime::task::core::Stage<phd_runner::execute::run_tests_with_ctx::{closure#0}::{closure#0}>>>::with_mut::<core::task::poll::Poll<phd_testcase::TestOutcome>, <tokio::runtime::task::core::Core<phd_runner::execute::run_tests_with_ctx::{closure#0}::{closure#0}, alloc::sync::Arc<tokio::runtime::scheduler::multi_thread::handle::Handle>>>::poll::{closure#0}> at /home/build/.cargo/registry/src/index.crates.io-1949cf8c6b5b557f/tokio-1.52.3/src/loom/std/unsafe_cell.rs:16:9 18: <tokio::runtime::task::core::Core<phd_runner::execute::run_tests_with_ctx::{closure#0}::{closure#0}, alloc::sync::Arc<tokio::runtime::scheduler::multi_thread::handle::Handle>>>::poll at /home/build/.cargo/registry/src/index.crates.io-1949cf8c6b5b557f/tokio-1.52.3/src/runtime/task/core.rs:364:30 19: tokio::runtime::task::harness::poll_future::<phd_runner::execute::run_tests_with_ctx::{closure#0}::{closure#0}, alloc::sync::Arc<tokio::runtime::scheduler::multi_thread::handle::Handle>>::{closure#0} at /home/build/.cargo/registry/src/index.crates.io-1949cf8c6b5b557f/tokio-1.52.3/src/runtime/task/harness.rs:535:30 20: <core::panic::unwind_safe::AssertUnwindSafe<tokio::runtime::task::harness::poll_future<phd_runner::execute::run_tests_with_ctx::{closure#0}::{closure#0}, alloc::sync::Arc<tokio::runtime::scheduler::multi_thread::handle::Handle>>::{closure#0}> as core::ops::function::FnOnce<()>>::call_once at /rustc/8bab26f4f68e0e26f0bb7960be334d5b520ea452/library/core/src/panic/unwind_safe.rs:275:9 21: std::panicking::catch_unwind::do_call::<core::panic::unwind_safe::AssertUnwindSafe<tokio::runtime::task::harness::poll_future<phd_runner::execute::run_tests_with_ctx::{closure#0}::{closure#0}, alloc::sync::Arc<tokio::runtime::scheduler::multi_thread::handle::Handle>>::{closure#0}>, core::task::poll::Poll<phd_testcase::TestOutcome>> at /rustc/8bab26f4f68e0e26f0bb7960be334d5b520ea452/library/std/src/panicking.rs:581:40 22: __rust_try 23: std::panicking::catch_unwind::<core::task::poll::Poll<phd_testcase::TestOutcome>, core::panic::unwind_safe::AssertUnwindSafe<tokio::runtime::task::harness::poll_future<phd_runner::execute::run_tests_with_ctx::{closure#0}::{closure#0}, alloc::sync::Arc<tokio::runtime::scheduler::multi_thread::handle::Handle>>::{closure#0}>> at /rustc/8bab26f4f68e0e26f0bb7960be334d5b520ea452/library/std/src/panicking.rs:544:19 24: std::panic::catch_unwind::<core::panic::unwind_safe::AssertUnwindSafe<tokio::runtime::task::harness::poll_future<phd_runner::execute::run_tests_with_ctx::{closure#0}::{closure#0}, alloc::sync::Arc<tokio::runtime::scheduler::multi_thread::handle::Handle>>::{closure#0}>, core::task::poll::Poll<phd_testcase::TestOutcome>> at /rustc/8bab26f4f68e0e26f0bb7960be334d5b520ea452/library/std/src/panic.rs:359:14 25: tokio::runtime::task::harness::poll_future::<phd_runner::execute::run_tests_with_ctx::{closure#0}::{closure#0}, alloc::sync::Arc<tokio::runtime::scheduler::multi_thread::handle::Handle>> at /home/build/.cargo/registry/src/index.crates.io-1949cf8c6b5b557f/tokio-1.52.3/src/runtime/task/harness.rs:523:18 26: <tokio::runtime::task::harness::Harness<phd_runner::execute::run_tests_with_ctx::{closure#0}::{closure#0}, alloc::sync::Arc<tokio::runtime::scheduler::multi_thread::handle::Handle>>>::poll_inner at /home/build/.cargo/registry/src/index.crates.io-1949cf8c6b5b557f/tokio-1.52.3/src/runtime/task/harness.rs:210:27 27: <tokio::runtime::task::harness::Harness<phd_runner::execute::run_tests_with_ctx::{closure#0}::{closure#0}, alloc::sync::Arc<tokio::runtime::scheduler::multi_thread::handle::Handle>>>::poll at /home/build/.cargo/registry/src/index.crates.io-1949cf8c6b5b557f/tokio-1.52.3/src/runtime/task/harness.rs:155:20 28: tokio::runtime::task::raw::poll::<phd_runner::execute::run_tests_with_ctx::{closure#0}::{closure#0}, alloc::sync::Arc<tokio::runtime::scheduler::multi_thread::handle::Handle>> at /home/build/.cargo/registry/src/index.crates.io-1949cf8c6b5b557f/tokio-1.52.3/src/runtime/task/raw.rs:337:13 29: <tokio::runtime::task::raw::RawTask>::poll at /home/build/.cargo/registry/src/index.crates.io-1949cf8c6b5b557f/tokio-1.52.3/src/runtime/task/raw.rs:267:18 30: <tokio::runtime::task::LocalNotified<alloc::sync::Arc<tokio::runtime::scheduler::multi_thread::handle::Handle>>>::run at /home/build/.cargo/registry/src/index.crates.io-1949cf8c6b5b557f/tokio-1.52.3/src/runtime/task/mod.rs:510:13 31: <tokio::runtime::scheduler::multi_thread::worker::Context>::run_task::{closure#0} at /home/build/.cargo/registry/src/index.crates.io-1949cf8c6b5b557f/tokio-1.52.3/src/runtime/scheduler/multi_thread/worker.rs:761:22 32: tokio::task::coop::with_budget::<core::result::Result<alloc::boxed::Box<tokio::runtime::scheduler::multi_thread::worker::Core>, ()>, <tokio::runtime::scheduler::multi_thread::worker::Context>::run_task::{closure#0}> at /home/build/.cargo/registry/src/index.crates.io-1949cf8c6b5b557f/tokio-1.52.3/src/task/coop/mod.rs:167:5 33: tokio::task::coop::budget::<core::result::Result<alloc::boxed::Box<tokio::runtime::scheduler::multi_thread::worker::Core>, ()>, <tokio::runtime::scheduler::multi_thread::worker::Context>::run_task::{closure#0}> at /home/build/.cargo/registry/src/index.crates.io-1949cf8c6b5b557f/tokio-1.52.3/src/task/coop/mod.rs:133:5 34: <tokio::runtime::scheduler::multi_thread::worker::Context>::run_task at /home/build/.cargo/registry/src/index.crates.io-1949cf8c6b5b557f/tokio-1.52.3/src/runtime/scheduler/multi_thread/worker.rs:675:9 35: <tokio::runtime::scheduler::multi_thread::worker::Context>::run at /home/build/.cargo/registry/src/index.crates.io-1949cf8c6b5b557f/tokio-1.52.3/src/runtime/scheduler/multi_thread/worker.rs:585:29 36: tokio::runtime::scheduler::multi_thread::worker::run::{closure#0}::{closure#0} at /home/build/.cargo/registry/src/index.crates.io-1949cf8c6b5b557f/tokio-1.52.3/src/runtime/scheduler/multi_thread/worker.rs:550:24 37: <tokio::runtime::context::scoped::Scoped<tokio::runtime::scheduler::Context>>::set::<tokio::runtime::scheduler::multi_thread::worker::run::{closure#0}::{closure#0}, ()> at /home/build/.cargo/registry/src/index.crates.io-1949cf8c6b5b557f/tokio-1.52.3/src/runtime/context/scoped.rs:40:9 38: tokio::runtime::context::set_scheduler::<(), tokio::runtime::scheduler::multi_thread::worker::run::{closure#0}::{closure#0}>::{closure#0} at /home/build/.cargo/registry/src/index.crates.io-1949cf8c6b5b557f/tokio-1.52.3/src/runtime/context.rs:181:38 39: <std::thread::local::LocalKey<tokio::runtime::context::Context>>::try_with::<tokio::runtime::context::set_scheduler<(), tokio::runtime::scheduler::multi_thread::worker::run::{closure#0}::{closure#0}>::{closure#0}, ()> at /rustc/8bab26f4f68e0e26f0bb7960be334d5b520ea452/library/std/src/thread/local.rs:462:12 40: <std::thread::local::LocalKey<tokio::runtime::context::Context>>::with::<tokio::runtime::context::set_scheduler<(), tokio::runtime::scheduler::multi_thread::worker::run::{closure#0}::{closure#0}>::{closure#0}, ()> at /rustc/8bab26f4f68e0e26f0bb7960be334d5b520ea452/library/std/src/thread/local.rs:426:20 41: tokio::runtime::context::set_scheduler::<(), tokio::runtime::scheduler::multi_thread::worker::run::{closure#0}::{closure#0}> at /home/build/.cargo/registry/src/index.crates.io-1949cf8c6b5b557f/tokio-1.52.3/src/runtime/context.rs:181:17 42: tokio::runtime::scheduler::multi_thread::worker::run::{closure#0} at /home/build/.cargo/registry/src/index.crates.io-1949cf8c6b5b557f/tokio-1.52.3/src/runtime/scheduler/multi_thread/worker.rs:545:9 43: tokio::runtime::context::runtime::enter_runtime::<tokio::runtime::scheduler::multi_thread::worker::run::{closure#0}, ()> at /home/build/.cargo/registry/src/index.crates.io-1949cf8c6b5b557f/tokio-1.52.3/src/runtime/context/runtime.rs:65:16 44: tokio::runtime::scheduler::multi_thread::worker::run at /home/build/.cargo/registry/src/index.crates.io-1949cf8c6b5b557f/tokio-1.52.3/src/runtime/scheduler/multi_thread/worker.rs:537:5 45: <tokio::runtime::scheduler::multi_thread::worker::Launch>::launch::{closure#0} at /home/build/.cargo/registry/src/index.crates.io-1949cf8c6b5b557f/tokio-1.52.3/src/runtime/scheduler/multi_thread/worker.rs:503:45 46: <tokio::runtime::blocking::task::BlockingTask<<tokio::runtime::scheduler::multi_thread::worker::Launch>::launch::{closure#0}> as core::future::future::Future>::poll at /home/build/.cargo/registry/src/index.crates.io-1949cf8c6b5b557f/tokio-1.52.3/src/runtime/blocking/task.rs:42:21 47: <tokio::runtime::task::core::Core<tokio::runtime::blocking::task::BlockingTask<<tokio::runtime::scheduler::multi_thread::worker::Launch>::launch::{closure#0}>, tokio::runtime::blocking::schedule::BlockingSchedule>>::poll::{closure#0} at /home/build/.cargo/registry/src/index.crates.io-1949cf8c6b5b557f/tokio-1.52.3/src/runtime/task/core.rs:375:24 48: <tokio::loom::std::unsafe_cell::UnsafeCell<tokio::runtime::task::core::Stage<tokio::runtime::blocking::task::BlockingTask<<tokio::runtime::scheduler::multi_thread::worker::Launch>::launch::{closure#0}>>>>::with_mut::<core::task::poll::Poll<()>, <tokio::runtime::task::core::Core<tokio::runtime::blocking::task::BlockingTask<<tokio::runtime::scheduler::multi_thread::worker::Launch>::launch::{closure#0}>, tokio::runtime::blocking::schedule::BlockingSchedule>>::poll::{closure#0}> at /home/build/.cargo/registry/src/index.crates.io-1949cf8c6b5b557f/tokio-1.52.3/src/loom/std/unsafe_cell.rs:16:9 49: <tokio::runtime::task::core::Core<tokio::runtime::blocking::task::BlockingTask<<tokio::runtime::scheduler::multi_thread::worker::Launch>::launch::{closure#0}>, tokio::runtime::blocking::schedule::BlockingSchedule>>::poll at /home/build/.cargo/registry/src/index.crates.io-1949cf8c6b5b557f/tokio-1.52.3/src/runtime/task/core.rs:364:30 50: tokio::runtime::task::harness::poll_future::<tokio::runtime::blocking::task::BlockingTask<<tokio::runtime::scheduler::multi_thread::worker::Launch>::launch::{closure#0}>, tokio::runtime::blocking::schedule::BlockingSchedule>::{closure#0} at /home/build/.cargo/registry/src/index.crates.io-1949cf8c6b5b557f/tokio-1.52.3/src/runtime/task/harness.rs:535:30 51: <core::panic::unwind_safe::AssertUnwindSafe<tokio::runtime::task::harness::poll_future<tokio::runtime::blocking::task::BlockingTask<<tokio::runtime::scheduler::multi_thread::worker::Launch>::launch::{closure#0}>, tokio::runtime::blocking::schedule::BlockingSchedule>::{closure#0}> as core::ops::function::FnOnce<()>>::call_once at /rustc/8bab26f4f68e0e26f0bb7960be334d5b520ea452/library/core/src/panic/unwind_safe.rs:275:9 52: std::panicking::catch_unwind::do_call::<core::panic::unwind_safe::AssertUnwindSafe<tokio::runtime::task::harness::poll_future<tokio::runtime::blocking::task::BlockingTask<<tokio::runtime::scheduler::multi_thread::worker::Launch>::launch::{closure#0}>, tokio::runtime::blocking::schedule::BlockingSchedule>::{closure#0}>, core::task::poll::Poll<()>> at /rustc/8bab26f4f68e0e26f0bb7960be334d5b520ea452/library/std/src/panicking.rs:581:40 53: __rust_try 54: std::panicking::catch_unwind::<core::task::poll::Poll<()>, core::panic::unwind_safe::AssertUnwindSafe<tokio::runtime::task::harness::poll_future<tokio::runtime::blocking::task::BlockingTask<<tokio::runtime::scheduler::multi_thread::worker::Launch>::launch::{closure#0}>, tokio::runtime::blocking::schedule::BlockingSchedule>::{closure#0}>> at /rustc/8bab26f4f68e0e26f0bb7960be334d5b520ea452/library/std/src/panicking.rs:544:19 55: std::panic::catch_unwind::<core::panic::unwind_safe::AssertUnwindSafe<tokio::runtime::task::harness::poll_future<tokio::runtime::blocking::task::BlockingTask<<tokio::runtime::scheduler::multi_thread::worker::Launch>::launch::{closure#0}>, tokio::runtime::blocking::schedule::BlockingSchedule>::{closure#0}>, core::task::poll::Poll<()>> at /rustc/8bab26f4f68e0e26f0bb7960be334d5b520ea452/library/std/src/panic.rs:359:14 56: tokio::runtime::task::harness::poll_future::<tokio::runtime::blocking::task::BlockingTask<<tokio::runtime::scheduler::multi_thread::worker::Launch>::launch::{closure#0}>, tokio::runtime::blocking::schedule::BlockingSchedule> at /home/build/.cargo/registry/src/index.crates.io-1949cf8c6b5b557f/tokio-1.52.3/src/runtime/task/harness.rs:523:18 57: <tokio::runtime::task::harness::Harness<tokio::runtime::blocking::task::BlockingTask<<tokio::runtime::scheduler::multi_thread::worker::Launch>::launch::{closure#0}>, tokio::runtime::blocking::schedule::BlockingSchedule>>::poll_inner at /home/build/.cargo/registry/src/index.crates.io-1949cf8c6b5b557f/tokio-1.52.3/src/runtime/task/harness.rs:210:27 58: <tokio::runtime::task::harness::Harness<tokio::runtime::blocking::task::BlockingTask<<tokio::runtime::scheduler::multi_thread::worker::Launch>::launch::{closure#0}>, tokio::runtime::blocking::schedule::BlockingSchedule>>::poll at /home/build/.cargo/registry/src/index.crates.io-1949cf8c6b5b557f/tokio-1.52.3/src/runtime/task/harness.rs:155:20 59: tokio::runtime::task::raw::poll::<tokio::runtime::blocking::task::BlockingTask<<tokio::runtime::scheduler::multi_thread::worker::Launch>::launch::{closure#0}>, tokio::runtime::blocking::schedule::BlockingSchedule> at /home/build/.cargo/registry/src/index.crates.io-1949cf8c6b5b557f/tokio-1.52.3/src/runtime/task/raw.rs:337:13 60: <tokio::runtime::task::raw::RawTask>::poll at /home/build/.cargo/registry/src/index.crates.io-1949cf8c6b5b557f/tokio-1.52.3/src/runtime/task/raw.rs:267:18 61: <tokio::runtime::task::UnownedTask<tokio::runtime::blocking::schedule::BlockingSchedule>>::run at /home/build/.cargo/registry/src/index.crates.io-1949cf8c6b5b557f/tokio-1.52.3/src/runtime/task/mod.rs:547:13 62: <tokio::runtime::blocking::pool::Task>::run at /home/build/.cargo/registry/src/index.crates.io-1949cf8c6b5b557f/tokio-1.52.3/src/runtime/blocking/pool.rs:161:19 63: <tokio::runtime::blocking::pool::Inner>::run at /home/build/.cargo/registry/src/index.crates.io-1949cf8c6b5b557f/tokio-1.52.3/src/runtime/blocking/pool.rs:518:22 64: <tokio::runtime::blocking::pool::Spawner>::spawn_thread::{closure#0} at /home/build/.cargo/registry/src/index.crates.io-1949cf8c6b5b557f/tokio-1.52.3/src/runtime/blocking/pool.rs:474:47 65: std::sys::backtrace::__rust_begin_short_backtrace::<<tokio::runtime::blocking::pool::Spawner>::spawn_thread::{closure#0}, ()> at /rustc/8bab26f4f68e0e26f0bb7960be334d5b520ea452/library/std/src/sys/backtrace.rs:166:18 66: std::thread::lifecycle::spawn_unchecked::<<tokio::runtime::blocking::pool::Spawner>::spawn_thread::{closure#0}, ()>::{closure#1}::{closure#0} at /rustc/8bab26f4f68e0e26f0bb7960be334d5b520ea452/library/std/src/thread/lifecycle.rs:70:13 67: <core::panic::unwind_safe::AssertUnwindSafe<std::thread::lifecycle::spawn_unchecked<<tokio::runtime::blocking::pool::Spawner>::spawn_thread::{closure#0}, ()>::{closure#1}::{closure#0}> as core::ops::function::FnOnce<()>>::call_once at /rustc/8bab26f4f68e0e26f0bb7960be334d5b520ea452/library/core/src/panic/unwind_safe.rs:275:9 68: std::panicking::catch_unwind::do_call::<core::panic::unwind_safe::AssertUnwindSafe<std::thread::lifecycle::spawn_unchecked<<tokio::runtime::blocking::pool::Spawner>::spawn_thread::{closure#0}, ()>::{closure#1}::{closure#0}>, ()> at /rustc/8bab26f4f68e0e26f0bb7960be334d5b520ea452/library/std/src/panicking.rs:581:40 69: __rust_try 70: std::panicking::catch_unwind::<(), core::panic::unwind_safe::AssertUnwindSafe<std::thread::lifecycle::spawn_unchecked<<tokio::runtime::blocking::pool::Spawner>::spawn_thread::{closure#0}, ()>::{closure#1}::{closure#0}>> at /rustc/8bab26f4f68e0e26f0bb7960be334d5b520ea452/library/std/src/panicking.rs:544:19 71: std::panic::catch_unwind::<core::panic::unwind_safe::AssertUnwindSafe<std::thread::lifecycle::spawn_unchecked<<tokio::runtime::blocking::pool::Spawner>::spawn_thread::{closure#0}, ()>::{closure#1}::{closure#0}>, ()> at /rustc/8bab26f4f68e0e26f0bb7960be334d5b520ea452/library/std/src/panic.rs:359:14 72: std::thread::lifecycle::spawn_unchecked::<<tokio::runtime::blocking::pool::Spawner>::spawn_thread::{closure#0}, ()>::{closure#1} at /rustc/8bab26f4f68e0e26f0bb7960be334d5b520ea452/library/std/src/thread/lifecycle.rs:68:26 73: <std::thread::lifecycle::spawn_unchecked<<tokio::runtime::blocking::pool::Spawner>::spawn_thread::{closure#0}, ()>::{closure#1} as core::ops::function::FnOnce<()>>::call_once::{shim:vtable#0} at /rustc/8bab26f4f68e0e26f0bb7960be334d5b520ea452/library/core/src/ops/function.rs:250:5 74: <alloc::boxed::Box<dyn core::ops::function::FnOnce<(), Output = ()> + core::marker::Send> as core::ops::function::FnOnce<()>>::call_once at /rustc/8bab26f4f68e0e26f0bb7960be334d5b520ea452/library/alloc/src/boxed.rs:2275:9 75: <std::sys::thread::unix::Thread>::new::thread_start at /rustc/8bab26f4f68e0e26f0bb7960be334d5b520ea452/library/std/src/sys/thread/unix.rs:118:17 76: _thrp_setup 77: <unknown> file = phd-tests/runner/src/execute.rs line = 141 target = phd_runner::execute
802026-10-17T05:31:23.374ZINFOphd-runner: [TEST_CLEANUP - START] file = phd-tests/runner/src/fixtures.rs line = 51 target = phd_runner::fixtures
812026-10-17T05:31:23.374ZINFOphd-runner: [TEST_CLEANUP - END] elapsed_milliseconds = 0 file = phd-tests/runner/src/fixtures.rs line = 51 target = phd_runner::fixtures
822026-10-17T05:31:23.374ZINFOphd-runner: Starting test phd_tests::migrate::from_base::migration_from_base_and_back file = phd-tests/runner/src/execute.rs line = 91 target = phd_runner::execute
832026-10-17T05:31:23.374ZINFOphd-runner: [TEST_SETUP - START] file = phd-tests/runner/src/fixtures.rs line = 41 target = phd_runner::fixtures
842026-10-17T05:31:23.374ZINFOphd-runner: [TEST_SETUP - END] elapsed_milliseconds = 0 file = phd-tests/runner/src/fixtures.rs line = 41 target = phd_runner::fixtures
852026-10-17T05:31:23.374ZINFOphd-runner: [TEST - START] file = phd-tests/tests/src/migrate.rs line = 52 path = phd_tests::migrate::from_base::migration_from_base_and_back target = phd_tests::migrate::from_base
862026-10-17T05:31:23.375ZDEBGphd-runner: [TEST - EVENT] Verified artifact already exists file = phd-tests/framework/src/artifacts/store.rs line = 45 path = /phd-artifacts/740187046a7267d0de72d3455070333547dbc0ea023531471fb2b2a61effa448/OVMF_CODE.fd target = phd_framework::artifacts::store
872026-10-17T05:31:23.375ZDEBGphd-runner: [TEST - EVENT] Verified artifact already exists file = phd-tests/framework/src/artifacts/store.rs line = 45 path = /phd-artifacts/ba8007f74f9b54fbae3b2520da577831b4834778a498d732f091260c61aa7ca1/alpine.iso target = phd_framework::artifacts::store
882026-10-17T05:31:23.375ZDEBGphd-runner: [TEST - EVENT] Verified artifact already exists file = phd-tests/framework/src/artifacts/store.rs line = 45 path = /phd-artifacts/ba8007f74f9b54fbae3b2520da577831b4834778a498d732f091260c61aa7ca1/alpine.iso target = phd_framework::artifacts::store
892026-10-17T05:31:23.375ZDEBGphd-runner: [TEST - EVENT] executing ZFS command args = ["/phd-artifacts/ba8007f74f9b54fbae3b2520da577831b4834778a498d732f091260c61aa7ca1/alpine.iso"] file = phd-tests/framework/src/zfs.rs line = 304 path = phd_tests::migrate::from_base::migration_from_base_and_back target = phd_framework::zfs verb = list
902026-10-17T05:31:23.385ZDEBGphd-runner: [TEST - EVENT] parsing zfs list output file = phd-tests/framework/src/zfs.rs line = 238 path = phd_tests::migrate::from_base::migration_from_base_and_back stdout = NAME USED AVAIL REFER MOUNTPOINT\nphd-artifacts 1.31G 25.3T 1.31G /phd-artifacts\n target = phd_framework::zfs
912026-10-17T05:31:23.385ZDEBGphd-runner: [TEST - EVENT] executing ZFS command args = ["phd-artifacts@phd-1e3a3e56-1de6-4968-9086-db159c2188a8"] file = phd-tests/framework/src/zfs.rs line = 304 path = phd_tests::migrate::from_base::migration_from_base_and_back target = phd_framework::zfs verb = snapshot
922026-10-17T05:31:23.402ZDEBGphd-runner: [TEST - EVENT] executing ZFS command args = ["phd-artifacts@phd-1e3a3e56-1de6-4968-9086-db159c2188a8", "phd-artifacts/phd-clone-3b93967b-6dac-4578-8d71-58e05aa3a35d"] file = phd-tests/framework/src/zfs.rs line = 304 path = phd_tests::migrate::from_base::migration_from_base_and_back target = phd_framework::zfs verb = clone
932026-10-17T05:31:23.420ZDEBGphd-runner: [TEST - EVENT] executing ZFS command args = ["phd-artifacts/phd-clone-3b93967b-6dac-4578-8d71-58e05aa3a35d"] file = phd-tests/framework/src/zfs.rs line = 304 path = phd_tests::migrate::from_base::migration_from_base_and_back target = phd_framework::zfs verb = list
942026-10-17T05:31:23.432ZDEBGphd-runner: [TEST - EVENT] parsing zfs list output file = phd-tests/framework/src/zfs.rs line = 238 path = phd_tests::migrate::from_base::migration_from_base_and_back stdout = NAME USED AVAIL REFER MOUNTPOINT\nphd-artifacts/phd-clone-3b93967b-6dac-4578-8d71-58e05aa3a35d 0B 25.3T 1.31G /phd-artifacts/phd-clone-3b93967b-6dac-4578-8d71-58e05aa3a35d\n target = phd_framework::zfs
952026-10-17T05:31:23.432ZINFOphd-runner: [NEW - START] file = phd-tests/framework/src/test_vm/mod.rs line = 300 path = phd_tests::migrate::from_base::migration_from_base_and_back target = phd_framework::test_vm
962026-10-17T05:31:23.432ZINFOphd-runner: [NEW - EVENT] phd_framework::test_vm environment = EnvironmentSpec { location: Local, propolis_artifact: "__BASE_PROPOLIS", metrics: None } file = phd-tests/framework/src/test_vm/mod.rs guest_os_kind = Alpine line = 318 path = phd_tests::migrate::from_base::migration_from_base_and_back target = phd_framework::test_vm vm_name = migration_from_base_and_back
972026-10-17T05:31:23.432ZDEBGphd-runner: [NEW - EVENT] Verified artifact already exists file = phd-tests/framework/src/artifacts/store.rs line = 45 path = /phd-artifacts/739eeb04a4728b2e7609b038a587b5de0d939c2a02cf61882a60d42a6ba676e1/propolis-server target = phd_framework::artifacts::store
982026-10-17T05:31:23.433ZINFOphd-runner: [NEW - EVENT] Launching Propolis server bootrom_path = "/phd-artifacts/740187046a7267d0de72d3455070333547dbc0ea023531471fb2b2a61effa448/OVMF_CODE.fd" file = phd-tests/framework/src/test_vm/server.rs line = 66 path = phd_tests::migrate::from_base::migration_from_base_and_back server_addr = 127.0.0.1:9000 server_path = "/phd-artifacts/739eeb04a4728b2e7609b038a587b5de0d939c2a02cf61882a60d42a6ba676e1/propolis-server" target = phd_framework::test_vm::server
992026-10-17T05:31:23.433ZINFOphd-runner: [NEW - EVENT] Opening server log files file = phd-tests/framework/src/log_config.rs line = 84 path = phd_tests::migrate::from_base::migration_from_base_and_back stderr_path = "/tmp/propolis-phd/phd_tests::migrate::from_base::migration_from_base_and_back/migration_from_base_and_back.stderr.log" stdout_path = "/tmp/propolis-phd/phd_tests::migrate::from_base::migration_from_base_and_back/migration_from_base_and_back.stdout.log" target = phd_framework::log_config
1002026-10-17T05:31:23.473ZINFOphd-runner: [NEW - EVENT] Launched server with pid 933 file = phd-tests/framework/src/test_vm/server.rs line = 127 path = phd_tests::migrate::from_base::migration_from_base_and_back target = phd_framework::test_vm::server
1012026-10-17T05:31:23.487ZINFOphd-runner: [NEW - END] elapsed_milliseconds = 54 file = phd-tests/framework/src/test_vm/mod.rs line = 300 path = phd_tests::migrate::from_base::migration_from_base_and_back target = phd_framework::test_vm
1022026-10-17T05:31:23.487ZINFOphd-runner: [INSTANCE_ENSURE_INTERNAL - START] file = phd-tests/framework/src/test_vm/mod.rs line = 412 path = phd_tests::migrate::from_base::migration_from_base_and_back target = phd_framework::test_vm vm = migration_from_base_and_back vm_id = 030de639-84f7-465a-8371-bd47ffadeb8f
1032026-10-17T05:31:23.488ZINFOphd-runner: [INSTANCE_ENSURE_INTERNAL - EVENT] retriable error from instance_spec_ensure e = Communication Error: error sending request for url (http://127.0.0.1:9000/instance) file = phd-tests/framework/src/test_vm/mod.rs line = 455 path = phd_tests::migrate::from_base::migration_from_base_and_back target = phd_framework::test_vm vm = migration_from_base_and_back vm_id = 030de639-84f7-465a-8371-bd47ffadeb8f
1042026-10-17T05:31:24.062ZERROphd-runner: [INSTANCE_ENSURE_INTERNAL - EVENT] permanent error from instance_spec_ensure e = Error Response: status: 400 Bad Request; headers: {"content-type": "application/json", "x-request-id": "a463b73f-88dd-48c6-90c5-d6115b4d4383", "content-length": "122", "date": "Sat, 17 Oct 2026 05:31:24 GMT"}; value: Error { error_code: None, message: "server does not support this API version: 7.0.0", request_id: "a463b73f-88dd-48c6-90c5-d6115b4d4383" } file = phd-tests/framework/src/test_vm/mod.rs line = 459 path = phd_tests::migrate::from_base::migration_from_base_and_back target = phd_framework::test_vm vm = migration_from_base_and_back vm_id = 030de639-84f7-465a-8371-bd47ffadeb8f
1052026-10-17T05:31:24.062ZDEBGphd-runner: [TEST - EVENT] Killing Propolis server process file = phd-tests/framework/src/test_vm/server.rs line = 177 path = phd_tests::migrate::from_base::migration_from_base_and_back self.address = 127.0.0.1:9000 target = phd_framework::test_vm::server
1062026-10-17T05:31:24.076ZDEBGphd-runner: [TEST - EVENT] zfs clone dropped file = phd-tests/framework/src/zfs.rs line = 83 path = phd_tests::migrate::from_base::migration_from_base_and_back target = phd_framework::zfs
1072026-10-17T05:31:24.076ZDEBGphd-runner: [TEST - EVENT] executing ZFS command args = ["phd-artifacts/phd-clone-3b93967b-6dac-4578-8d71-58e05aa3a35d"] file = phd-tests/framework/src/zfs.rs line = 304 path = phd_tests::migrate::from_base::migration_from_base_and_back target = phd_framework::zfs verb = destroy
1082026-10-17T05:31:24.113ZDEBGphd-runner: [TEST - EVENT] zfs snapshot dropped file = phd-tests/framework/src/zfs.rs line = 57 path = phd_tests::migrate::from_base::migration_from_base_and_back target = phd_framework::zfs
1092026-10-17T05:31:24.113ZDEBGphd-runner: [TEST - EVENT] executing ZFS command args = ["phd-artifacts@phd-1e3a3e56-1de6-4968-9086-db159c2188a8"] file = phd-tests/framework/src/zfs.rs line = 304 path = phd_tests::migrate::from_base::migration_from_base_and_back target = phd_framework::zfs verb = destroy
1102026-10-17T05:31:24.132ZINFOphd-runner: [INSTANCE_ENSURE_INTERNAL - END] elapsed_milliseconds = 644 file = phd-tests/framework/src/test_vm/mod.rs line = 412 path = phd_tests::migrate::from_base::migration_from_base_and_back target = phd_framework::test_vm vm = migration_from_base_and_back vm_id = 030de639-84f7-465a-8371-bd47ffadeb8f
1112026-10-17T05:31:24.132ZINFOphd-runner: [TEST - END] elapsed_milliseconds = 757 file = phd-tests/tests/src/migrate.rs line = 52 path = phd_tests::migrate::from_base::migration_from_base_and_back target = phd_tests::migrate::from_base
1122026-10-17T05:31:24.133ZINFOphd-runner: test phd_tests::migrate::from_base::migration_from_base_and_back ... FAILED: Error Response: status: 400 Bad Request; headers: {"content-type": "application/json", "x-request-id": "a463b73f-88dd-48c6-90c5-d6115b4d4383", "content-length": "122", "date": "Sat, 17 Oct 2026 05:31:24 GMT"}; value: Error { error_code: None, message: "server does not support this API version: 7.0.0", request_id: "a463b73f-88dd-48c6-90c5-d6115b4d4383" } Stack backtrace: 0: <anyhow::Error as core::convert::From<progenitor_client::progenitor_client::Error<propolis_client::types::Error>>>::from at /home/build/.cargo/registry/src/index.crates.io-1949cf8c6b5b557f/anyhow-1.0.104/src/backtrace.rs:10:14 1: <core::result::Result<phd_framework::serial::SerialConsole, anyhow::Error> as core::ops::try_trait::FromResidual<core::result::Result<core::convert::Infallible, progenitor_client::progenitor_client::Error<propolis_client::types::Error>>>>::from_residual at /rustc/8bab26f4f68e0e26f0bb7960be334d5b520ea452/library/core/src/result.rs:2189:27 2: <phd_framework::test_vm::TestVm>::instance_ensure_internal::{closure#0}::{closure#0} at ./oxidecomputer/propolis/phd-tests/framework/src/test_vm/mod.rs:471:9 3: <tracing::instrument::Instrumented<<phd_framework::test_vm::TestVm>::instance_ensure_internal::{closure#0}::{closure#0}> as core::future::future::Future>::poll at /home/build/.cargo/registry/src/index.crates.io-1949cf8c6b5b557f/tracing-0.1.40/src/instrument.rs:321:15 4: <phd_framework::test_vm::TestVm>::instance_ensure_internal::{closure#0} at ./oxidecomputer/propolis/phd-tests/framework/src/test_vm/mod.rs:412:5 5: <phd_framework::test_vm::TestVm>::instance_ensure::{closure#0} at ./oxidecomputer/propolis/phd-tests/framework/src/test_vm/mod.rs:549:22 6: <phd_framework::test_vm::TestVm>::launch::{closure#0} at ./oxidecomputer/propolis/phd-tests/framework/src/test_vm/mod.rs:537:32 7: phd_tests::migrate::from_base::migration_from_base_and_back::{closure#0}::{closure#0} at ./oxidecomputer/propolis/phd-tests/tests/src/migrate.rs:56:25 8: <tracing::instrument::Instrumented<phd_tests::migrate::from_base::migration_from_base_and_back::{closure#0}::{closure#0}> as core::future::future::Future>::poll at /home/build/.cargo/registry/src/index.crates.io-1949cf8c6b5b557f/tracing-0.1.40/src/instrument.rs:321:15 9: phd_tests::migrate::from_base::migration_from_base_and_back::{closure#0} at ./oxidecomputer/propolis/phd-tests/tests/src/migrate.rs:52:5 10: <core::pin::Pin<alloc::boxed::Box<dyn core::future::future::Future<Output = phd_testcase::TestOutcome> + core::marker::Send>> as core::future::future::Future>::poll at /rustc/8bab26f4f68e0e26f0bb7960be334d5b520ea452/library/core/src/future/future.rs:133:9 11: <phd_testcase::TestCase>::run::{closure#0} at ./oxidecomputer/propolis/phd-tests/testcase/src/lib.rs:79:32 12: phd_runner::execute::run_tests_with_ctx::{closure#0}::{closure#0}::{closure#0} at /home/build/.cargo/registry/src/index.crates.io-1949cf8c6b5b557f/tokio-1.52.3/src/macros/select.rs:705:49 13: <core::future::poll_fn::PollFn<phd_runner::execute::run_tests_with_ctx::{closure#0}::{closure#0}::{closure#0}> as core::future::future::Future>::poll at /rustc/8bab26f4f68e0e26f0bb7960be334d5b520ea452/library/core/src/future/poll_fn.rs:151:9 14: phd_runner::execute::run_tests_with_ctx::{closure#0}::{closure#0} at ./oxidecomputer/propolis/phd-tests/runner/src/execute.rs:117:13 15: <tokio::runtime::task::core::Core<phd_runner::execute::run_tests_with_ctx::{closure#0}::{closure#0}, alloc::sync::Arc<tokio::runtime::scheduler::multi_thread::handle::Handle>>>::poll::{closure#0} at /home/build/.cargo/registry/src/index.crates.io-1949cf8c6b5b557f/tokio-1.52.3/src/runtime/task/core.rs:375:24 16: <tokio::loom::std::unsafe_cell::UnsafeCell<tokio::runtime::task::core::Stage<phd_runner::execute::run_tests_with_ctx::{closure#0}::{closure#0}>>>::with_mut::<core::task::poll::Poll<phd_testcase::TestOutcome>, <tokio::runtime::task::core::Core<phd_runner::execute::run_tests_with_ctx::{closure#0}::{closure#0}, alloc::sync::Arc<tokio::runtime::scheduler::multi_thread::handle::Handle>>>::poll::{closure#0}> at /home/build/.cargo/registry/src/index.crates.io-1949cf8c6b5b557f/tokio-1.52.3/src/loom/std/unsafe_cell.rs:16:9 17: <tokio::runtime::task::core::Core<phd_runner::execute::run_tests_with_ctx::{closure#0}::{closure#0}, alloc::sync::Arc<tokio::runtime::scheduler::multi_thread::handle::Handle>>>::poll at /home/build/.cargo/registry/src/index.crates.io-1949cf8c6b5b557f/tokio-1.52.3/src/runtime/task/core.rs:364:30 18: tokio::runtime::task::harness::poll_future::<phd_runner::execute::run_tests_with_ctx::{closure#0}::{closure#0}, alloc::sync::Arc<tokio::runtime::scheduler::multi_thread::handle::Handle>>::{closure#0} at /home/build/.cargo/registry/src/index.crates.io-1949cf8c6b5b557f/tokio-1.52.3/src/runtime/task/harness.rs:535:30 19: <core::panic::unwind_safe::AssertUnwindSafe<tokio::runtime::task::harness::poll_future<phd_runner::execute::run_tests_with_ctx::{closure#0}::{closure#0}, alloc::sync::Arc<tokio::runtime::scheduler::multi_thread::handle::Handle>>::{closure#0}> as core::ops::function::FnOnce<()>>::call_once at /rustc/8bab26f4f68e0e26f0bb7960be334d5b520ea452/library/core/src/panic/unwind_safe.rs:275:9 20: std::panicking::catch_unwind::do_call::<core::panic::unwind_safe::AssertUnwindSafe<tokio::runtime::task::harness::poll_future<phd_runner::execute::run_tests_with_ctx::{closure#0}::{closure#0}, alloc::sync::Arc<tokio::runtime::scheduler::multi_thread::handle::Handle>>::{closure#0}>, core::task::poll::Poll<phd_testcase::TestOutcome>> at /rustc/8bab26f4f68e0e26f0bb7960be334d5b520ea452/library/std/src/panicking.rs:581:40 21: __rust_try 22: std::panicking::catch_unwind::<core::task::poll::Poll<phd_testcase::TestOutcome>, core::panic::unwind_safe::AssertUnwindSafe<tokio::runtime::task::harness::poll_future<phd_runner::execute::run_tests_with_ctx::{closure#0}::{closure#0}, alloc::sync::Arc<tokio::runtime::scheduler::multi_thread::handle::Handle>>::{closure#0}>> at /rustc/8bab26f4f68e0e26f0bb7960be334d5b520ea452/library/std/src/panicking.rs:544:19 23: std::panic::catch_unwind::<core::panic::unwind_safe::AssertUnwindSafe<tokio::runtime::task::harness::poll_future<phd_runner::execute::run_tests_with_ctx::{closure#0}::{closure#0}, alloc::sync::Arc<tokio::runtime::scheduler::multi_thread::handle::Handle>>::{closure#0}>, core::task::poll::Poll<phd_testcase::TestOutcome>> at /rustc/8bab26f4f68e0e26f0bb7960be334d5b520ea452/library/std/src/panic.rs:359:14 24: tokio::runtime::task::harness::poll_future::<phd_runner::execute::run_tests_with_ctx::{closure#0}::{closure#0}, alloc::sync::Arc<tokio::runtime::scheduler::multi_thread::handle::Handle>> at /home/build/.cargo/registry/src/index.crates.io-1949cf8c6b5b557f/tokio-1.52.3/src/runtime/task/harness.rs:523:18 25: <tokio::runtime::task::harness::Harness<phd_runner::execute::run_tests_with_ctx::{closure#0}::{closure#0}, alloc::sync::Arc<tokio::runtime::scheduler::multi_thread::handle::Handle>>>::poll_inner at /home/build/.cargo/registry/src/index.crates.io-1949cf8c6b5b557f/tokio-1.52.3/src/runtime/task/harness.rs:210:27 26: <tokio::runtime::task::harness::Harness<phd_runner::execute::run_tests_with_ctx::{closure#0}::{closure#0}, alloc::sync::Arc<tokio::runtime::scheduler::multi_thread::handle::Handle>>>::poll at /home/build/.cargo/registry/src/index.crates.io-1949cf8c6b5b557f/tokio-1.52.3/src/runtime/task/harness.rs:155:20 27: tokio::runtime::task::raw::poll::<phd_runner::execute::run_tests_with_ctx::{closure#0}::{closure#0}, alloc::sync::Arc<tokio::runtime::scheduler::multi_thread::handle::Handle>> at /home/build/.cargo/registry/src/index.crates.io-1949cf8c6b5b557f/tokio-1.52.3/src/runtime/task/raw.rs:337:13 28: <tokio::runtime::task::raw::RawTask>::poll at /home/build/.cargo/registry/src/index.crates.io-1949cf8c6b5b557f/tokio-1.52.3/src/runtime/task/raw.rs:267:18 29: <tokio::runtime::task::LocalNotified<alloc::sync::Arc<tokio::runtime::scheduler::multi_thread::handle::Handle>>>::run at /home/build/.cargo/registry/src/index.crates.io-1949cf8c6b5b557f/tokio-1.52.3/src/runtime/task/mod.rs:510:13 30: <tokio::runtime::scheduler::multi_thread::worker::Context>::run_task::{closure#0} at /home/build/.cargo/registry/src/index.crates.io-1949cf8c6b5b557f/tokio-1.52.3/src/runtime/scheduler/multi_thread/worker.rs:761:22 31: tokio::task::coop::with_budget::<core::result::Result<alloc::boxed::Box<tokio::runtime::scheduler::multi_thread::worker::Core>, ()>, <tokio::runtime::scheduler::multi_thread::worker::Context>::run_task::{closure#0}> at /home/build/.cargo/registry/src/index.crates.io-1949cf8c6b5b557f/tokio-1.52.3/src/task/coop/mod.rs:167:5 32: tokio::task::coop::budget::<core::result::Result<alloc::boxed::Box<tokio::runtime::scheduler::multi_thread::worker::Core>, ()>, <tokio::runtime::scheduler::multi_thread::worker::Context>::run_task::{closure#0}> at /home/build/.cargo/registry/src/index.crates.io-1949cf8c6b5b557f/tokio-1.52.3/src/task/coop/mod.rs:133:5 33: <tokio::runtime::scheduler::multi_thread::worker::Context>::run_task at /home/build/.cargo/registry/src/index.crates.io-1949cf8c6b5b557f/tokio-1.52.3/src/runtime/scheduler/multi_thread/worker.rs:675:9 34: <tokio::runtime::scheduler::multi_thread::worker::Context>::run at /home/build/.cargo/registry/src/index.crates.io-1949cf8c6b5b557f/tokio-1.52.3/src/runtime/scheduler/multi_thread/worker.rs:585:29 35: tokio::runtime::scheduler::multi_thread::worker::run::{closure#0}::{closure#0} at /home/build/.cargo/registry/src/index.crates.io-1949cf8c6b5b557f/tokio-1.52.3/src/runtime/scheduler/multi_thread/worker.rs:550:24 36: <tokio::runtime::context::scoped::Scoped<tokio::runtime::scheduler::Context>>::set::<tokio::runtime::scheduler::multi_thread::worker::run::{closure#0}::{closure#0}, ()> at /home/build/.cargo/registry/src/index.crates.io-1949cf8c6b5b557f/tokio-1.52.3/src/runtime/context/scoped.rs:40:9 37: tokio::runtime::context::set_scheduler::<(), tokio::runtime::scheduler::multi_thread::worker::run::{closure#0}::{closure#0}>::{closure#0} at /home/build/.cargo/registry/src/index.crates.io-1949cf8c6b5b557f/tokio-1.52.3/src/runtime/context.rs:181:38 38: <std::thread::local::LocalKey<tokio::runtime::context::Context>>::try_with::<tokio::runtime::context::set_scheduler<(), tokio::runtime::scheduler::multi_thread::worker::run::{closure#0}::{closure#0}>::{closure#0}, ()> at /rustc/8bab26f4f68e0e26f0bb7960be334d5b520ea452/library/std/src/thread/local.rs:462:12 39: <std::thread::local::LocalKey<tokio::runtime::context::Context>>::with::<tokio::runtime::context::set_scheduler<(), tokio::runtime::scheduler::multi_thread::worker::run::{closure#0}::{closure#0}>::{closure#0}, ()> at /rustc/8bab26f4f68e0e26f0bb7960be334d5b520ea452/library/std/src/thread/local.rs:426:20 40: tokio::runtime::context::set_scheduler::<(), tokio::runtime::scheduler::multi_thread::worker::run::{closure#0}::{closure#0}> at /home/build/.cargo/registry/src/index.crates.io-1949cf8c6b5b557f/tokio-1.52.3/src/runtime/context.rs:181:17 41: tokio::runtime::scheduler::multi_thread::worker::run::{closure#0} at /home/build/.cargo/registry/src/index.crates.io-1949cf8c6b5b557f/tokio-1.52.3/src/runtime/scheduler/multi_thread/worker.rs:545:9 42: tokio::runtime::context::runtime::enter_runtime::<tokio::runtime::scheduler::multi_thread::worker::run::{closure#0}, ()> at /home/build/.cargo/registry/src/index.crates.io-1949cf8c6b5b557f/tokio-1.52.3/src/runtime/context/runtime.rs:65:16 43: tokio::runtime::scheduler::multi_thread::worker::run at /home/build/.cargo/registry/src/index.crates.io-1949cf8c6b5b557f/tokio-1.52.3/src/runtime/scheduler/multi_thread/worker.rs:537:5 44: <tokio::runtime::scheduler::multi_thread::worker::Launch>::launch::{closure#0} at /home/build/.cargo/registry/src/index.crates.io-1949cf8c6b5b557f/tokio-1.52.3/src/runtime/scheduler/multi_thread/worker.rs:503:45 45: <tokio::runtime::blocking::task::BlockingTask<<tokio::runtime::scheduler::multi_thread::worker::Launch>::launch::{closure#0}> as core::future::future::Future>::poll at /home/build/.cargo/registry/src/index.crates.io-1949cf8c6b5b557f/tokio-1.52.3/src/runtime/blocking/task.rs:42:21 46: <tokio::runtime::task::core::Core<tokio::runtime::blocking::task::BlockingTask<<tokio::runtime::scheduler::multi_thread::worker::Launch>::launch::{closure#0}>, tokio::runtime::blocking::schedule::BlockingSchedule>>::poll::{closure#0} at /home/build/.cargo/registry/src/index.crates.io-1949cf8c6b5b557f/tokio-1.52.3/src/runtime/task/core.rs:375:24 47: <tokio::loom::std::unsafe_cell::UnsafeCell<tokio::runtime::task::core::Stage<tokio::runtime::blocking::task::BlockingTask<<tokio::runtime::scheduler::multi_thread::worker::Launch>::launch::{closure#0}>>>>::with_mut::<core::task::poll::Poll<()>, <tokio::runtime::task::core::Core<tokio::runtime::blocking::task::BlockingTask<<tokio::runtime::scheduler::multi_thread::worker::Launch>::launch::{closure#0}>, tokio::runtime::blocking::schedule::BlockingSchedule>>::poll::{closure#0}> at /home/build/.cargo/registry/src/index.crates.io-1949cf8c6b5b557f/tokio-1.52.3/src/loom/std/unsafe_cell.rs:16:9 48: <tokio::runtime::task::core::Core<tokio::runtime::blocking::task::BlockingTask<<tokio::runtime::scheduler::multi_thread::worker::Launch>::launch::{closure#0}>, tokio::runtime::blocking::schedule::BlockingSchedule>>::poll at /home/build/.cargo/registry/src/index.crates.io-1949cf8c6b5b557f/tokio-1.52.3/src/runtime/task/core.rs:364:30 49: tokio::runtime::task::harness::poll_future::<tokio::runtime::blocking::task::BlockingTask<<tokio::runtime::scheduler::multi_thread::worker::Launch>::launch::{closure#0}>, tokio::runtime::blocking::schedule::BlockingSchedule>::{closure#0} at /home/build/.cargo/registry/src/index.crates.io-1949cf8c6b5b557f/tokio-1.52.3/src/runtime/task/harness.rs:535:30 50: <core::panic::unwind_safe::AssertUnwindSafe<tokio::runtime::task::harness::poll_future<tokio::runtime::blocking::task::BlockingTask<<tokio::runtime::scheduler::multi_thread::worker::Launch>::launch::{closure#0}>, tokio::runtime::blocking::schedule::BlockingSchedule>::{closure#0}> as core::ops::function::FnOnce<()>>::call_once at /rustc/8bab26f4f68e0e26f0bb7960be334d5b520ea452/library/core/src/panic/unwind_safe.rs:275:9 51: std::panicking::catch_unwind::do_call::<core::panic::unwind_safe::AssertUnwindSafe<tokio::runtime::task::harness::poll_future<tokio::runtime::blocking::task::BlockingTask<<tokio::runtime::scheduler::multi_thread::worker::Launch>::launch::{closure#0}>, tokio::runtime::blocking::schedule::BlockingSchedule>::{closure#0}>, core::task::poll::Poll<()>> at /rustc/8bab26f4f68e0e26f0bb7960be334d5b520ea452/library/std/src/panicking.rs:581:40 52: __rust_try 53: std::panicking::catch_unwind::<core::task::poll::Poll<()>, core::panic::unwind_safe::AssertUnwindSafe<tokio::runtime::task::harness::poll_future<tokio::runtime::blocking::task::BlockingTask<<tokio::runtime::scheduler::multi_thread::worker::Launch>::launch::{closure#0}>, tokio::runtime::blocking::schedule::BlockingSchedule>::{closure#0}>> at /rustc/8bab26f4f68e0e26f0bb7960be334d5b520ea452/library/std/src/panicking.rs:544:19 54: std::panic::catch_unwind::<core::panic::unwind_safe::AssertUnwindSafe<tokio::runtime::task::harness::poll_future<tokio::runtime::blocking::task::BlockingTask<<tokio::runtime::scheduler::multi_thread::worker::Launch>::launch::{closure#0}>, tokio::runtime::blocking::schedule::BlockingSchedule>::{closure#0}>, core::task::poll::Poll<()>> at /rustc/8bab26f4f68e0e26f0bb7960be334d5b520ea452/library/std/src/panic.rs:359:14 55: tokio::runtime::task::harness::poll_future::<tokio::runtime::blocking::task::BlockingTask<<tokio::runtime::scheduler::multi_thread::worker::Launch>::launch::{closure#0}>, tokio::runtime::blocking::schedule::BlockingSchedule> at /home/build/.cargo/registry/src/index.crates.io-1949cf8c6b5b557f/tokio-1.52.3/src/runtime/task/harness.rs:523:18 56: <tokio::runtime::task::harness::Harness<tokio::runtime::blocking::task::BlockingTask<<tokio::runtime::scheduler::multi_thread::worker::Launch>::launch::{closure#0}>, tokio::runtime::blocking::schedule::BlockingSchedule>>::poll_inner at /home/build/.cargo/registry/src/index.crates.io-1949cf8c6b5b557f/tokio-1.52.3/src/runtime/task/harness.rs:210:27 57: <tokio::runtime::task::harness::Harness<tokio::runtime::blocking::task::BlockingTask<<tokio::runtime::scheduler::multi_thread::worker::Launch>::launch::{closure#0}>, tokio::runtime::blocking::schedule::BlockingSchedule>>::poll at /home/build/.cargo/registry/src/index.crates.io-1949cf8c6b5b557f/tokio-1.52.3/src/runtime/task/harness.rs:155:20 58: tokio::runtime::task::raw::poll::<tokio::runtime::blocking::task::BlockingTask<<tokio::runtime::scheduler::multi_thread::worker::Launch>::launch::{closure#0}>, tokio::runtime::blocking::schedule::BlockingSchedule> at /home/build/.cargo/registry/src/index.crates.io-1949cf8c6b5b557f/tokio-1.52.3/src/runtime/task/raw.rs:337:13 59: <tokio::runtime::task::raw::RawTask>::poll at /home/build/.cargo/registry/src/index.crates.io-1949cf8c6b5b557f/tokio-1.52.3/src/runtime/task/raw.rs:267:18 60: <tokio::runtime::task::UnownedTask<tokio::runtime::blocking::schedule::BlockingSchedule>>::run at /home/build/.cargo/registry/src/index.crates.io-1949cf8c6b5b557f/tokio-1.52.3/src/runtime/task/mod.rs:547:13 61: <tokio::runtime::blocking::pool::Task>::run at /home/build/.cargo/registry/src/index.crates.io-1949cf8c6b5b557f/tokio-1.52.3/src/runtime/blocking/pool.rs:161:19 62: <tokio::runtime::blocking::pool::Inner>::run at /home/build/.cargo/registry/src/index.crates.io-1949cf8c6b5b557f/tokio-1.52.3/src/runtime/blocking/pool.rs:518:22 63: <tokio::runtime::blocking::pool::Spawner>::spawn_thread::{closure#0} at /home/build/.cargo/registry/src/index.crates.io-1949cf8c6b5b557f/tokio-1.52.3/src/runtime/blocking/pool.rs:474:47 64: std::sys::backtrace::__rust_begin_short_backtrace::<<tokio::runtime::blocking::pool::Spawner>::spawn_thread::{closure#0}, ()> at /rustc/8bab26f4f68e0e26f0bb7960be334d5b520ea452/library/std/src/sys/backtrace.rs:166:18 65: std::thread::lifecycle::spawn_unchecked::<<tokio::runtime::blocking::pool::Spawner>::spawn_thread::{closure#0}, ()>::{closure#1}::{closure#0} at /rustc/8bab26f4f68e0e26f0bb7960be334d5b520ea452/library/std/src/thread/lifecycle.rs:70:13 66: <core::panic::unwind_safe::AssertUnwindSafe<std::thread::lifecycle::spawn_unchecked<<tokio::runtime::blocking::pool::Spawner>::spawn_thread::{closure#0}, ()>::{closure#1}::{closure#0}> as core::ops::function::FnOnce<()>>::call_once at /rustc/8bab26f4f68e0e26f0bb7960be334d5b520ea452/library/core/src/panic/unwind_safe.rs:275:9 67: std::panicking::catch_unwind::do_call::<core::panic::unwind_safe::AssertUnwindSafe<std::thread::lifecycle::spawn_unchecked<<tokio::runtime::blocking::pool::Spawner>::spawn_thread::{closure#0}, ()>::{closure#1}::{closure#0}>, ()> at /rustc/8bab26f4f68e0e26f0bb7960be334d5b520ea452/library/std/src/panicking.rs:581:40 68: __rust_try 69: std::panicking::catch_unwind::<(), core::panic::unwind_safe::AssertUnwindSafe<std::thread::lifecycle::spawn_unchecked<<tokio::runtime::blocking::pool::Spawner>::spawn_thread::{closure#0}, ()>::{closure#1}::{closure#0}>> at /rustc/8bab26f4f68e0e26f0bb7960be334d5b520ea452/library/std/src/panicking.rs:544:19 70: std::panic::catch_unwind::<core::panic::unwind_safe::AssertUnwindSafe<std::thread::lifecycle::spawn_unchecked<<tokio::runtime::blocking::pool::Spawner>::spawn_thread::{closure#0}, ()>::{closure#1}::{closure#0}>, ()> at /rustc/8bab26f4f68e0e26f0bb7960be334d5b520ea452/library/std/src/panic.rs:359:14 71: std::thread::lifecycle::spawn_unchecked::<<tokio::runtime::blocking::pool::Spawner>::spawn_thread::{closure#0}, ()>::{closure#1} at /rustc/8bab26f4f68e0e26f0bb7960be334d5b520ea452/library/std/src/thread/lifecycle.rs:68:26 72: <std::thread::lifecycle::spawn_unchecked<<tokio::runtime::blocking::pool::Spawner>::spawn_thread::{closure#0}, ()>::{closure#1} as core::ops::function::FnOnce<()>>::call_once::{shim:vtable#0} at /rustc/8bab26f4f68e0e26f0bb7960be334d5b520ea452/library/core/src/ops/function.rs:250:5 73: <alloc::boxed::Box<dyn core::ops::function::FnOnce<(), Output = ()> + core::marker::Send> as core::ops::function::FnOnce<()>>::call_once at /rustc/8bab26f4f68e0e26f0bb7960be334d5b520ea452/library/alloc/src/boxed.rs:2275:9 74: <std::sys::thread::unix::Thread>::new::thread_start at /rustc/8bab26f4f68e0e26f0bb7960be334d5b520ea452/library/std/src/sys/thread/unix.rs:118:17 75: _thrp_setup 76: <unknown> file = phd-tests/runner/src/execute.rs line = 141 target = phd_runner::execute
1132026-10-17T05:31:24.134ZINFOphd-runner: [TEST_CLEANUP - START] file = phd-tests/runner/src/fixtures.rs line = 51 target = phd_runner::fixtures
1142026-10-17T05:31:24.134ZINFOphd-runner: [TEST_CLEANUP - END] elapsed_milliseconds = 0 file = phd-tests/runner/src/fixtures.rs line = 51 target = phd_runner::fixtures
1152026-10-17T05:31:24.134ZINFOphd-runner: [EXECUTION_CLEANUP - START] file = phd-tests/runner/src/fixtures.rs line = 35 target = phd_runner::fixtures
1162026-10-17T05:31:24.134ZINFOphd-runner: [EXECUTION_CLEANUP - END] elapsed_milliseconds = 0 file = phd-tests/runner/src/fixtures.rs line = 35 target = phd_runner::fixtures
117 
118 failures:
119 phd_tests::migrate::from_base::serial_history
120 phd_tests::migrate::from_base::can_migrate_from_base
121 phd_tests::migrate::from_base::migration_from_base_and_back
122 
123 test result: FAILED. 0 passed; 3 failed; 0 skipped; 0 not run; finished in 56.92s
124 
1252026-10-17T05:31:24.135ZDEBGphd-runner: phd_runner exit_code = 3 file = phd-tests/runner/src/main.rs line = 41 target = phd_runner