Max level shown:
12026-10-20T15:28:03.232ZINFOphd-runner: phd_runner file = phd-tests/runner/src/main.rs line = 36 runner_args = ProcessArgs { command: Run(RunOptions { propolis_server_cmd: "/work/phd-test/propolis-server", base_propolis_branch: Some("master"), base_propolis_commit: None, base_propolis_cmd: None, crucible_downstairs_cmd: None, crucible_downstairs_commit: Some(Auto), tmp_directory: "/tmp/propolis-phd", artifact_directory: Some("/phd-artifacts"), output_mode: TmpFile, default_guest_cpus: 2, default_guest_memory_mib: 512, artifact_toml_path: "/work/phd-test/artifacts.toml", default_guest_artifact: "alpine", default_bootrom_artifact: "ovmf", include_filter: ["phd_tests::migrate::from_base"], exclude_filter: [], max_buildomat_wait_secs: 1200, manual_stop_on_failure: false }), disable_ansi: false, emit_bunyan: true } target = phd_runner
22026-10-20T15:28:03.260ZDEBGphd-runner: Created new artifact store from manifest file = phd-tests/framework/src/artifacts/store.rs line = 219 store = Store { local_dir: "/phd-artifacts", artifacts: {"alpine": Mutex { data: StoredArtifact { description: Artifact { filename: "alpine.iso", kind: GuestOs(Alpine), source: RemoteServer { sha256: "ba8007f74f9b54fbae3b2520da577831b4834778a498d732f091260c61aa7ca1" }, untar: None }, cached_path: None } }, "ovmf": Mutex { data: StoredArtifact { description: Artifact { filename: "OVMF_CODE.fd", kind: Bootrom, source: Buildomat(BuildomatArtifact { repo: Repo("oxidecomputer/edk2"), series: Series("image_debug"), commit: Commit("bf64f45b1a58e69d126a3c6ca1e4512c88668132"), sha256: "740187046a7267d0de72d3455070333547dbc0ea023531471fb2b2a61effa448" }), untar: None }, cached_path: None } }}, downloader: DownloadConfig { timeout: 600s, buildomat_backoff: ExponentialBackoff { current_interval: 1s, initial_interval: 1s, randomization_factor: 0.5, multiplier: 1.5, max_interval: 60s, start_time: Instant { tv_sec: 257, tv_nsec: 945379924 }, max_elapsed_time: Some(1200s), clock: SystemClock }, remote_server_uris: ["https://oxide-omicron-build.s3.amazonaws.com"] } } target = phd_framework::artifacts::store
32026-10-20T15:28:03.260ZINFOphd-runner: Adding Propolis server from local command file = phd-tests/framework/src/artifacts/store.rs line = 227 propolis_server_cmd = /work/phd-test/propolis-server target = phd_framework::artifacts::store
42026-10-20T15:28:03.263ZINFOphd-runner: Adding crucible-downstairs from Buildomat Git revision commit = bd62980710dd3d6d3524aa7f6617127942b75002 file = phd-tests/framework/src/artifacts/store.rs line = 311 target = phd_framework::artifacts::store
52026-10-20T15:28:03.265ZDEBGphd-runner: Downloading file from Buildomat... file = phd-tests/framework/src/artifacts/buildomat.rs line = 215 target = phd_framework::artifacts::buildomat timeout = 600s uri = https://buildomat.eng.oxide.computer/public/file/oxidecomputer/crucible/nightly-image/bd62980710dd3d6d3524aa7f6617127942b75002/crucible-nightly.sha256.txt
62026-10-20T15:28:03.521ZINFOphd-runner: Adding 'current' Propolis server from Buildomat Git branch 'master' file = phd-tests/framework/src/artifacts/store.rs line = 248 target = phd_framework::artifacts::store
72026-10-20T15:28:04.153ZDEBGphd-runner: Downloading file from Buildomat... file = phd-tests/framework/src/artifacts/buildomat.rs line = 215 target = phd_framework::artifacts::buildomat timeout = 600s uri = https://buildomat.eng.oxide.computer/public/file/oxidecomputer/propolis/phd_build/3b60af56ed99c4497f02ac9fe014c76adfcf978b/propolis-server.sha256.txt
82026-10-20T15:28:04.367ZINFOphd-runner: [EXECUTION_SETUP - START] file = phd-tests/runner/src/fixtures.rs line = 25 target = phd_runner::fixtures
92026-10-20T15:28:04.368ZINFOphd-runner: [EXECUTION_SETUP - END] elapsed_milliseconds = 0 file = phd-tests/runner/src/fixtures.rs line = 25 target = phd_runner::fixtures
102026-10-20T15:28:04.370ZINFOphd-runner: Running 3 test(s) file = phd-tests/runner/src/execute.rs line = 83 target = phd_runner::execute
112026-10-20T15:28:04.371ZINFOphd-runner: Starting test phd_tests::migrate::from_base::serial_history file = phd-tests/runner/src/execute.rs line = 91 target = phd_runner::execute
122026-10-20T15:28:04.371ZINFOphd-runner: [TEST_SETUP - START] file = phd-tests/runner/src/fixtures.rs line = 41 target = phd_runner::fixtures
132026-10-20T15:28:04.371ZINFOphd-runner: [TEST_SETUP - END] elapsed_milliseconds = 0 file = phd-tests/runner/src/fixtures.rs line = 41 target = phd_runner::fixtures
142026-10-20T15:28:04.374ZINFOphd-runner: [TEST - START] file = phd-tests/tests/src/migrate.rs line = 40 path = phd_tests::migrate::from_base::serial_history target = phd_tests::migrate::from_base
152026-10-20T15:28:04.379ZDEBGphd-runner: [TEST - EVENT] checking for existing copy of artifact file = phd-tests/framework/src/artifacts/store.rs line = 89 maybe_path = /phd-artifacts/740187046a7267d0de72d3455070333547dbc0ea023531471fb2b2a61effa448/OVMF_CODE.fd path = phd_tests::migrate::from_base::serial_history target = phd_framework::artifacts::store
162026-10-20T15:28:04.382ZDEBGphd-runner: [TEST - EVENT] Downloading file from Buildomat... file = phd-tests/framework/src/artifacts/buildomat.rs line = 215 path = phd_tests::migrate::from_base::serial_history target = phd_framework::artifacts::buildomat timeout = 600s uri = https://buildomat.eng.oxide.computer/public/file/oxidecomputer/edk2/image_debug/bf64f45b1a58e69d126a3c6ca1e4512c88668132/OVMF_CODE.fd
172026-10-20T15:28:04.894ZDEBGphd-runner: [TEST - EVENT] checking for existing copy of artifact file = phd-tests/framework/src/artifacts/store.rs line = 89 maybe_path = /phd-artifacts/ba8007f74f9b54fbae3b2520da577831b4834778a498d732f091260c61aa7ca1/alpine.iso path = phd_tests::migrate::from_base::serial_history target = phd_framework::artifacts::store
182026-10-20T15:28:04.907ZDEBGphd-runner: [TEST - EVENT] Downloading alpine.iso from https://oxide-omicron-build.s3.amazonaws.com/alpine.iso file = phd-tests/framework/src/artifacts/store.rs line = 614 path = phd_tests::migrate::from_base::serial_history target = phd_framework::artifacts::store timeout = 600s
192026-10-20T15:28:11.486ZDEBGphd-runner: [TEST - EVENT] Verified artifact already exists file = phd-tests/framework/src/artifacts/store.rs line = 45 path = /phd-artifacts/ba8007f74f9b54fbae3b2520da577831b4834778a498d732f091260c61aa7ca1/alpine.iso target = phd_framework::artifacts::store
202026-10-20T15:28:11.486ZDEBGphd-runner: [TEST - EVENT] executing ZFS command args = ["/phd-artifacts/ba8007f74f9b54fbae3b2520da577831b4834778a498d732f091260c61aa7ca1/alpine.iso"] file = phd-tests/framework/src/zfs.rs line = 304 path = phd_tests::migrate::from_base::serial_history target = phd_framework::zfs verb = list
212026-10-20T15:28:11.503ZDEBGphd-runner: [TEST - EVENT] parsing zfs list output file = phd-tests/framework/src/zfs.rs line = 238 path = phd_tests::migrate::from_base::serial_history stdout = NAME USED AVAIL REFER MOUNTPOINT\nphd-artifacts 3.48M 25.3T 2M /phd-artifacts\n target = phd_framework::zfs
222026-10-20T15:28:11.505ZDEBGphd-runner: [TEST - EVENT] executing ZFS command args = ["phd-artifacts@phd-ee1fa1ed-b589-4dd6-a055-1599375513fb"] file = phd-tests/framework/src/zfs.rs line = 304 path = phd_tests::migrate::from_base::serial_history target = phd_framework::zfs verb = snapshot
232026-10-20T15:28:11.528ZDEBGphd-runner: [TEST - EVENT] executing ZFS command args = ["phd-artifacts@phd-ee1fa1ed-b589-4dd6-a055-1599375513fb", "phd-artifacts/phd-clone-44acaec4-6d6c-4d93-862f-4893f1b8df4c"] file = phd-tests/framework/src/zfs.rs line = 304 path = phd_tests::migrate::from_base::serial_history target = phd_framework::zfs verb = clone
242026-10-20T15:28:11.546ZDEBGphd-runner: [TEST - EVENT] executing ZFS command args = ["phd-artifacts/phd-clone-44acaec4-6d6c-4d93-862f-4893f1b8df4c"] file = phd-tests/framework/src/zfs.rs line = 304 path = phd_tests::migrate::from_base::serial_history target = phd_framework::zfs verb = list
252026-10-20T15:28:11.557ZDEBGphd-runner: [TEST - EVENT] parsing zfs list output file = phd-tests/framework/src/zfs.rs line = 238 path = phd_tests::migrate::from_base::serial_history stdout = NAME USED AVAIL REFER MOUNTPOINT\nphd-artifacts/phd-clone-44acaec4-6d6c-4d93-862f-4893f1b8df4c 0B 25.3T 49.0M /phd-artifacts/phd-clone-44acaec4-6d6c-4d93-862f-4893f1b8df4c\n target = phd_framework::zfs
262026-10-20T15:28:11.563ZINFOphd-runner: [NEW - START] file = phd-tests/framework/src/test_vm/mod.rs line = 300 path = phd_tests::migrate::from_base::serial_history target = phd_framework::test_vm
272026-10-20T15:28:11.563ZINFOphd-runner: [NEW - EVENT] phd_framework::test_vm environment = EnvironmentSpec { location: Local, propolis_artifact: "__BASE_PROPOLIS", metrics: None } file = phd-tests/framework/src/test_vm/mod.rs guest_os_kind = Alpine line = 318 path = phd_tests::migrate::from_base::serial_history target = phd_framework::test_vm vm_name = migration_serial_history_base
282026-10-20T15:28:11.563ZDEBGphd-runner: [NEW - EVENT] checking for existing copy of artifact file = phd-tests/framework/src/artifacts/store.rs line = 89 maybe_path = /phd-artifacts/739eeb04a4728b2e7609b038a587b5de0d939c2a02cf61882a60d42a6ba676e1/propolis-server.tar.gz path = phd_tests::migrate::from_base::serial_history target = phd_framework::artifacts::store
292026-10-20T15:28:11.564ZDEBGphd-runner: [NEW - EVENT] Downloading file from Buildomat... file = phd-tests/framework/src/artifacts/buildomat.rs line = 215 path = phd_tests::migrate::from_base::serial_history target = phd_framework::artifacts::buildomat timeout = 600s uri = https://buildomat.eng.oxide.computer/public/file/oxidecomputer/propolis/phd_build/3b60af56ed99c4497f02ac9fe014c76adfcf978b/propolis-server.tar.gz
302026-10-20T15:28:30.741ZDEBGphd-runner: [NEW - EVENT] Extracting artifact from tarball extracted_path = /phd-artifacts/739eeb04a4728b2e7609b038a587b5de0d939c2a02cf61882a60d42a6ba676e1/propolis-server file = phd-tests/framework/src/artifacts/store.rs line = 160 path = phd_tests::migrate::from_base::serial_history target = phd_framework::artifacts::store untar_path = propolis-server
312026-10-20T15:28:30.741ZDEBGphd-runner: [NEW - EVENT] Extracting gzipped tarball... file = phd-tests/framework/src/artifacts/store.rs line = 514 path = phd_tests::migrate::from_base::serial_history target = phd_framework::artifacts::store
322026-10-20T15:28:55.955ZINFOphd-runner: [NEW - EVENT] Launching Propolis server bootrom_path = "/phd-artifacts/740187046a7267d0de72d3455070333547dbc0ea023531471fb2b2a61effa448/OVMF_CODE.fd" file = phd-tests/framework/src/test_vm/server.rs line = 66 path = phd_tests::migrate::from_base::serial_history server_addr = 127.0.0.1:9000 server_path = "/phd-artifacts/739eeb04a4728b2e7609b038a587b5de0d939c2a02cf61882a60d42a6ba676e1/propolis-server" target = phd_framework::test_vm::server
332026-10-20T15:28:55.955ZINFOphd-runner: [NEW - EVENT] Opening server log files file = phd-tests/framework/src/log_config.rs line = 84 path = phd_tests::migrate::from_base::serial_history stderr_path = "/tmp/propolis-phd/phd_tests::migrate::from_base::serial_history/migration_serial_history_base.stderr.log" stdout_path = "/tmp/propolis-phd/phd_tests::migrate::from_base::serial_history/migration_serial_history_base.stdout.log" target = phd_framework::log_config
342026-10-20T15:28:56.134ZINFOphd-runner: [NEW - EVENT] Launched server with pid 917 file = phd-tests/framework/src/test_vm/server.rs line = 127 path = phd_tests::migrate::from_base::serial_history target = phd_framework::test_vm::server
352026-10-20T15:28:56.149ZINFOphd-runner: [INSTANCE_ENSURE_INTERNAL - START] file = phd-tests/framework/src/test_vm/mod.rs line = 412 path = phd_tests::migrate::from_base::serial_history target = phd_framework::test_vm vm = migration_serial_history_base vm_id = 62e1509b-e217-4b9b-880c-2c3f2dddd8ec
362026-10-20T15:28:56.158ZINFOphd-runner: [INSTANCE_ENSURE_INTERNAL - EVENT] retriable error from instance_spec_ensure e = Communication Error: error sending request for url (http://127.0.0.1:9000/instance) file = phd-tests/framework/src/test_vm/mod.rs line = 455 path = phd_tests::migrate::from_base::serial_history target = phd_framework::test_vm vm = migration_serial_history_base vm_id = 62e1509b-e217-4b9b-880c-2c3f2dddd8ec
372026-10-20T15:28:56.161ZINFOphd-runner: [NEW - END] elapsed_milliseconds = 44600 file = phd-tests/framework/src/test_vm/mod.rs line = 300 path = phd_tests::migrate::from_base::serial_history target = phd_framework::test_vm
382026-10-20T15:28:57.038ZINFOphd-runner: [SERIAL CONSOLE TASK - START] file = phd-tests/framework/src/serial/mod.rs line = 200 target = phd_framework::serial
392026-10-20T15:28:57.042ZINFOphd-runner: [INSTANCE_ENSURE_INTERNAL - EVENT] Started instance file = phd-tests/framework/src/test_vm/mod.rs instance_description.instance = Instance { properties: InstanceProperties { id: 62e1509b-e217-4b9b-880c-2c3f2dddd8ec, name: "phd-vm-62e1509b-e217-4b9b-880c-2c3f2dddd8ec", description: "Pheidippides-managed VM", metadata: InstanceMetadata { silo_id: 8233c262-205a-4ceb-9dfa-0d45aa42b027, project_id: db00ec34-a17e-4047-9b36-95d695c61b4b, sled_id: 8f716f9d-5963-43a8-9433-cecafe549910, sled_serial: "8f716f9d-5963-43a8-9433-cecafe549910", sled_revision: 1, sled_model: "pheidippes" } }, state: Creating } line = 514 path = phd_tests::migrate::from_base::serial_history target = phd_framework::test_vm vm = migration_serial_history_base vm_id = 62e1509b-e217-4b9b-880c-2c3f2dddd8ec
402026-10-20T15:28:57.042ZINFOphd-runner: [PUT_INSTANCE_STATE - START] file = phd-tests/framework/src/test_vm/mod.rs line = 575 path = phd_tests::migrate::from_base::serial_history target = phd_framework::test_vm vm = migration_serial_history_base vm_id = 62e1509b-e217-4b9b-880c-2c3f2dddd8ec
412026-10-20T15:28:57.043ZINFOphd-runner: [PUT_INSTANCE_STATE - EVENT] Requesting instance state change file = phd-tests/framework/src/test_vm/mod.rs line = 580 path = phd_tests::migrate::from_base::serial_history state = Run target = phd_framework::test_vm vm = migration_serial_history_base vm_id = 62e1509b-e217-4b9b-880c-2c3f2dddd8ec
422026-10-20T15:28:57.044ZINFOphd-runner: [PUT_INSTANCE_STATE - END] elapsed_milliseconds = 1 file = phd-tests/framework/src/test_vm/mod.rs line = 575 path = phd_tests::migrate::from_base::serial_history target = phd_framework::test_vm vm = migration_serial_history_base vm_id = 62e1509b-e217-4b9b-880c-2c3f2dddd8ec
432026-10-20T15:28:57.045ZINFOphd-runner: [WAIT_TO_BOOT - START] file = phd-tests/framework/src/test_vm/mod.rs line = 890 path = phd_tests::migrate::from_base::serial_history target = phd_framework::test_vm
442026-10-20T15:28:57.046ZINFOphd-runner: [WAIT_TO_BOOT - EVENT] waiting for guest to boot file = phd-tests/framework/src/test_vm/mod.rs line = 839 path = phd_tests::migrate::from_base::serial_history target = phd_framework::test_vm timeout_duration = 300s vm = migration_serial_history_base vm_id = 62e1509b-e217-4b9b-880c-2c3f2dddd8ec
452026-10-20T15:28:57.046ZDEBGphd-runner: [WAIT_TO_BOOT - EVENT] executing command in boot sequence file = phd-tests/framework/src/test_vm/mod.rs line = 847 path = phd_tests::migrate::from_base::serial_history step = WaitFor("localhost login: ") target = phd_framework::test_vm
462026-10-20T15:28:57.046ZINFOphd-runner: [WAIT_FOR_SERIAL_OUTPUT - START] file = phd-tests/framework/src/test_vm/mod.rs line = 913 path = phd_tests::migrate::from_base::serial_history target = phd_framework::test_vm vm = migration_serial_history_base vm_id = 62e1509b-e217-4b9b-880c-2c3f2dddd8ec
472026-10-20T15:28:57.046ZINFOphd-runner: [WAIT_FOR_SERIAL_OUTPUT - EVENT] Waiting for output on serial console file = phd-tests/framework/src/test_vm/mod.rs line = 920 path = phd_tests::migrate::from_base::serial_history target = phd_framework::test_vm timeout_duration = CallerTimeout vm = migration_serial_history_base vm_id = 62e1509b-e217-4b9b-880c-2c3f2dddd8ec
482026-10-20T15:29:01.610ZINFOphd-runner: [WAIT_FOR_SERIAL_OUTPUT - END] elapsed_milliseconds = 4564 file = phd-tests/framework/src/test_vm/mod.rs line = 913 path = phd_tests::migrate::from_base::serial_history target = phd_framework::test_vm vm = migration_serial_history_base vm_id = 62e1509b-e217-4b9b-880c-2c3f2dddd8ec
492026-10-20T15:29:01.611ZDEBGphd-runner: [WAIT_TO_BOOT - EVENT] executing command in boot sequence file = phd-tests/framework/src/test_vm/mod.rs line = 847 path = phd_tests::migrate::from_base::serial_history step = WriteStr("root") target = phd_framework::test_vm
502026-10-20T15:29:01.615ZDEBGphd-runner: [WAIT_TO_BOOT - EVENT] executing command in boot sequence file = phd-tests/framework/src/test_vm/mod.rs line = 847 path = phd_tests::migrate::from_base::serial_history step = WaitFor("localhost:~#") target = phd_framework::test_vm
512026-10-20T15:29:01.615ZINFOphd-runner: [WAIT_FOR_SERIAL_OUTPUT - START] file = phd-tests/framework/src/test_vm/mod.rs line = 913 path = phd_tests::migrate::from_base::serial_history target = phd_framework::test_vm vm = migration_serial_history_base vm_id = 62e1509b-e217-4b9b-880c-2c3f2dddd8ec
522026-10-20T15:29:01.615ZINFOphd-runner: [WAIT_FOR_SERIAL_OUTPUT - EVENT] Waiting for output on serial console file = phd-tests/framework/src/test_vm/mod.rs line = 920 path = phd_tests::migrate::from_base::serial_history target = phd_framework::test_vm timeout_duration = CallerTimeout vm = migration_serial_history_base vm_id = 62e1509b-e217-4b9b-880c-2c3f2dddd8ec
532026-10-20T15:29:01.640ZINFOphd-runner: [WAIT_FOR_SERIAL_OUTPUT - END] elapsed_milliseconds = 24 file = phd-tests/framework/src/test_vm/mod.rs line = 913 path = phd_tests::migrate::from_base::serial_history target = phd_framework::test_vm vm = migration_serial_history_base vm_id = 62e1509b-e217-4b9b-880c-2c3f2dddd8ec
542026-10-20T15:29:01.640ZDEBGphd-runner: [WAIT_TO_BOOT - EVENT] executing command in boot sequence file = phd-tests/framework/src/test_vm/mod.rs line = 847 path = phd_tests::migrate::from_base::serial_history step = WriteStr("stty -F `tty` cols 9999") target = phd_framework::test_vm
552026-10-20T15:29:01.640ZDEBGphd-runner: [WAIT_TO_BOOT - EVENT] executing command in boot sequence file = phd-tests/framework/src/test_vm/mod.rs line = 847 path = phd_tests::migrate::from_base::serial_history step = WaitFor("localhost:~#") target = phd_framework::test_vm
562026-10-20T15:29:01.641ZINFOphd-runner: [WAIT_FOR_SERIAL_OUTPUT - START] file = phd-tests/framework/src/test_vm/mod.rs line = 913 path = phd_tests::migrate::from_base::serial_history target = phd_framework::test_vm vm = migration_serial_history_base vm_id = 62e1509b-e217-4b9b-880c-2c3f2dddd8ec
572026-10-20T15:29:01.641ZINFOphd-runner: [WAIT_FOR_SERIAL_OUTPUT - EVENT] Waiting for output on serial console file = phd-tests/framework/src/test_vm/mod.rs line = 920 path = phd_tests::migrate::from_base::serial_history target = phd_framework::test_vm timeout_duration = CallerTimeout vm = migration_serial_history_base vm_id = 62e1509b-e217-4b9b-880c-2c3f2dddd8ec
582026-10-20T15:29:01.673ZINFOphd-runner: [WAIT_FOR_SERIAL_OUTPUT - END] elapsed_milliseconds = 32 file = phd-tests/framework/src/test_vm/mod.rs line = 913 path = phd_tests::migrate::from_base::serial_history target = phd_framework::test_vm vm = migration_serial_history_base vm_id = 62e1509b-e217-4b9b-880c-2c3f2dddd8ec
592026-10-20T15:29:01.673ZINFOphd-runner: [WAIT_TO_BOOT - EVENT] Guest has booted file = phd-tests/framework/src/test_vm/mod.rs line = 887 path = phd_tests::migrate::from_base::serial_history target = phd_framework::test_vm
602026-10-20T15:29:01.674ZINFOphd-runner: [WAIT_TO_BOOT - END] elapsed_milliseconds = 4627 file = phd-tests/framework/src/test_vm/mod.rs line = 890 path = phd_tests::migrate::from_base::serial_history target = phd_framework::test_vm
612026-10-20T15:29:01.675ZINFOphd-runner: [WAIT_FOR_SERIAL_OUTPUT - START] file = phd-tests/framework/src/test_vm/mod.rs line = 913 path = phd_tests::migrate::from_base::serial_history target = phd_framework::test_vm vm = migration_serial_history_base vm_id = 62e1509b-e217-4b9b-880c-2c3f2dddd8ec
622026-10-20T15:29:01.676ZINFOphd-runner: [WAIT_FOR_SERIAL_OUTPUT - EVENT] Waiting for output on serial console file = phd-tests/framework/src/test_vm/mod.rs line = 920 path = phd_tests::migrate::from_base::serial_history target = phd_framework::test_vm timeout_duration = Explicit(15s) vm = migration_serial_history_base vm_id = 62e1509b-e217-4b9b-880c-2c3f2dddd8ec
632026-10-20T15:29:01.685ZINFOphd-runner: [WAIT_FOR_SERIAL_OUTPUT - END] elapsed_milliseconds = 9 file = phd-tests/framework/src/test_vm/mod.rs line = 913 path = phd_tests::migrate::from_base::serial_history target = phd_framework::test_vm vm = migration_serial_history_base vm_id = 62e1509b-e217-4b9b-880c-2c3f2dddd8ec
642026-10-20T15:29:01.686ZINFOphd-runner: [WAIT_FOR_SERIAL_OUTPUT - START] file = phd-tests/framework/src/test_vm/mod.rs line = 913 path = phd_tests::migrate::from_base::serial_history target = phd_framework::test_vm vm = migration_serial_history_base vm_id = 62e1509b-e217-4b9b-880c-2c3f2dddd8ec
652026-10-20T15:29:01.686ZINFOphd-runner: [WAIT_FOR_SERIAL_OUTPUT - EVENT] Waiting for output on serial console file = phd-tests/framework/src/test_vm/mod.rs line = 920 path = phd_tests::migrate::from_base::serial_history target = phd_framework::test_vm timeout_duration = Explicit(300s) vm = migration_serial_history_base vm_id = 62e1509b-e217-4b9b-880c-2c3f2dddd8ec
662026-10-20T15:29:01.718ZINFOphd-runner: [WAIT_FOR_SERIAL_OUTPUT - END] elapsed_milliseconds = 31 file = phd-tests/framework/src/test_vm/mod.rs line = 913 path = phd_tests::migrate::from_base::serial_history target = phd_framework::test_vm vm = migration_serial_history_base vm_id = 62e1509b-e217-4b9b-880c-2c3f2dddd8ec
672026-10-20T15:29:01.718ZINFOphd-runner: [WAIT_FOR_SERIAL_OUTPUT - START] file = phd-tests/framework/src/test_vm/mod.rs line = 913 path = phd_tests::migrate::from_base::serial_history target = phd_framework::test_vm vm = migration_serial_history_base vm_id = 62e1509b-e217-4b9b-880c-2c3f2dddd8ec
682026-10-20T15:29:01.718ZINFOphd-runner: [WAIT_FOR_SERIAL_OUTPUT - EVENT] Waiting for output on serial console file = phd-tests/framework/src/test_vm/mod.rs line = 920 path = phd_tests::migrate::from_base::serial_history target = phd_framework::test_vm timeout_duration = Explicit(15s) vm = migration_serial_history_base vm_id = 62e1509b-e217-4b9b-880c-2c3f2dddd8ec
692026-10-20T15:29:01.728ZINFOphd-runner: [WAIT_FOR_SERIAL_OUTPUT - END] elapsed_milliseconds = 10 file = phd-tests/framework/src/test_vm/mod.rs line = 913 path = phd_tests::migrate::from_base::serial_history target = phd_framework::test_vm vm = migration_serial_history_base vm_id = 62e1509b-e217-4b9b-880c-2c3f2dddd8ec
702026-10-20T15:29:01.729ZINFOphd-runner: [WAIT_FOR_SERIAL_OUTPUT - START] file = phd-tests/framework/src/test_vm/mod.rs line = 913 path = phd_tests::migrate::from_base::serial_history target = phd_framework::test_vm vm = migration_serial_history_base vm_id = 62e1509b-e217-4b9b-880c-2c3f2dddd8ec
712026-10-20T15:29:01.729ZINFOphd-runner: [WAIT_FOR_SERIAL_OUTPUT - EVENT] Waiting for output on serial console file = phd-tests/framework/src/test_vm/mod.rs line = 920 path = phd_tests::migrate::from_base::serial_history target = phd_framework::test_vm timeout_duration = Explicit(300s) vm = migration_serial_history_base vm_id = 62e1509b-e217-4b9b-880c-2c3f2dddd8ec
722026-10-20T15:29:01.762ZINFOphd-runner: [WAIT_FOR_SERIAL_OUTPUT - END] elapsed_milliseconds = 33 file = phd-tests/framework/src/test_vm/mod.rs line = 913 path = phd_tests::migrate::from_base::serial_history target = phd_framework::test_vm vm = migration_serial_history_base vm_id = 62e1509b-e217-4b9b-880c-2c3f2dddd8ec
732026-10-20T15:29:01.772ZINFOphd-runner: [TEST - EVENT] migrating to new Propolis artifact for lifecycle test file = phd-tests/framework/src/lifecycle.rs line = 73 path = phd_tests::migrate::from_base::serial_history propolis_artifact = __DEFAULT_PROPOLIS target = phd_framework::lifecycle vm_name = migration_serial_history_base
742026-10-20T15:29:01.772ZINFOphd-runner: [NEW - START] file = phd-tests/framework/src/test_vm/mod.rs line = 300 path = phd_tests::migrate::from_base::serial_history target = phd_framework::test_vm
752026-10-20T15:29:01.772ZINFOphd-runner: [NEW - EVENT] phd_framework::test_vm environment = EnvironmentSpec { location: Local, propolis_artifact: "__DEFAULT_PROPOLIS", metrics: None } file = phd-tests/framework/src/test_vm/mod.rs guest_os_kind = Alpine line = 318 path = phd_tests::migrate::from_base::serial_history target = phd_framework::test_vm vm_name = migration_serial_history_base_lifecycle_0
762026-10-20T15:29:01.774ZDEBGphd-runner: [NEW - EVENT] Examining locally-sourced artifact file = phd-tests/framework/src/artifacts/store.rs line = 56 path = /work/phd-test/propolis-server sha256 = None target = phd_framework::artifacts::store
772026-10-20T15:29:01.774ZDEBGphd-runner: [NEW - EVENT] Locally-sourced artifact is valid, caching its path file = phd-tests/framework/src/artifacts/store.rs line = 69 path = /work/phd-test/propolis-server target = phd_framework::artifacts::store
782026-10-20T15:29:01.774ZINFOphd-runner: [NEW - EVENT] Launching Propolis server bootrom_path = "/phd-artifacts/740187046a7267d0de72d3455070333547dbc0ea023531471fb2b2a61effa448/OVMF_CODE.fd" file = phd-tests/framework/src/test_vm/server.rs line = 66 path = phd_tests::migrate::from_base::serial_history server_addr = 127.0.0.1:9002 server_path = "/work/phd-test/propolis-server" target = phd_framework::test_vm::server
792026-10-20T15:29:01.774ZINFOphd-runner: [NEW - EVENT] Opening server log files file = phd-tests/framework/src/log_config.rs line = 84 path = phd_tests::migrate::from_base::serial_history stderr_path = "/tmp/propolis-phd/phd_tests::migrate::from_base::serial_history/migration_serial_history_base_lifecycle_0.stderr.log" stdout_path = "/tmp/propolis-phd/phd_tests::migrate::from_base::serial_history/migration_serial_history_base_lifecycle_0.stdout.log" target = phd_framework::log_config
802026-10-20T15:29:01.821ZINFOphd-runner: [NEW - EVENT] Launched server with pid 918 file = phd-tests/framework/src/test_vm/server.rs line = 127 path = phd_tests::migrate::from_base::serial_history target = phd_framework::test_vm::server
812026-10-20T15:29:01.833ZINFOphd-runner: [NEW - END] elapsed_milliseconds = 61 file = phd-tests/framework/src/test_vm/mod.rs line = 300 path = phd_tests::migrate::from_base::serial_history target = phd_framework::test_vm
822026-10-20T15:29:01.833ZINFOphd-runner: [MIGRATE_FROM - START] file = phd-tests/framework/src/test_vm/mod.rs line = 609 path = phd_tests::migrate::from_base::serial_history source = migration_serial_history_base source_id = 62e1509b-e217-4b9b-880c-2c3f2dddd8ec target = phd_framework::test_vm target_id = 5b8a0c1e-e9e0-466c-a763-c9756ccc1fad
832026-10-20T15:29:01.834ZINFOphd-runner: [MIGRATE_FROM - EVENT] Migrating from source at address 127.0.0.1:9000 file = phd-tests/framework/src/test_vm/mod.rs line = 642 migration_id = 1d486fbd-4145-4225-931b-66367ef4ce10 path = phd_tests::migrate::from_base::serial_history source = migration_serial_history_base source_id = 62e1509b-e217-4b9b-880c-2c3f2dddd8ec target = phd_framework::test_vm target_id = 5b8a0c1e-e9e0-466c-a763-c9756ccc1fad timeout_duration = 45s
842026-10-20T15:29:01.834ZINFOphd-runner: [INSTANCE_ENSURE_INTERNAL - START] file = phd-tests/framework/src/test_vm/mod.rs line = 412 path = phd_tests::migrate::from_base::serial_history source = migration_serial_history_base source_id = 62e1509b-e217-4b9b-880c-2c3f2dddd8ec target = phd_framework::test_vm target_id = 5b8a0c1e-e9e0-466c-a763-c9756ccc1fad vm = migration_serial_history_base_lifecycle_0 vm_id = 5b8a0c1e-e9e0-466c-a763-c9756ccc1fad
852026-10-20T15:29:01.835ZINFOphd-runner: [INSTANCE_ENSURE_INTERNAL - EVENT] retriable error from instance_spec_ensure e = Communication Error: error sending request for url (http://127.0.0.1:9002/instance) file = phd-tests/framework/src/test_vm/mod.rs line = 455 path = phd_tests::migrate::from_base::serial_history source = migration_serial_history_base source_id = 62e1509b-e217-4b9b-880c-2c3f2dddd8ec target = phd_framework::test_vm target_id = 5b8a0c1e-e9e0-466c-a763-c9756ccc1fad vm = migration_serial_history_base_lifecycle_0 vm_id = 5b8a0c1e-e9e0-466c-a763-c9756ccc1fad
862026-10-20T15:29:02.473ZINFOphd-runner: [INSTANCE_ENSURE_INTERNAL - EVENT] Started instance file = phd-tests/framework/src/test_vm/mod.rs instance_description.instance = Instance { properties: InstanceProperties { id: 5b8a0c1e-e9e0-466c-a763-c9756ccc1fad, name: "phd-vm-5b8a0c1e-e9e0-466c-a763-c9756ccc1fad", description: "Pheidippides-managed VM", metadata: InstanceMetadata { silo_id: 8233c262-205a-4ceb-9dfa-0d45aa42b027, project_id: db00ec34-a17e-4047-9b36-95d695c61b4b, sled_id: 07810665-ea97-47ad-8a10-8a12395ecfe0, sled_serial: "07810665-ea97-47ad-8a10-8a12395ecfe0", sled_revision: 1, sled_model: "pheidippes" } }, state: Migrating } line = 514 path = phd_tests::migrate::from_base::serial_history source = migration_serial_history_base source_id = 62e1509b-e217-4b9b-880c-2c3f2dddd8ec target = phd_framework::test_vm target_id = 5b8a0c1e-e9e0-466c-a763-c9756ccc1fad vm = migration_serial_history_base_lifecycle_0 vm_id = 5b8a0c1e-e9e0-466c-a763-c9756ccc1fad
872026-10-20T15:29:02.474ZINFOphd-runner: [MIGRATE - START] file = phd-tests/framework/src/test_vm/mod.rs line = 663 migration_id = 1d486fbd-4145-4225-931b-66367ef4ce10 path = phd_tests::migrate::from_base::serial_history source = migration_serial_history_base source_id = 62e1509b-e217-4b9b-880c-2c3f2dddd8ec target = phd_framework::test_vm target_id = 5b8a0c1e-e9e0-466c-a763-c9756ccc1fad
882026-10-20T15:29:05.012ZINFOphd-runner: [SERIAL CONSOLE TASK - EVENT] serial socket control message file = phd-tests/framework/src/serial/mod.rs line = 275 s = {"Migrating":{"destination":"127.0.0.1:9002","from_start":7756}} target = phd_framework::serial
892026-10-20T15:29:05.332ZINFOphd-runner: [MIGRATE_FROM - EVENT] Migration completed successfully file = phd-tests/framework/src/test_vm/mod.rs line = 676 path = phd_tests::migrate::from_base::serial_history source = migration_serial_history_base source_id = 62e1509b-e217-4b9b-880c-2c3f2dddd8ec target = phd_framework::test_vm target_id = 5b8a0c1e-e9e0-466c-a763-c9756ccc1fad
902026-10-20T15:29:05.332ZINFOphd-runner: [MIGRATE - END] elapsed_milliseconds = 2856 file = phd-tests/framework/src/test_vm/mod.rs line = 663 migration_id = 1d486fbd-4145-4225-931b-66367ef4ce10 path = phd_tests::migrate::from_base::serial_history source = migration_serial_history_base source_id = 62e1509b-e217-4b9b-880c-2c3f2dddd8ec target = phd_framework::test_vm target_id = 5b8a0c1e-e9e0-466c-a763-c9756ccc1fad
912026-10-20T15:29:05.335ZINFOphd-runner: [VM CLEANUP - START] file = phd-tests/framework/src/test_vm/mod.rs line = 1172 path = phd_tests::migrate::from_base::serial_history target = phd_framework::test_vm vm = migration_serial_history_base vm_id = 62e1509b-e217-4b9b-880c-2c3f2dddd8ec
922026-10-20T15:29:05.342ZDEBGphd-runner: [VM CLEANUP - EVENT] Killing Propolis server process file = phd-tests/framework/src/test_vm/server.rs line = 177 path = phd_tests::migrate::from_base::serial_history self.address = 127.0.0.1:9000 target = phd_framework::test_vm::server vm = migration_serial_history_base vm_id = 62e1509b-e217-4b9b-880c-2c3f2dddd8ec
932026-10-20T15:29:05.419ZINFOphd-runner: [VM CLEANUP - END] elapsed_milliseconds = 79 file = phd-tests/framework/src/test_vm/mod.rs line = 1172 path = phd_tests::migrate::from_base::serial_history target = phd_framework::test_vm vm = migration_serial_history_base vm_id = 62e1509b-e217-4b9b-880c-2c3f2dddd8ec
942026-10-20T15:29:05.419ZINFOphd-runner: [INSTANCE_ENSURE_INTERNAL - END] elapsed_milliseconds = 9269 file = phd-tests/framework/src/test_vm/mod.rs line = 412 path = phd_tests::migrate::from_base::serial_history target = phd_framework::test_vm vm = migration_serial_history_base vm_id = 62e1509b-e217-4b9b-880c-2c3f2dddd8ec
952026-10-20T15:29:05.424ZINFOphd-runner: [VM CLEANUP - START] file = phd-tests/framework/src/test_vm/mod.rs line = 1172 path = phd_tests::migrate::from_base::serial_history target = phd_framework::test_vm vm = migration_serial_history_base_lifecycle_0 vm_id = 5b8a0c1e-e9e0-466c-a763-c9756ccc1fad
962026-10-20T15:29:05.424ZDEBGphd-runner: [SERIAL CONSOLE TASK - EVENT] serial console command channel was closed file = phd-tests/framework/src/serial/mod.rs line = 213 target = phd_framework::serial
972026-10-20T15:29:05.424ZINFOphd-runner: [SERIAL CONSOLE TASK - END] elapsed_milliseconds = 8385 file = phd-tests/framework/src/serial/mod.rs line = 200 target = phd_framework::serial
982026-10-20T15:29:05.425ZDEBGphd-runner: [VM CLEANUP - EVENT] trying to ensure Propolis server VM is destroyed file = phd-tests/framework/src/test_vm/mod.rs line = 1195 path = phd_tests::migrate::from_base::serial_history target = phd_framework::test_vm vm = migration_serial_history_base_lifecycle_0 vm_id = 5b8a0c1e-e9e0-466c-a763-c9756ccc1fad
992026-10-20T15:29:05.426ZINFOphd-runner: test phd_tests::migrate::from_base::serial_history ... ok file = phd-tests/runner/src/execute.rs line = 141 target = phd_runner::execute
1002026-10-20T15:29:05.426ZINFOphd-runner: [TEST_CLEANUP - START] file = phd-tests/runner/src/fixtures.rs line = 51 target = phd_runner::fixtures
1012026-10-20T15:29:05.827ZDEBGphd-runner: [VM CLEANUP - EVENT] Killing Propolis server process file = phd-tests/framework/src/test_vm/server.rs line = 177 path = phd_tests::migrate::from_base::serial_history self.address = 127.0.0.1:9002 target = phd_framework::test_vm::server vm = migration_serial_history_base_lifecycle_0 vm_id = 5b8a0c1e-e9e0-466c-a763-c9756ccc1fad
1022026-10-20T15:29:05.916ZDEBGphd-runner: [VM CLEANUP - EVENT] zfs clone dropped file = phd-tests/framework/src/zfs.rs line = 83 path = phd_tests::migrate::from_base::serial_history target = phd_framework::zfs vm = migration_serial_history_base_lifecycle_0 vm_id = 5b8a0c1e-e9e0-466c-a763-c9756ccc1fad
1032026-10-20T15:29:05.916ZDEBGphd-runner: [VM CLEANUP - EVENT] executing ZFS command args = ["phd-artifacts/phd-clone-44acaec4-6d6c-4d93-862f-4893f1b8df4c"] file = phd-tests/framework/src/zfs.rs line = 304 path = phd_tests::migrate::from_base::serial_history target = phd_framework::zfs verb = destroy vm = migration_serial_history_base_lifecycle_0 vm_id = 5b8a0c1e-e9e0-466c-a763-c9756ccc1fad
1042026-10-20T15:29:05.942ZDEBGphd-runner: [VM CLEANUP - EVENT] zfs snapshot dropped file = phd-tests/framework/src/zfs.rs line = 57 path = phd_tests::migrate::from_base::serial_history target = phd_framework::zfs vm = migration_serial_history_base_lifecycle_0 vm_id = 5b8a0c1e-e9e0-466c-a763-c9756ccc1fad
1052026-10-20T15:29:05.942ZDEBGphd-runner: [VM CLEANUP - EVENT] executing ZFS command args = ["phd-artifacts@phd-ee1fa1ed-b589-4dd6-a055-1599375513fb"] file = phd-tests/framework/src/zfs.rs line = 304 path = phd_tests::migrate::from_base::serial_history target = phd_framework::zfs verb = destroy vm = migration_serial_history_base_lifecycle_0 vm_id = 5b8a0c1e-e9e0-466c-a763-c9756ccc1fad
1062026-10-20T15:29:05.960ZINFOphd-runner: [VM CLEANUP - END] elapsed_milliseconds = 536 file = phd-tests/framework/src/test_vm/mod.rs line = 1172 path = phd_tests::migrate::from_base::serial_history target = phd_framework::test_vm vm = migration_serial_history_base_lifecycle_0 vm_id = 5b8a0c1e-e9e0-466c-a763-c9756ccc1fad
1072026-10-20T15:29:05.961ZINFOphd-runner: [INSTANCE_ENSURE_INTERNAL - END] elapsed_milliseconds = 4125 file = phd-tests/framework/src/test_vm/mod.rs line = 412 path = phd_tests::migrate::from_base::serial_history source = migration_serial_history_base source_id = 62e1509b-e217-4b9b-880c-2c3f2dddd8ec target = phd_framework::test_vm target_id = 5b8a0c1e-e9e0-466c-a763-c9756ccc1fad vm = migration_serial_history_base_lifecycle_0 vm_id = 5b8a0c1e-e9e0-466c-a763-c9756ccc1fad
1082026-10-20T15:29:05.961ZINFOphd-runner: [TEST_CLEANUP - END] elapsed_milliseconds = 534 file = phd-tests/runner/src/fixtures.rs line = 51 target = phd_runner::fixtures
1092026-10-20T15:29:05.961ZINFOphd-runner: [MIGRATE_FROM - END] elapsed_milliseconds = 4126 file = phd-tests/framework/src/test_vm/mod.rs line = 609 path = phd_tests::migrate::from_base::serial_history source = migration_serial_history_base source_id = 62e1509b-e217-4b9b-880c-2c3f2dddd8ec target = phd_framework::test_vm target_id = 5b8a0c1e-e9e0-466c-a763-c9756ccc1fad
1102026-10-20T15:29:05.961ZINFOphd-runner: [TEST - END] elapsed_milliseconds = 61587 file = phd-tests/tests/src/migrate.rs line = 40 path = phd_tests::migrate::from_base::serial_history target = phd_tests::migrate::from_base
1112026-10-20T15:29:05.961ZINFOphd-runner: Starting test phd_tests::migrate::from_base::can_migrate_from_base file = phd-tests/runner/src/execute.rs line = 91 target = phd_runner::execute
1122026-10-20T15:29:05.961ZINFOphd-runner: [TEST_SETUP - START] file = phd-tests/runner/src/fixtures.rs line = 41 target = phd_runner::fixtures
1132026-10-20T15:29:05.961ZINFOphd-runner: [TEST_SETUP - END] elapsed_milliseconds = 0 file = phd-tests/runner/src/fixtures.rs line = 41 target = phd_runner::fixtures
1142026-10-20T15:29:05.961ZINFOphd-runner: [TEST - START] file = phd-tests/tests/src/migrate.rs line = 34 path = phd_tests::migrate::from_base::can_migrate_from_base target = phd_tests::migrate::from_base
1152026-10-20T15:29:05.961ZDEBGphd-runner: [TEST - EVENT] Verified artifact already exists file = phd-tests/framework/src/artifacts/store.rs line = 45 path = /phd-artifacts/740187046a7267d0de72d3455070333547dbc0ea023531471fb2b2a61effa448/OVMF_CODE.fd target = phd_framework::artifacts::store
1162026-10-20T15:29:05.961ZDEBGphd-runner: [TEST - EVENT] Verified artifact already exists file = phd-tests/framework/src/artifacts/store.rs line = 45 path = /phd-artifacts/ba8007f74f9b54fbae3b2520da577831b4834778a498d732f091260c61aa7ca1/alpine.iso target = phd_framework::artifacts::store
1172026-10-20T15:29:05.961ZDEBGphd-runner: [TEST - EVENT] Verified artifact already exists file = phd-tests/framework/src/artifacts/store.rs line = 45 path = /phd-artifacts/ba8007f74f9b54fbae3b2520da577831b4834778a498d732f091260c61aa7ca1/alpine.iso target = phd_framework::artifacts::store
1182026-10-20T15:29:05.961ZDEBGphd-runner: [TEST - EVENT] executing ZFS command args = ["/phd-artifacts/ba8007f74f9b54fbae3b2520da577831b4834778a498d732f091260c61aa7ca1/alpine.iso"] file = phd-tests/framework/src/zfs.rs line = 304 path = phd_tests::migrate::from_base::can_migrate_from_base target = phd_framework::zfs verb = list
1192026-10-20T15:29:05.973ZDEBGphd-runner: [TEST - EVENT] parsing zfs list output file = phd-tests/framework/src/zfs.rs line = 238 path = phd_tests::migrate::from_base::can_migrate_from_base stdout = NAME USED AVAIL REFER MOUNTPOINT\nphd-artifacts 1.31G 25.3T 1.31G /phd-artifacts\n target = phd_framework::zfs
1202026-10-20T15:29:05.973ZDEBGphd-runner: [TEST - EVENT] executing ZFS command args = ["phd-artifacts@phd-b8449e09-c423-41db-a771-8a4eae723754"] file = phd-tests/framework/src/zfs.rs line = 304 path = phd_tests::migrate::from_base::can_migrate_from_base target = phd_framework::zfs verb = snapshot
1212026-10-20T15:29:05.992ZDEBGphd-runner: [TEST - EVENT] executing ZFS command args = ["phd-artifacts@phd-b8449e09-c423-41db-a771-8a4eae723754", "phd-artifacts/phd-clone-a43c7d8d-54c2-44de-a683-3ecdf12a7b05"] file = phd-tests/framework/src/zfs.rs line = 304 path = phd_tests::migrate::from_base::can_migrate_from_base target = phd_framework::zfs verb = clone
1222026-10-20T15:29:06.010ZDEBGphd-runner: [TEST - EVENT] executing ZFS command args = ["phd-artifacts/phd-clone-a43c7d8d-54c2-44de-a683-3ecdf12a7b05"] file = phd-tests/framework/src/zfs.rs line = 304 path = phd_tests::migrate::from_base::can_migrate_from_base target = phd_framework::zfs verb = list
1232026-10-20T15:29:06.021ZDEBGphd-runner: [TEST - EVENT] parsing zfs list output file = phd-tests/framework/src/zfs.rs line = 238 path = phd_tests::migrate::from_base::can_migrate_from_base stdout = NAME USED AVAIL REFER MOUNTPOINT\nphd-artifacts/phd-clone-a43c7d8d-54c2-44de-a683-3ecdf12a7b05 0B 25.3T 1.31G /phd-artifacts/phd-clone-a43c7d8d-54c2-44de-a683-3ecdf12a7b05\n target = phd_framework::zfs
1242026-10-20T15:29:06.022ZINFOphd-runner: [NEW - START] file = phd-tests/framework/src/test_vm/mod.rs line = 300 path = phd_tests::migrate::from_base::can_migrate_from_base target = phd_framework::test_vm
1252026-10-20T15:29:06.022ZINFOphd-runner: [NEW - EVENT] phd_framework::test_vm environment = EnvironmentSpec { location: Local, propolis_artifact: "__BASE_PROPOLIS", metrics: None } file = phd-tests/framework/src/test_vm/mod.rs guest_os_kind = Alpine line = 318 path = phd_tests::migrate::from_base::can_migrate_from_base target = phd_framework::test_vm vm_name = migration_from_base
1262026-10-20T15:29:06.022ZDEBGphd-runner: [NEW - EVENT] Verified artifact already exists file = phd-tests/framework/src/artifacts/store.rs line = 45 path = /phd-artifacts/739eeb04a4728b2e7609b038a587b5de0d939c2a02cf61882a60d42a6ba676e1/propolis-server target = phd_framework::artifacts::store
1272026-10-20T15:29:06.022ZINFOphd-runner: [NEW - EVENT] Launching Propolis server bootrom_path = "/phd-artifacts/740187046a7267d0de72d3455070333547dbc0ea023531471fb2b2a61effa448/OVMF_CODE.fd" file = phd-tests/framework/src/test_vm/server.rs line = 66 path = phd_tests::migrate::from_base::can_migrate_from_base server_addr = 127.0.0.1:9000 server_path = "/phd-artifacts/739eeb04a4728b2e7609b038a587b5de0d939c2a02cf61882a60d42a6ba676e1/propolis-server" target = phd_framework::test_vm::server
1282026-10-20T15:29:06.022ZINFOphd-runner: [NEW - EVENT] Opening server log files file = phd-tests/framework/src/log_config.rs line = 84 path = phd_tests::migrate::from_base::can_migrate_from_base stderr_path = "/tmp/propolis-phd/phd_tests::migrate::from_base::can_migrate_from_base/migration_from_base.stderr.log" stdout_path = "/tmp/propolis-phd/phd_tests::migrate::from_base::can_migrate_from_base/migration_from_base.stdout.log" target = phd_framework::log_config
1292026-10-20T15:29:06.069ZINFOphd-runner: [NEW - EVENT] Launched server with pid 927 file = phd-tests/framework/src/test_vm/server.rs line = 127 path = phd_tests::migrate::from_base::can_migrate_from_base target = phd_framework::test_vm::server
1302026-10-20T15:29:06.083ZINFOphd-runner: [NEW - END] elapsed_milliseconds = 60 file = phd-tests/framework/src/test_vm/mod.rs line = 300 path = phd_tests::migrate::from_base::can_migrate_from_base target = phd_framework::test_vm
1312026-10-20T15:29:06.083ZINFOphd-runner: [INSTANCE_ENSURE_INTERNAL - START] file = phd-tests/framework/src/test_vm/mod.rs line = 412 path = phd_tests::migrate::from_base::can_migrate_from_base target = phd_framework::test_vm vm = migration_from_base vm_id = a5473bd5-e34a-4a10-9a7c-ba5181304d81
1322026-10-20T15:29:06.083ZINFOphd-runner: [INSTANCE_ENSURE_INTERNAL - EVENT] retriable error from instance_spec_ensure e = Communication Error: error sending request for url (http://127.0.0.1:9000/instance) file = phd-tests/framework/src/test_vm/mod.rs line = 455 path = phd_tests::migrate::from_base::can_migrate_from_base target = phd_framework::test_vm vm = migration_from_base vm_id = a5473bd5-e34a-4a10-9a7c-ba5181304d81
1332026-10-20T15:29:06.649ZINFOphd-runner: [SERIAL CONSOLE TASK - START] file = phd-tests/framework/src/serial/mod.rs line = 200 target = phd_framework::serial
1342026-10-20T15:29:06.650ZINFOphd-runner: [INSTANCE_ENSURE_INTERNAL - EVENT] Started instance file = phd-tests/framework/src/test_vm/mod.rs instance_description.instance = Instance { properties: InstanceProperties { id: a5473bd5-e34a-4a10-9a7c-ba5181304d81, name: "phd-vm-a5473bd5-e34a-4a10-9a7c-ba5181304d81", description: "Pheidippides-managed VM", metadata: InstanceMetadata { silo_id: ddd4eb48-2a34-44ac-84db-e6edc52803dd, project_id: 9507e2af-b75d-4b1f-a711-714a69f5799e, sled_id: 6875f90b-4ef1-49aa-b435-94abbeb96e3a, sled_serial: "6875f90b-4ef1-49aa-b435-94abbeb96e3a", sled_revision: 1, sled_model: "pheidippes" } }, state: Creating } line = 514 path = phd_tests::migrate::from_base::can_migrate_from_base target = phd_framework::test_vm vm = migration_from_base vm_id = a5473bd5-e34a-4a10-9a7c-ba5181304d81
1352026-10-20T15:29:06.650ZINFOphd-runner: [PUT_INSTANCE_STATE - START] file = phd-tests/framework/src/test_vm/mod.rs line = 575 path = phd_tests::migrate::from_base::can_migrate_from_base target = phd_framework::test_vm vm = migration_from_base vm_id = a5473bd5-e34a-4a10-9a7c-ba5181304d81
1362026-10-20T15:29:06.650ZINFOphd-runner: [PUT_INSTANCE_STATE - EVENT] Requesting instance state change file = phd-tests/framework/src/test_vm/mod.rs line = 580 path = phd_tests::migrate::from_base::can_migrate_from_base state = Run target = phd_framework::test_vm vm = migration_from_base vm_id = a5473bd5-e34a-4a10-9a7c-ba5181304d81
1372026-10-20T15:29:06.651ZINFOphd-runner: [PUT_INSTANCE_STATE - END] elapsed_milliseconds = 1 file = phd-tests/framework/src/test_vm/mod.rs line = 575 path = phd_tests::migrate::from_base::can_migrate_from_base target = phd_framework::test_vm vm = migration_from_base vm_id = a5473bd5-e34a-4a10-9a7c-ba5181304d81
1382026-10-20T15:29:06.651ZINFOphd-runner: [WAIT_TO_BOOT - START] file = phd-tests/framework/src/test_vm/mod.rs line = 890 path = phd_tests::migrate::from_base::can_migrate_from_base target = phd_framework::test_vm
1392026-10-20T15:29:06.651ZINFOphd-runner: [WAIT_TO_BOOT - EVENT] waiting for guest to boot file = phd-tests/framework/src/test_vm/mod.rs line = 839 path = phd_tests::migrate::from_base::can_migrate_from_base target = phd_framework::test_vm timeout_duration = 300s vm = migration_from_base vm_id = a5473bd5-e34a-4a10-9a7c-ba5181304d81
1402026-10-20T15:29:06.651ZDEBGphd-runner: [WAIT_TO_BOOT - EVENT] executing command in boot sequence file = phd-tests/framework/src/test_vm/mod.rs line = 847 path = phd_tests::migrate::from_base::can_migrate_from_base step = WaitFor("localhost login: ") target = phd_framework::test_vm
1412026-10-20T15:29:06.651ZINFOphd-runner: [WAIT_FOR_SERIAL_OUTPUT - START] file = phd-tests/framework/src/test_vm/mod.rs line = 913 path = phd_tests::migrate::from_base::can_migrate_from_base target = phd_framework::test_vm vm = migration_from_base vm_id = a5473bd5-e34a-4a10-9a7c-ba5181304d81
1422026-10-20T15:29:06.651ZINFOphd-runner: [WAIT_FOR_SERIAL_OUTPUT - EVENT] Waiting for output on serial console file = phd-tests/framework/src/test_vm/mod.rs line = 920 path = phd_tests::migrate::from_base::can_migrate_from_base target = phd_framework::test_vm timeout_duration = CallerTimeout vm = migration_from_base vm_id = a5473bd5-e34a-4a10-9a7c-ba5181304d81
1432026-10-20T15:29:11.200ZINFOphd-runner: [WAIT_FOR_SERIAL_OUTPUT - END] elapsed_milliseconds = 4548 file = phd-tests/framework/src/test_vm/mod.rs line = 913 path = phd_tests::migrate::from_base::can_migrate_from_base target = phd_framework::test_vm vm = migration_from_base vm_id = a5473bd5-e34a-4a10-9a7c-ba5181304d81
1442026-10-20T15:29:11.200ZDEBGphd-runner: [WAIT_TO_BOOT - EVENT] executing command in boot sequence file = phd-tests/framework/src/test_vm/mod.rs line = 847 path = phd_tests::migrate::from_base::can_migrate_from_base step = WriteStr("root") target = phd_framework::test_vm
1452026-10-20T15:29:11.200ZDEBGphd-runner: [WAIT_TO_BOOT - EVENT] executing command in boot sequence file = phd-tests/framework/src/test_vm/mod.rs line = 847 path = phd_tests::migrate::from_base::can_migrate_from_base step = WaitFor("localhost:~#") target = phd_framework::test_vm
1462026-10-20T15:29:11.201ZINFOphd-runner: [WAIT_FOR_SERIAL_OUTPUT - START] file = phd-tests/framework/src/test_vm/mod.rs line = 913 path = phd_tests::migrate::from_base::can_migrate_from_base target = phd_framework::test_vm vm = migration_from_base vm_id = a5473bd5-e34a-4a10-9a7c-ba5181304d81
1472026-10-20T15:29:11.201ZINFOphd-runner: [WAIT_FOR_SERIAL_OUTPUT - EVENT] Waiting for output on serial console file = phd-tests/framework/src/test_vm/mod.rs line = 920 path = phd_tests::migrate::from_base::can_migrate_from_base target = phd_framework::test_vm timeout_duration = CallerTimeout vm = migration_from_base vm_id = a5473bd5-e34a-4a10-9a7c-ba5181304d81
1482026-10-20T15:29:11.219ZINFOphd-runner: [WAIT_FOR_SERIAL_OUTPUT - END] elapsed_milliseconds = 18 file = phd-tests/framework/src/test_vm/mod.rs line = 913 path = phd_tests::migrate::from_base::can_migrate_from_base target = phd_framework::test_vm vm = migration_from_base vm_id = a5473bd5-e34a-4a10-9a7c-ba5181304d81
1492026-10-20T15:29:11.219ZDEBGphd-runner: [WAIT_TO_BOOT - EVENT] executing command in boot sequence file = phd-tests/framework/src/test_vm/mod.rs line = 847 path = phd_tests::migrate::from_base::can_migrate_from_base step = WriteStr("stty -F `tty` cols 9999") target = phd_framework::test_vm
1502026-10-20T15:29:11.220ZDEBGphd-runner: [WAIT_TO_BOOT - EVENT] executing command in boot sequence file = phd-tests/framework/src/test_vm/mod.rs line = 847 path = phd_tests::migrate::from_base::can_migrate_from_base step = WaitFor("localhost:~#") target = phd_framework::test_vm
1512026-10-20T15:29:11.220ZINFOphd-runner: [WAIT_FOR_SERIAL_OUTPUT - START] file = phd-tests/framework/src/test_vm/mod.rs line = 913 path = phd_tests::migrate::from_base::can_migrate_from_base target = phd_framework::test_vm vm = migration_from_base vm_id = a5473bd5-e34a-4a10-9a7c-ba5181304d81
1522026-10-20T15:29:11.220ZINFOphd-runner: [WAIT_FOR_SERIAL_OUTPUT - EVENT] Waiting for output on serial console file = phd-tests/framework/src/test_vm/mod.rs line = 920 path = phd_tests::migrate::from_base::can_migrate_from_base target = phd_framework::test_vm timeout_duration = CallerTimeout vm = migration_from_base vm_id = a5473bd5-e34a-4a10-9a7c-ba5181304d81
1532026-10-20T15:29:11.251ZINFOphd-runner: [WAIT_FOR_SERIAL_OUTPUT - END] elapsed_milliseconds = 31 file = phd-tests/framework/src/test_vm/mod.rs line = 913 path = phd_tests::migrate::from_base::can_migrate_from_base target = phd_framework::test_vm vm = migration_from_base vm_id = a5473bd5-e34a-4a10-9a7c-ba5181304d81
1542026-10-20T15:29:11.251ZINFOphd-runner: [WAIT_TO_BOOT - EVENT] Guest has booted file = phd-tests/framework/src/test_vm/mod.rs line = 887 path = phd_tests::migrate::from_base::can_migrate_from_base target = phd_framework::test_vm
1552026-10-20T15:29:11.251ZINFOphd-runner: [WAIT_TO_BOOT - END] elapsed_milliseconds = 4599 file = phd-tests/framework/src/test_vm/mod.rs line = 890 path = phd_tests::migrate::from_base::can_migrate_from_base target = phd_framework::test_vm
1562026-10-20T15:29:11.252ZINFOphd-runner: [WAIT_FOR_SERIAL_OUTPUT - START] file = phd-tests/framework/src/test_vm/mod.rs line = 913 path = phd_tests::migrate::from_base::can_migrate_from_base target = phd_framework::test_vm vm = migration_from_base vm_id = a5473bd5-e34a-4a10-9a7c-ba5181304d81
1572026-10-20T15:29:11.252ZINFOphd-runner: [WAIT_FOR_SERIAL_OUTPUT - EVENT] Waiting for output on serial console file = phd-tests/framework/src/test_vm/mod.rs line = 920 path = phd_tests::migrate::from_base::can_migrate_from_base target = phd_framework::test_vm timeout_duration = Explicit(15s) vm = migration_from_base vm_id = a5473bd5-e34a-4a10-9a7c-ba5181304d81
1582026-10-20T15:29:11.262ZINFOphd-runner: [WAIT_FOR_SERIAL_OUTPUT - END] elapsed_milliseconds = 10 file = phd-tests/framework/src/test_vm/mod.rs line = 913 path = phd_tests::migrate::from_base::can_migrate_from_base target = phd_framework::test_vm vm = migration_from_base vm_id = a5473bd5-e34a-4a10-9a7c-ba5181304d81
1592026-10-20T15:29:11.263ZINFOphd-runner: [WAIT_FOR_SERIAL_OUTPUT - START] file = phd-tests/framework/src/test_vm/mod.rs line = 913 path = phd_tests::migrate::from_base::can_migrate_from_base target = phd_framework::test_vm vm = migration_from_base vm_id = a5473bd5-e34a-4a10-9a7c-ba5181304d81
1602026-10-20T15:29:11.263ZINFOphd-runner: [WAIT_FOR_SERIAL_OUTPUT - EVENT] Waiting for output on serial console file = phd-tests/framework/src/test_vm/mod.rs line = 920 path = phd_tests::migrate::from_base::can_migrate_from_base target = phd_framework::test_vm timeout_duration = Explicit(300s) vm = migration_from_base vm_id = a5473bd5-e34a-4a10-9a7c-ba5181304d81
1612026-10-20T15:29:11.296ZINFOphd-runner: [WAIT_FOR_SERIAL_OUTPUT - END] elapsed_milliseconds = 33 file = phd-tests/framework/src/test_vm/mod.rs line = 913 path = phd_tests::migrate::from_base::can_migrate_from_base target = phd_framework::test_vm vm = migration_from_base vm_id = a5473bd5-e34a-4a10-9a7c-ba5181304d81
1622026-10-20T15:29:11.296ZINFOphd-runner: [WAIT_FOR_SERIAL_OUTPUT - START] file = phd-tests/framework/src/test_vm/mod.rs line = 913 path = phd_tests::migrate::from_base::can_migrate_from_base target = phd_framework::test_vm vm = migration_from_base vm_id = a5473bd5-e34a-4a10-9a7c-ba5181304d81
1632026-10-20T15:29:11.297ZINFOphd-runner: [WAIT_FOR_SERIAL_OUTPUT - EVENT] Waiting for output on serial console file = phd-tests/framework/src/test_vm/mod.rs line = 920 path = phd_tests::migrate::from_base::can_migrate_from_base target = phd_framework::test_vm timeout_duration = Explicit(15s) vm = migration_from_base vm_id = a5473bd5-e34a-4a10-9a7c-ba5181304d81
1642026-10-20T15:29:11.307ZINFOphd-runner: [WAIT_FOR_SERIAL_OUTPUT - END] elapsed_milliseconds = 10 file = phd-tests/framework/src/test_vm/mod.rs line = 913 path = phd_tests::migrate::from_base::can_migrate_from_base target = phd_framework::test_vm vm = migration_from_base vm_id = a5473bd5-e34a-4a10-9a7c-ba5181304d81
1652026-10-20T15:29:11.308ZINFOphd-runner: [WAIT_FOR_SERIAL_OUTPUT - START] file = phd-tests/framework/src/test_vm/mod.rs line = 913 path = phd_tests::migrate::from_base::can_migrate_from_base target = phd_framework::test_vm vm = migration_from_base vm_id = a5473bd5-e34a-4a10-9a7c-ba5181304d81
1662026-10-20T15:29:11.308ZINFOphd-runner: [WAIT_FOR_SERIAL_OUTPUT - EVENT] Waiting for output on serial console file = phd-tests/framework/src/test_vm/mod.rs line = 920 path = phd_tests::migrate::from_base::can_migrate_from_base target = phd_framework::test_vm timeout_duration = Explicit(300s) vm = migration_from_base vm_id = a5473bd5-e34a-4a10-9a7c-ba5181304d81
1672026-10-20T15:29:11.340ZINFOphd-runner: [WAIT_FOR_SERIAL_OUTPUT - END] elapsed_milliseconds = 32 file = phd-tests/framework/src/test_vm/mod.rs line = 913 path = phd_tests::migrate::from_base::can_migrate_from_base target = phd_framework::test_vm vm = migration_from_base vm_id = a5473bd5-e34a-4a10-9a7c-ba5181304d81
1682026-10-20T15:29:11.341ZINFOphd-runner: [WAIT_FOR_SERIAL_OUTPUT - START] file = phd-tests/framework/src/test_vm/mod.rs line = 913 path = phd_tests::migrate::from_base::can_migrate_from_base target = phd_framework::test_vm vm = migration_from_base vm_id = a5473bd5-e34a-4a10-9a7c-ba5181304d81
1692026-10-20T15:29:11.341ZINFOphd-runner: [WAIT_FOR_SERIAL_OUTPUT - EVENT] Waiting for output on serial console file = phd-tests/framework/src/test_vm/mod.rs line = 920 path = phd_tests::migrate::from_base::can_migrate_from_base target = phd_framework::test_vm timeout_duration = Explicit(15s) vm = migration_from_base vm_id = a5473bd5-e34a-4a10-9a7c-ba5181304d81
1702026-10-20T15:29:11.352ZINFOphd-runner: [WAIT_FOR_SERIAL_OUTPUT - END] elapsed_milliseconds = 10 file = phd-tests/framework/src/test_vm/mod.rs line = 913 path = phd_tests::migrate::from_base::can_migrate_from_base target = phd_framework::test_vm vm = migration_from_base vm_id = a5473bd5-e34a-4a10-9a7c-ba5181304d81
1712026-10-20T15:29:11.352ZINFOphd-runner: [WAIT_FOR_SERIAL_OUTPUT - START] file = phd-tests/framework/src/test_vm/mod.rs line = 913 path = phd_tests::migrate::from_base::can_migrate_from_base target = phd_framework::test_vm vm = migration_from_base vm_id = a5473bd5-e34a-4a10-9a7c-ba5181304d81
1722026-10-20T15:29:11.352ZINFOphd-runner: [WAIT_FOR_SERIAL_OUTPUT - EVENT] Waiting for output on serial console file = phd-tests/framework/src/test_vm/mod.rs line = 920 path = phd_tests::migrate::from_base::can_migrate_from_base target = phd_framework::test_vm timeout_duration = Explicit(300s) vm = migration_from_base vm_id = a5473bd5-e34a-4a10-9a7c-ba5181304d81
1732026-10-20T15:29:11.385ZINFOphd-runner: [WAIT_FOR_SERIAL_OUTPUT - END] elapsed_milliseconds = 32 file = phd-tests/framework/src/test_vm/mod.rs line = 913 path = phd_tests::migrate::from_base::can_migrate_from_base target = phd_framework::test_vm vm = migration_from_base vm_id = a5473bd5-e34a-4a10-9a7c-ba5181304d81
1742026-10-20T15:29:11.385ZINFOphd-runner: [WAIT_FOR_SERIAL_OUTPUT - START] file = phd-tests/framework/src/test_vm/mod.rs line = 913 path = phd_tests::migrate::from_base::can_migrate_from_base target = phd_framework::test_vm vm = migration_from_base vm_id = a5473bd5-e34a-4a10-9a7c-ba5181304d81
1752026-10-20T15:29:11.385ZINFOphd-runner: [WAIT_FOR_SERIAL_OUTPUT - EVENT] Waiting for output on serial console file = phd-tests/framework/src/test_vm/mod.rs line = 920 path = phd_tests::migrate::from_base::can_migrate_from_base target = phd_framework::test_vm timeout_duration = Explicit(15s) vm = migration_from_base vm_id = a5473bd5-e34a-4a10-9a7c-ba5181304d81
1762026-10-20T15:29:11.396ZINFOphd-runner: [WAIT_FOR_SERIAL_OUTPUT - END] elapsed_milliseconds = 10 file = phd-tests/framework/src/test_vm/mod.rs line = 913 path = phd_tests::migrate::from_base::can_migrate_from_base target = phd_framework::test_vm vm = migration_from_base vm_id = a5473bd5-e34a-4a10-9a7c-ba5181304d81
1772026-10-20T15:29:11.396ZINFOphd-runner: [WAIT_FOR_SERIAL_OUTPUT - START] file = phd-tests/framework/src/test_vm/mod.rs line = 913 path = phd_tests::migrate::from_base::can_migrate_from_base target = phd_framework::test_vm vm = migration_from_base vm_id = a5473bd5-e34a-4a10-9a7c-ba5181304d81
1782026-10-20T15:29:11.396ZINFOphd-runner: [WAIT_FOR_SERIAL_OUTPUT - EVENT] Waiting for output on serial console file = phd-tests/framework/src/test_vm/mod.rs line = 920 path = phd_tests::migrate::from_base::can_migrate_from_base target = phd_framework::test_vm timeout_duration = Explicit(300s) vm = migration_from_base vm_id = a5473bd5-e34a-4a10-9a7c-ba5181304d81
1792026-10-20T15:29:11.429ZINFOphd-runner: [WAIT_FOR_SERIAL_OUTPUT - END] elapsed_milliseconds = 32 file = phd-tests/framework/src/test_vm/mod.rs line = 913 path = phd_tests::migrate::from_base::can_migrate_from_base target = phd_framework::test_vm vm = migration_from_base vm_id = a5473bd5-e34a-4a10-9a7c-ba5181304d81
1802026-10-20T15:29:11.429ZINFOphd-runner: [WAIT_FOR_SERIAL_OUTPUT - START] file = phd-tests/framework/src/test_vm/mod.rs line = 913 path = phd_tests::migrate::from_base::can_migrate_from_base target = phd_framework::test_vm vm = migration_from_base vm_id = a5473bd5-e34a-4a10-9a7c-ba5181304d81
1812026-10-20T15:29:11.430ZINFOphd-runner: [WAIT_FOR_SERIAL_OUTPUT - EVENT] Waiting for output on serial console file = phd-tests/framework/src/test_vm/mod.rs line = 920 path = phd_tests::migrate::from_base::can_migrate_from_base target = phd_framework::test_vm timeout_duration = Explicit(15s) vm = migration_from_base vm_id = a5473bd5-e34a-4a10-9a7c-ba5181304d81
1822026-10-20T15:29:11.440ZINFOphd-runner: [WAIT_FOR_SERIAL_OUTPUT - END] elapsed_milliseconds = 10 file = phd-tests/framework/src/test_vm/mod.rs line = 913 path = phd_tests::migrate::from_base::can_migrate_from_base target = phd_framework::test_vm vm = migration_from_base vm_id = a5473bd5-e34a-4a10-9a7c-ba5181304d81
1832026-10-20T15:29:11.441ZINFOphd-runner: [WAIT_FOR_SERIAL_OUTPUT - START] file = phd-tests/framework/src/test_vm/mod.rs line = 913 path = phd_tests::migrate::from_base::can_migrate_from_base target = phd_framework::test_vm vm = migration_from_base vm_id = a5473bd5-e34a-4a10-9a7c-ba5181304d81
1842026-10-20T15:29:11.441ZINFOphd-runner: [WAIT_FOR_SERIAL_OUTPUT - EVENT] Waiting for output on serial console file = phd-tests/framework/src/test_vm/mod.rs line = 920 path = phd_tests::migrate::from_base::can_migrate_from_base target = phd_framework::test_vm timeout_duration = Explicit(300s) vm = migration_from_base vm_id = a5473bd5-e34a-4a10-9a7c-ba5181304d81
1852026-10-20T15:29:11.473ZINFOphd-runner: [WAIT_FOR_SERIAL_OUTPUT - END] elapsed_milliseconds = 32 file = phd-tests/framework/src/test_vm/mod.rs line = 913 path = phd_tests::migrate::from_base::can_migrate_from_base target = phd_framework::test_vm vm = migration_from_base vm_id = a5473bd5-e34a-4a10-9a7c-ba5181304d81
1862026-10-20T15:29:11.475ZINFOphd-runner: [WAIT_FOR_SERIAL_OUTPUT - START] file = phd-tests/framework/src/test_vm/mod.rs line = 913 path = phd_tests::migrate::from_base::can_migrate_from_base target = phd_framework::test_vm vm = migration_from_base vm_id = a5473bd5-e34a-4a10-9a7c-ba5181304d81
1872026-10-20T15:29:11.475ZINFOphd-runner: [WAIT_FOR_SERIAL_OUTPUT - EVENT] Waiting for output on serial console file = phd-tests/framework/src/test_vm/mod.rs line = 920 path = phd_tests::migrate::from_base::can_migrate_from_base target = phd_framework::test_vm timeout_duration = Explicit(15s) vm = migration_from_base vm_id = a5473bd5-e34a-4a10-9a7c-ba5181304d81
1882026-10-20T15:29:11.485ZINFOphd-runner: [WAIT_FOR_SERIAL_OUTPUT - END] elapsed_milliseconds = 9 file = phd-tests/framework/src/test_vm/mod.rs line = 913 path = phd_tests::migrate::from_base::can_migrate_from_base target = phd_framework::test_vm vm = migration_from_base vm_id = a5473bd5-e34a-4a10-9a7c-ba5181304d81
1892026-10-20T15:29:11.485ZINFOphd-runner: [WAIT_FOR_SERIAL_OUTPUT - START] file = phd-tests/framework/src/test_vm/mod.rs line = 913 path = phd_tests::migrate::from_base::can_migrate_from_base target = phd_framework::test_vm vm = migration_from_base vm_id = a5473bd5-e34a-4a10-9a7c-ba5181304d81
1902026-10-20T15:29:11.485ZINFOphd-runner: [WAIT_FOR_SERIAL_OUTPUT - EVENT] Waiting for output on serial console file = phd-tests/framework/src/test_vm/mod.rs line = 920 path = phd_tests::migrate::from_base::can_migrate_from_base target = phd_framework::test_vm timeout_duration = Explicit(300s) vm = migration_from_base vm_id = a5473bd5-e34a-4a10-9a7c-ba5181304d81
1912026-10-20T15:29:11.517ZINFOphd-runner: [WAIT_FOR_SERIAL_OUTPUT - END] elapsed_milliseconds = 32 file = phd-tests/framework/src/test_vm/mod.rs line = 913 path = phd_tests::migrate::from_base::can_migrate_from_base target = phd_framework::test_vm vm = migration_from_base vm_id = a5473bd5-e34a-4a10-9a7c-ba5181304d81
1922026-10-20T15:29:11.517ZINFOphd-runner: [TEST - EVENT] migrating to new Propolis artifact for lifecycle test file = phd-tests/framework/src/lifecycle.rs line = 73 path = phd_tests::migrate::from_base::can_migrate_from_base propolis_artifact = __DEFAULT_PROPOLIS target = phd_framework::lifecycle vm_name = migration_from_base
1932026-10-20T15:29:11.517ZINFOphd-runner: [NEW - START] file = phd-tests/framework/src/test_vm/mod.rs line = 300 path = phd_tests::migrate::from_base::can_migrate_from_base target = phd_framework::test_vm
1942026-10-20T15:29:11.517ZINFOphd-runner: [NEW - EVENT] phd_framework::test_vm environment = EnvironmentSpec { location: Local, propolis_artifact: "__DEFAULT_PROPOLIS", metrics: None } file = phd-tests/framework/src/test_vm/mod.rs guest_os_kind = Alpine line = 318 path = phd_tests::migrate::from_base::can_migrate_from_base target = phd_framework::test_vm vm_name = migration_from_base_lifecycle_0
1952026-10-20T15:29:11.517ZDEBGphd-runner: [NEW - EVENT] Verified artifact already exists file = phd-tests/framework/src/artifacts/store.rs line = 45 path = /work/phd-test/propolis-server target = phd_framework::artifacts::store
1962026-10-20T15:29:11.518ZINFOphd-runner: [NEW - EVENT] Launching Propolis server bootrom_path = "/phd-artifacts/740187046a7267d0de72d3455070333547dbc0ea023531471fb2b2a61effa448/OVMF_CODE.fd" file = phd-tests/framework/src/test_vm/server.rs line = 66 path = phd_tests::migrate::from_base::can_migrate_from_base server_addr = 127.0.0.1:9002 server_path = "/work/phd-test/propolis-server" target = phd_framework::test_vm::server
1972026-10-20T15:29:11.518ZINFOphd-runner: [NEW - EVENT] Opening server log files file = phd-tests/framework/src/log_config.rs line = 84 path = phd_tests::migrate::from_base::can_migrate_from_base stderr_path = "/tmp/propolis-phd/phd_tests::migrate::from_base::can_migrate_from_base/migration_from_base_lifecycle_0.stderr.log" stdout_path = "/tmp/propolis-phd/phd_tests::migrate::from_base::can_migrate_from_base/migration_from_base_lifecycle_0.stdout.log" target = phd_framework::log_config
1982026-10-20T15:29:11.563ZINFOphd-runner: [NEW - EVENT] Launched server with pid 928 file = phd-tests/framework/src/test_vm/server.rs line = 127 path = phd_tests::migrate::from_base::can_migrate_from_base target = phd_framework::test_vm::server
1992026-10-20T15:29:11.576ZINFOphd-runner: [NEW - END] elapsed_milliseconds = 59 file = phd-tests/framework/src/test_vm/mod.rs line = 300 path = phd_tests::migrate::from_base::can_migrate_from_base target = phd_framework::test_vm
2002026-10-20T15:29:11.577ZINFOphd-runner: [MIGRATE_FROM - START] file = phd-tests/framework/src/test_vm/mod.rs line = 609 path = phd_tests::migrate::from_base::can_migrate_from_base source = migration_from_base source_id = a5473bd5-e34a-4a10-9a7c-ba5181304d81 target = phd_framework::test_vm target_id = be94e3f2-6ca8-458d-93a5-8b8fdf7647f2
2012026-10-20T15:29:11.577ZINFOphd-runner: [MIGRATE_FROM - EVENT] Migrating from source at address 127.0.0.1:9000 file = phd-tests/framework/src/test_vm/mod.rs line = 642 migration_id = 9082f382-f47b-4e0e-bf35-87068664c121 path = phd_tests::migrate::from_base::can_migrate_from_base source = migration_from_base source_id = a5473bd5-e34a-4a10-9a7c-ba5181304d81 target = phd_framework::test_vm target_id = be94e3f2-6ca8-458d-93a5-8b8fdf7647f2 timeout_duration = 45s
2022026-10-20T15:29:11.577ZINFOphd-runner: [INSTANCE_ENSURE_INTERNAL - START] file = phd-tests/framework/src/test_vm/mod.rs line = 412 path = phd_tests::migrate::from_base::can_migrate_from_base source = migration_from_base source_id = a5473bd5-e34a-4a10-9a7c-ba5181304d81 target = phd_framework::test_vm target_id = be94e3f2-6ca8-458d-93a5-8b8fdf7647f2 vm = migration_from_base_lifecycle_0 vm_id = be94e3f2-6ca8-458d-93a5-8b8fdf7647f2
2032026-10-20T15:29:11.577ZINFOphd-runner: [INSTANCE_ENSURE_INTERNAL - EVENT] retriable error from instance_spec_ensure e = Communication Error: error sending request for url (http://127.0.0.1:9002/instance) file = phd-tests/framework/src/test_vm/mod.rs line = 455 path = phd_tests::migrate::from_base::can_migrate_from_base source = migration_from_base source_id = a5473bd5-e34a-4a10-9a7c-ba5181304d81 target = phd_framework::test_vm target_id = be94e3f2-6ca8-458d-93a5-8b8fdf7647f2 vm = migration_from_base_lifecycle_0 vm_id = be94e3f2-6ca8-458d-93a5-8b8fdf7647f2
2042026-10-20T15:29:12.143ZINFOphd-runner: [INSTANCE_ENSURE_INTERNAL - EVENT] Started instance file = phd-tests/framework/src/test_vm/mod.rs instance_description.instance = Instance { properties: InstanceProperties { id: be94e3f2-6ca8-458d-93a5-8b8fdf7647f2, name: "phd-vm-be94e3f2-6ca8-458d-93a5-8b8fdf7647f2", description: "Pheidippides-managed VM", metadata: InstanceMetadata { silo_id: ddd4eb48-2a34-44ac-84db-e6edc52803dd, project_id: 9507e2af-b75d-4b1f-a711-714a69f5799e, sled_id: 4196f301-221e-4fdc-9d57-99f78c40cbe5, sled_serial: "4196f301-221e-4fdc-9d57-99f78c40cbe5", sled_revision: 1, sled_model: "pheidippes" } }, state: Migrating } line = 514 path = phd_tests::migrate::from_base::can_migrate_from_base source = migration_from_base source_id = a5473bd5-e34a-4a10-9a7c-ba5181304d81 target = phd_framework::test_vm target_id = be94e3f2-6ca8-458d-93a5-8b8fdf7647f2 vm = migration_from_base_lifecycle_0 vm_id = be94e3f2-6ca8-458d-93a5-8b8fdf7647f2
2052026-10-20T15:29:12.144ZINFOphd-runner: [MIGRATE - START] file = phd-tests/framework/src/test_vm/mod.rs line = 663 migration_id = 9082f382-f47b-4e0e-bf35-87068664c121 path = phd_tests::migrate::from_base::can_migrate_from_base source = migration_from_base source_id = a5473bd5-e34a-4a10-9a7c-ba5181304d81 target = phd_framework::test_vm target_id = be94e3f2-6ca8-458d-93a5-8b8fdf7647f2
2062026-10-20T15:29:14.623ZINFOphd-runner: [SERIAL CONSOLE TASK - EVENT] serial socket control message file = phd-tests/framework/src/serial/mod.rs line = 275 s = {"Migrating":{"destination":"127.0.0.1:9002","from_start":7847}} target = phd_framework::serial
2072026-10-20T15:29:16.834ZINFOphd-runner: [MIGRATE_FROM - EVENT] Migration completed successfully file = phd-tests/framework/src/test_vm/mod.rs line = 676 path = phd_tests::migrate::from_base::can_migrate_from_base source = migration_from_base source_id = a5473bd5-e34a-4a10-9a7c-ba5181304d81 target = phd_framework::test_vm target_id = be94e3f2-6ca8-458d-93a5-8b8fdf7647f2
2082026-10-20T15:29:16.834ZINFOphd-runner: [MIGRATE - END] elapsed_milliseconds = 4690 file = phd-tests/framework/src/test_vm/mod.rs line = 663 migration_id = 9082f382-f47b-4e0e-bf35-87068664c121 path = phd_tests::migrate::from_base::can_migrate_from_base source = migration_from_base source_id = a5473bd5-e34a-4a10-9a7c-ba5181304d81 target = phd_framework::test_vm target_id = be94e3f2-6ca8-458d-93a5-8b8fdf7647f2
2092026-10-20T15:29:16.837ZINFOphd-runner: [VM CLEANUP - START] file = phd-tests/framework/src/test_vm/mod.rs line = 1172 path = phd_tests::migrate::from_base::can_migrate_from_base target = phd_framework::test_vm vm = migration_from_base vm_id = a5473bd5-e34a-4a10-9a7c-ba5181304d81
2102026-10-20T15:29:16.837ZINFOphd-runner: [WAIT_FOR_SERIAL_OUTPUT - START] file = phd-tests/framework/src/test_vm/mod.rs line = 913 path = phd_tests::migrate::from_base::can_migrate_from_base target = phd_framework::test_vm vm = migration_from_base_lifecycle_0 vm_id = be94e3f2-6ca8-458d-93a5-8b8fdf7647f2
2112026-10-20T15:29:16.837ZINFOphd-runner: [WAIT_FOR_SERIAL_OUTPUT - EVENT] Waiting for output on serial console file = phd-tests/framework/src/test_vm/mod.rs line = 920 path = phd_tests::migrate::from_base::can_migrate_from_base target = phd_framework::test_vm timeout_duration = Explicit(15s) vm = migration_from_base_lifecycle_0 vm_id = be94e3f2-6ca8-458d-93a5-8b8fdf7647f2
2122026-10-20T15:29:16.839ZDEBGphd-runner: [VM CLEANUP - EVENT] Killing Propolis server process file = phd-tests/framework/src/test_vm/server.rs line = 177 path = phd_tests::migrate::from_base::can_migrate_from_base self.address = 127.0.0.1:9000 target = phd_framework::test_vm::server vm = migration_from_base vm_id = a5473bd5-e34a-4a10-9a7c-ba5181304d81
2132026-10-20T15:29:16.918ZINFOphd-runner: [VM CLEANUP - END] elapsed_milliseconds = 80 file = phd-tests/framework/src/test_vm/mod.rs line = 1172 path = phd_tests::migrate::from_base::can_migrate_from_base target = phd_framework::test_vm vm = migration_from_base vm_id = a5473bd5-e34a-4a10-9a7c-ba5181304d81
2142026-10-20T15:29:16.918ZINFOphd-runner: [INSTANCE_ENSURE_INTERNAL - END] elapsed_milliseconds = 10834 file = phd-tests/framework/src/test_vm/mod.rs line = 412 path = phd_tests::migrate::from_base::can_migrate_from_base target = phd_framework::test_vm vm = migration_from_base vm_id = a5473bd5-e34a-4a10-9a7c-ba5181304d81
2152026-10-20T15:29:16.918ZINFOphd-runner: [WAIT_FOR_SERIAL_OUTPUT - END] elapsed_milliseconds = 80 file = phd-tests/framework/src/test_vm/mod.rs line = 913 path = phd_tests::migrate::from_base::can_migrate_from_base target = phd_framework::test_vm vm = migration_from_base_lifecycle_0 vm_id = be94e3f2-6ca8-458d-93a5-8b8fdf7647f2
2162026-10-20T15:29:16.919ZINFOphd-runner: [WAIT_FOR_SERIAL_OUTPUT - START] file = phd-tests/framework/src/test_vm/mod.rs line = 913 path = phd_tests::migrate::from_base::can_migrate_from_base target = phd_framework::test_vm vm = migration_from_base_lifecycle_0 vm_id = be94e3f2-6ca8-458d-93a5-8b8fdf7647f2
2172026-10-20T15:29:16.919ZINFOphd-runner: [WAIT_FOR_SERIAL_OUTPUT - EVENT] Waiting for output on serial console file = phd-tests/framework/src/test_vm/mod.rs line = 920 path = phd_tests::migrate::from_base::can_migrate_from_base target = phd_framework::test_vm timeout_duration = Explicit(300s) vm = migration_from_base_lifecycle_0 vm_id = be94e3f2-6ca8-458d-93a5-8b8fdf7647f2
2182026-10-20T15:29:16.960ZINFOphd-runner: [WAIT_FOR_SERIAL_OUTPUT - END] elapsed_milliseconds = 41 file = phd-tests/framework/src/test_vm/mod.rs line = 913 path = phd_tests::migrate::from_base::can_migrate_from_base target = phd_framework::test_vm vm = migration_from_base_lifecycle_0 vm_id = be94e3f2-6ca8-458d-93a5-8b8fdf7647f2
2192026-10-20T15:29:16.960ZINFOphd-runner: [WAIT_FOR_SERIAL_OUTPUT - START] file = phd-tests/framework/src/test_vm/mod.rs line = 913 path = phd_tests::migrate::from_base::can_migrate_from_base target = phd_framework::test_vm vm = migration_from_base_lifecycle_0 vm_id = be94e3f2-6ca8-458d-93a5-8b8fdf7647f2
2202026-10-20T15:29:16.960ZINFOphd-runner: [WAIT_FOR_SERIAL_OUTPUT - EVENT] Waiting for output on serial console file = phd-tests/framework/src/test_vm/mod.rs line = 920 path = phd_tests::migrate::from_base::can_migrate_from_base target = phd_framework::test_vm timeout_duration = Explicit(15s) vm = migration_from_base_lifecycle_0 vm_id = be94e3f2-6ca8-458d-93a5-8b8fdf7647f2
2212026-10-20T15:29:16.971ZINFOphd-runner: [WAIT_FOR_SERIAL_OUTPUT - END] elapsed_milliseconds = 10 file = phd-tests/framework/src/test_vm/mod.rs line = 913 path = phd_tests::migrate::from_base::can_migrate_from_base target = phd_framework::test_vm vm = migration_from_base_lifecycle_0 vm_id = be94e3f2-6ca8-458d-93a5-8b8fdf7647f2
2222026-10-20T15:29:16.971ZINFOphd-runner: [WAIT_FOR_SERIAL_OUTPUT - START] file = phd-tests/framework/src/test_vm/mod.rs line = 913 path = phd_tests::migrate::from_base::can_migrate_from_base target = phd_framework::test_vm vm = migration_from_base_lifecycle_0 vm_id = be94e3f2-6ca8-458d-93a5-8b8fdf7647f2
2232026-10-20T15:29:16.971ZINFOphd-runner: [WAIT_FOR_SERIAL_OUTPUT - EVENT] Waiting for output on serial console file = phd-tests/framework/src/test_vm/mod.rs line = 920 path = phd_tests::migrate::from_base::can_migrate_from_base target = phd_framework::test_vm timeout_duration = Explicit(300s) vm = migration_from_base_lifecycle_0 vm_id = be94e3f2-6ca8-458d-93a5-8b8fdf7647f2
2242026-10-20T15:29:16.994ZINFOphd-runner: [WAIT_FOR_SERIAL_OUTPUT - END] elapsed_milliseconds = 23 file = phd-tests/framework/src/test_vm/mod.rs line = 913 path = phd_tests::migrate::from_base::can_migrate_from_base target = phd_framework::test_vm vm = migration_from_base_lifecycle_0 vm_id = be94e3f2-6ca8-458d-93a5-8b8fdf7647f2
2252026-10-20T15:29:16.995ZINFOphd-runner: [WAIT_FOR_SERIAL_OUTPUT - START] file = phd-tests/framework/src/test_vm/mod.rs line = 913 path = phd_tests::migrate::from_base::can_migrate_from_base target = phd_framework::test_vm vm = migration_from_base_lifecycle_0 vm_id = be94e3f2-6ca8-458d-93a5-8b8fdf7647f2
2262026-10-20T15:29:16.995ZINFOphd-runner: [WAIT_FOR_SERIAL_OUTPUT - EVENT] Waiting for output on serial console file = phd-tests/framework/src/test_vm/mod.rs line = 920 path = phd_tests::migrate::from_base::can_migrate_from_base target = phd_framework::test_vm timeout_duration = Explicit(15s) vm = migration_from_base_lifecycle_0 vm_id = be94e3f2-6ca8-458d-93a5-8b8fdf7647f2
2272026-10-20T15:29:17.005ZINFOphd-runner: [WAIT_FOR_SERIAL_OUTPUT - END] elapsed_milliseconds = 10 file = phd-tests/framework/src/test_vm/mod.rs line = 913 path = phd_tests::migrate::from_base::can_migrate_from_base target = phd_framework::test_vm vm = migration_from_base_lifecycle_0 vm_id = be94e3f2-6ca8-458d-93a5-8b8fdf7647f2
2282026-10-20T15:29:17.006ZINFOphd-runner: [WAIT_FOR_SERIAL_OUTPUT - START] file = phd-tests/framework/src/test_vm/mod.rs line = 913 path = phd_tests::migrate::from_base::can_migrate_from_base target = phd_framework::test_vm vm = migration_from_base_lifecycle_0 vm_id = be94e3f2-6ca8-458d-93a5-8b8fdf7647f2
2292026-10-20T15:29:17.006ZINFOphd-runner: [WAIT_FOR_SERIAL_OUTPUT - EVENT] Waiting for output on serial console file = phd-tests/framework/src/test_vm/mod.rs line = 920 path = phd_tests::migrate::from_base::can_migrate_from_base target = phd_framework::test_vm timeout_duration = Explicit(300s) vm = migration_from_base_lifecycle_0 vm_id = be94e3f2-6ca8-458d-93a5-8b8fdf7647f2
2302026-10-20T15:29:17.039ZINFOphd-runner: [WAIT_FOR_SERIAL_OUTPUT - END] elapsed_milliseconds = 32 file = phd-tests/framework/src/test_vm/mod.rs line = 913 path = phd_tests::migrate::from_base::can_migrate_from_base target = phd_framework::test_vm vm = migration_from_base_lifecycle_0 vm_id = be94e3f2-6ca8-458d-93a5-8b8fdf7647f2
2312026-10-20T15:29:17.039ZINFOphd-runner: [WAIT_FOR_SERIAL_OUTPUT - START] file = phd-tests/framework/src/test_vm/mod.rs line = 913 path = phd_tests::migrate::from_base::can_migrate_from_base target = phd_framework::test_vm vm = migration_from_base_lifecycle_0 vm_id = be94e3f2-6ca8-458d-93a5-8b8fdf7647f2
2322026-10-20T15:29:17.039ZINFOphd-runner: [WAIT_FOR_SERIAL_OUTPUT - EVENT] Waiting for output on serial console file = phd-tests/framework/src/test_vm/mod.rs line = 920 path = phd_tests::migrate::from_base::can_migrate_from_base target = phd_framework::test_vm timeout_duration = Explicit(15s) vm = migration_from_base_lifecycle_0 vm_id = be94e3f2-6ca8-458d-93a5-8b8fdf7647f2
2332026-10-20T15:29:17.049ZINFOphd-runner: [WAIT_FOR_SERIAL_OUTPUT - END] elapsed_milliseconds = 10 file = phd-tests/framework/src/test_vm/mod.rs line = 913 path = phd_tests::migrate::from_base::can_migrate_from_base target = phd_framework::test_vm vm = migration_from_base_lifecycle_0 vm_id = be94e3f2-6ca8-458d-93a5-8b8fdf7647f2
2342026-10-20T15:29:17.049ZINFOphd-runner: [WAIT_FOR_SERIAL_OUTPUT - START] file = phd-tests/framework/src/test_vm/mod.rs line = 913 path = phd_tests::migrate::from_base::can_migrate_from_base target = phd_framework::test_vm vm = migration_from_base_lifecycle_0 vm_id = be94e3f2-6ca8-458d-93a5-8b8fdf7647f2
2352026-10-20T15:29:17.049ZINFOphd-runner: [WAIT_FOR_SERIAL_OUTPUT - EVENT] Waiting for output on serial console file = phd-tests/framework/src/test_vm/mod.rs line = 920 path = phd_tests::migrate::from_base::can_migrate_from_base target = phd_framework::test_vm timeout_duration = Explicit(300s) vm = migration_from_base_lifecycle_0 vm_id = be94e3f2-6ca8-458d-93a5-8b8fdf7647f2
2362026-10-20T15:29:17.082ZINFOphd-runner: [WAIT_FOR_SERIAL_OUTPUT - END] elapsed_milliseconds = 32 file = phd-tests/framework/src/test_vm/mod.rs line = 913 path = phd_tests::migrate::from_base::can_migrate_from_base target = phd_framework::test_vm vm = migration_from_base_lifecycle_0 vm_id = be94e3f2-6ca8-458d-93a5-8b8fdf7647f2
2372026-10-20T15:29:17.082ZINFOphd-runner: [WAIT_FOR_SERIAL_OUTPUT - START] file = phd-tests/framework/src/test_vm/mod.rs line = 913 path = phd_tests::migrate::from_base::can_migrate_from_base target = phd_framework::test_vm vm = migration_from_base_lifecycle_0 vm_id = be94e3f2-6ca8-458d-93a5-8b8fdf7647f2
2382026-10-20T15:29:17.082ZINFOphd-runner: [WAIT_FOR_SERIAL_OUTPUT - EVENT] Waiting for output on serial console file = phd-tests/framework/src/test_vm/mod.rs line = 920 path = phd_tests::migrate::from_base::can_migrate_from_base target = phd_framework::test_vm timeout_duration = Explicit(15s) vm = migration_from_base_lifecycle_0 vm_id = be94e3f2-6ca8-458d-93a5-8b8fdf7647f2
2392026-10-20T15:29:17.093ZINFOphd-runner: [WAIT_FOR_SERIAL_OUTPUT - END] elapsed_milliseconds = 10 file = phd-tests/framework/src/test_vm/mod.rs line = 913 path = phd_tests::migrate::from_base::can_migrate_from_base target = phd_framework::test_vm vm = migration_from_base_lifecycle_0 vm_id = be94e3f2-6ca8-458d-93a5-8b8fdf7647f2
2402026-10-20T15:29:17.093ZINFOphd-runner: [WAIT_FOR_SERIAL_OUTPUT - START] file = phd-tests/framework/src/test_vm/mod.rs line = 913 path = phd_tests::migrate::from_base::can_migrate_from_base target = phd_framework::test_vm vm = migration_from_base_lifecycle_0 vm_id = be94e3f2-6ca8-458d-93a5-8b8fdf7647f2
2412026-10-20T15:29:17.093ZINFOphd-runner: [WAIT_FOR_SERIAL_OUTPUT - EVENT] Waiting for output on serial console file = phd-tests/framework/src/test_vm/mod.rs line = 920 path = phd_tests::migrate::from_base::can_migrate_from_base target = phd_framework::test_vm timeout_duration = Explicit(300s) vm = migration_from_base_lifecycle_0 vm_id = be94e3f2-6ca8-458d-93a5-8b8fdf7647f2
2422026-10-20T15:29:17.137ZINFOphd-runner: [WAIT_FOR_SERIAL_OUTPUT - END] elapsed_milliseconds = 43 file = phd-tests/framework/src/test_vm/mod.rs line = 913 path = phd_tests::migrate::from_base::can_migrate_from_base target = phd_framework::test_vm vm = migration_from_base_lifecycle_0 vm_id = be94e3f2-6ca8-458d-93a5-8b8fdf7647f2
2432026-10-20T15:29:17.137ZINFOphd-runner: [WAIT_FOR_SERIAL_OUTPUT - START] file = phd-tests/framework/src/test_vm/mod.rs line = 913 path = phd_tests::migrate::from_base::can_migrate_from_base target = phd_framework::test_vm vm = migration_from_base_lifecycle_0 vm_id = be94e3f2-6ca8-458d-93a5-8b8fdf7647f2
2442026-10-20T15:29:17.137ZINFOphd-runner: [WAIT_FOR_SERIAL_OUTPUT - EVENT] Waiting for output on serial console file = phd-tests/framework/src/test_vm/mod.rs line = 920 path = phd_tests::migrate::from_base::can_migrate_from_base target = phd_framework::test_vm timeout_duration = Explicit(15s) vm = migration_from_base_lifecycle_0 vm_id = be94e3f2-6ca8-458d-93a5-8b8fdf7647f2
2452026-10-20T15:29:17.148ZINFOphd-runner: [WAIT_FOR_SERIAL_OUTPUT - END] elapsed_milliseconds = 10 file = phd-tests/framework/src/test_vm/mod.rs line = 913 path = phd_tests::migrate::from_base::can_migrate_from_base target = phd_framework::test_vm vm = migration_from_base_lifecycle_0 vm_id = be94e3f2-6ca8-458d-93a5-8b8fdf7647f2
2462026-10-20T15:29:17.148ZINFOphd-runner: [WAIT_FOR_SERIAL_OUTPUT - START] file = phd-tests/framework/src/test_vm/mod.rs line = 913 path = phd_tests::migrate::from_base::can_migrate_from_base target = phd_framework::test_vm vm = migration_from_base_lifecycle_0 vm_id = be94e3f2-6ca8-458d-93a5-8b8fdf7647f2
2472026-10-20T15:29:17.148ZINFOphd-runner: [WAIT_FOR_SERIAL_OUTPUT - EVENT] Waiting for output on serial console file = phd-tests/framework/src/test_vm/mod.rs line = 920 path = phd_tests::migrate::from_base::can_migrate_from_base target = phd_framework::test_vm timeout_duration = Explicit(300s) vm = migration_from_base_lifecycle_0 vm_id = be94e3f2-6ca8-458d-93a5-8b8fdf7647f2
2482026-10-20T15:29:17.170ZINFOphd-runner: [WAIT_FOR_SERIAL_OUTPUT - END] elapsed_milliseconds = 22 file = phd-tests/framework/src/test_vm/mod.rs line = 913 path = phd_tests::migrate::from_base::can_migrate_from_base target = phd_framework::test_vm vm = migration_from_base_lifecycle_0 vm_id = be94e3f2-6ca8-458d-93a5-8b8fdf7647f2
2492026-10-20T15:29:17.171ZINFOphd-runner: [WAIT_FOR_SERIAL_OUTPUT - START] file = phd-tests/framework/src/test_vm/mod.rs line = 913 path = phd_tests::migrate::from_base::can_migrate_from_base target = phd_framework::test_vm vm = migration_from_base_lifecycle_0 vm_id = be94e3f2-6ca8-458d-93a5-8b8fdf7647f2
2502026-10-20T15:29:17.171ZINFOphd-runner: [WAIT_FOR_SERIAL_OUTPUT - EVENT] Waiting for output on serial console file = phd-tests/framework/src/test_vm/mod.rs line = 920 path = phd_tests::migrate::from_base::can_migrate_from_base target = phd_framework::test_vm timeout_duration = Explicit(15s) vm = migration_from_base_lifecycle_0 vm_id = be94e3f2-6ca8-458d-93a5-8b8fdf7647f2
2512026-10-20T15:29:17.181ZINFOphd-runner: [WAIT_FOR_SERIAL_OUTPUT - END] elapsed_milliseconds = 10 file = phd-tests/framework/src/test_vm/mod.rs line = 913 path = phd_tests::migrate::from_base::can_migrate_from_base target = phd_framework::test_vm vm = migration_from_base_lifecycle_0 vm_id = be94e3f2-6ca8-458d-93a5-8b8fdf7647f2
2522026-10-20T15:29:17.181ZINFOphd-runner: [WAIT_FOR_SERIAL_OUTPUT - START] file = phd-tests/framework/src/test_vm/mod.rs line = 913 path = phd_tests::migrate::from_base::can_migrate_from_base target = phd_framework::test_vm vm = migration_from_base_lifecycle_0 vm_id = be94e3f2-6ca8-458d-93a5-8b8fdf7647f2
2532026-10-20T15:29:17.181ZINFOphd-runner: [WAIT_FOR_SERIAL_OUTPUT - EVENT] Waiting for output on serial console file = phd-tests/framework/src/test_vm/mod.rs line = 920 path = phd_tests::migrate::from_base::can_migrate_from_base target = phd_framework::test_vm timeout_duration = Explicit(300s) vm = migration_from_base_lifecycle_0 vm_id = be94e3f2-6ca8-458d-93a5-8b8fdf7647f2
2542026-10-20T15:29:17.214ZINFOphd-runner: [WAIT_FOR_SERIAL_OUTPUT - END] elapsed_milliseconds = 33 file = phd-tests/framework/src/test_vm/mod.rs line = 913 path = phd_tests::migrate::from_base::can_migrate_from_base target = phd_framework::test_vm vm = migration_from_base_lifecycle_0 vm_id = be94e3f2-6ca8-458d-93a5-8b8fdf7647f2
2552026-10-20T15:29:17.215ZINFOphd-runner: [WAIT_FOR_SERIAL_OUTPUT - START] file = phd-tests/framework/src/test_vm/mod.rs line = 913 path = phd_tests::migrate::from_base::can_migrate_from_base target = phd_framework::test_vm vm = migration_from_base_lifecycle_0 vm_id = be94e3f2-6ca8-458d-93a5-8b8fdf7647f2
2562026-10-20T15:29:17.215ZINFOphd-runner: [WAIT_FOR_SERIAL_OUTPUT - EVENT] Waiting for output on serial console file = phd-tests/framework/src/test_vm/mod.rs line = 920 path = phd_tests::migrate::from_base::can_migrate_from_base target = phd_framework::test_vm timeout_duration = Explicit(15s) vm = migration_from_base_lifecycle_0 vm_id = be94e3f2-6ca8-458d-93a5-8b8fdf7647f2
2572026-10-20T15:29:17.225ZINFOphd-runner: [WAIT_FOR_SERIAL_OUTPUT - END] elapsed_milliseconds = 10 file = phd-tests/framework/src/test_vm/mod.rs line = 913 path = phd_tests::migrate::from_base::can_migrate_from_base target = phd_framework::test_vm vm = migration_from_base_lifecycle_0 vm_id = be94e3f2-6ca8-458d-93a5-8b8fdf7647f2
2582026-10-20T15:29:17.226ZINFOphd-runner: [WAIT_FOR_SERIAL_OUTPUT - START] file = phd-tests/framework/src/test_vm/mod.rs line = 913 path = phd_tests::migrate::from_base::can_migrate_from_base target = phd_framework::test_vm vm = migration_from_base_lifecycle_0 vm_id = be94e3f2-6ca8-458d-93a5-8b8fdf7647f2
2592026-10-20T15:29:17.226ZINFOphd-runner: [WAIT_FOR_SERIAL_OUTPUT - EVENT] Waiting for output on serial console file = phd-tests/framework/src/test_vm/mod.rs line = 920 path = phd_tests::migrate::from_base::can_migrate_from_base target = phd_framework::test_vm timeout_duration = Explicit(300s) vm = migration_from_base_lifecycle_0 vm_id = be94e3f2-6ca8-458d-93a5-8b8fdf7647f2
2602026-10-20T15:29:17.259ZINFOphd-runner: [WAIT_FOR_SERIAL_OUTPUT - END] elapsed_milliseconds = 33 file = phd-tests/framework/src/test_vm/mod.rs line = 913 path = phd_tests::migrate::from_base::can_migrate_from_base target = phd_framework::test_vm vm = migration_from_base_lifecycle_0 vm_id = be94e3f2-6ca8-458d-93a5-8b8fdf7647f2
2612026-10-20T15:29:17.259ZINFOphd-runner: [VM CLEANUP - START] file = phd-tests/framework/src/test_vm/mod.rs line = 1172 path = phd_tests::migrate::from_base::can_migrate_from_base target = phd_framework::test_vm vm = migration_from_base_lifecycle_0 vm_id = be94e3f2-6ca8-458d-93a5-8b8fdf7647f2
2622026-10-20T15:29:17.259ZDEBGphd-runner: [SERIAL CONSOLE TASK - EVENT] serial console command channel was closed file = phd-tests/framework/src/serial/mod.rs line = 213 target = phd_framework::serial
2632026-10-20T15:29:17.259ZINFOphd-runner: [SERIAL CONSOLE TASK - END] elapsed_milliseconds = 10609 file = phd-tests/framework/src/serial/mod.rs line = 200 target = phd_framework::serial
2642026-10-20T15:29:17.259ZINFOphd-runner: test phd_tests::migrate::from_base::can_migrate_from_base ... ok file = phd-tests/runner/src/execute.rs line = 141 target = phd_runner::execute
2652026-10-20T15:29:17.259ZINFOphd-runner: [TEST_CLEANUP - START] file = phd-tests/runner/src/fixtures.rs line = 51 target = phd_runner::fixtures
2662026-10-20T15:29:17.261ZDEBGphd-runner: [VM CLEANUP - EVENT] trying to ensure Propolis server VM is destroyed file = phd-tests/framework/src/test_vm/mod.rs line = 1195 path = phd_tests::migrate::from_base::can_migrate_from_base target = phd_framework::test_vm vm = migration_from_base_lifecycle_0 vm_id = be94e3f2-6ca8-458d-93a5-8b8fdf7647f2
2672026-10-20T15:29:17.616ZDEBGphd-runner: [VM CLEANUP - EVENT] Killing Propolis server process file = phd-tests/framework/src/test_vm/server.rs line = 177 path = phd_tests::migrate::from_base::can_migrate_from_base self.address = 127.0.0.1:9002 target = phd_framework::test_vm::server vm = migration_from_base_lifecycle_0 vm_id = be94e3f2-6ca8-458d-93a5-8b8fdf7647f2
2682026-10-20T15:29:17.703ZDEBGphd-runner: [VM CLEANUP - EVENT] zfs clone dropped file = phd-tests/framework/src/zfs.rs line = 83 path = phd_tests::migrate::from_base::can_migrate_from_base target = phd_framework::zfs vm = migration_from_base_lifecycle_0 vm_id = be94e3f2-6ca8-458d-93a5-8b8fdf7647f2
2692026-10-20T15:29:17.703ZDEBGphd-runner: [VM CLEANUP - EVENT] executing ZFS command args = ["phd-artifacts/phd-clone-a43c7d8d-54c2-44de-a683-3ecdf12a7b05"] file = phd-tests/framework/src/zfs.rs line = 304 path = phd_tests::migrate::from_base::can_migrate_from_base target = phd_framework::zfs verb = destroy vm = migration_from_base_lifecycle_0 vm_id = be94e3f2-6ca8-458d-93a5-8b8fdf7647f2
2702026-10-20T15:29:17.731ZDEBGphd-runner: [VM CLEANUP - EVENT] zfs snapshot dropped file = phd-tests/framework/src/zfs.rs line = 57 path = phd_tests::migrate::from_base::can_migrate_from_base target = phd_framework::zfs vm = migration_from_base_lifecycle_0 vm_id = be94e3f2-6ca8-458d-93a5-8b8fdf7647f2
2712026-10-20T15:29:17.732ZDEBGphd-runner: [VM CLEANUP - EVENT] executing ZFS command args = ["phd-artifacts@phd-b8449e09-c423-41db-a771-8a4eae723754"] file = phd-tests/framework/src/zfs.rs line = 304 path = phd_tests::migrate::from_base::can_migrate_from_base target = phd_framework::zfs verb = destroy vm = migration_from_base_lifecycle_0 vm_id = be94e3f2-6ca8-458d-93a5-8b8fdf7647f2
2722026-10-20T15:29:17.750ZINFOphd-runner: [VM CLEANUP - END] elapsed_milliseconds = 491 file = phd-tests/framework/src/test_vm/mod.rs line = 1172 path = phd_tests::migrate::from_base::can_migrate_from_base target = phd_framework::test_vm vm = migration_from_base_lifecycle_0 vm_id = be94e3f2-6ca8-458d-93a5-8b8fdf7647f2
2732026-10-20T15:29:17.751ZINFOphd-runner: [INSTANCE_ENSURE_INTERNAL - END] elapsed_milliseconds = 6173 file = phd-tests/framework/src/test_vm/mod.rs line = 412 path = phd_tests::migrate::from_base::can_migrate_from_base source = migration_from_base source_id = a5473bd5-e34a-4a10-9a7c-ba5181304d81 target = phd_framework::test_vm target_id = be94e3f2-6ca8-458d-93a5-8b8fdf7647f2 vm = migration_from_base_lifecycle_0 vm_id = be94e3f2-6ca8-458d-93a5-8b8fdf7647f2
2742026-10-20T15:29:17.751ZINFOphd-runner: [TEST_CLEANUP - END] elapsed_milliseconds = 491 file = phd-tests/runner/src/fixtures.rs line = 51 target = phd_runner::fixtures
2752026-10-20T15:29:17.751ZINFOphd-runner: [MIGRATE_FROM - END] elapsed_milliseconds = 6173 file = phd-tests/framework/src/test_vm/mod.rs line = 609 path = phd_tests::migrate::from_base::can_migrate_from_base source = migration_from_base source_id = a5473bd5-e34a-4a10-9a7c-ba5181304d81 target = phd_framework::test_vm target_id = be94e3f2-6ca8-458d-93a5-8b8fdf7647f2
2762026-10-20T15:29:17.751ZINFOphd-runner: Starting test phd_tests::migrate::from_base::migration_from_base_and_back file = phd-tests/runner/src/execute.rs line = 91 target = phd_runner::execute
2772026-10-20T15:29:17.751ZINFOphd-runner: [TEST - END] elapsed_milliseconds = 11788 file = phd-tests/tests/src/migrate.rs line = 34 path = phd_tests::migrate::from_base::can_migrate_from_base target = phd_tests::migrate::from_base
2782026-10-20T15:29:17.751ZINFOphd-runner: [TEST_SETUP - START] file = phd-tests/runner/src/fixtures.rs line = 41 target = phd_runner::fixtures
2792026-10-20T15:29:17.751ZINFOphd-runner: [TEST_SETUP - END] elapsed_milliseconds = 0 file = phd-tests/runner/src/fixtures.rs line = 41 target = phd_runner::fixtures
2802026-10-20T15:29:17.751ZINFOphd-runner: [TEST - START] file = phd-tests/tests/src/migrate.rs line = 52 path = phd_tests::migrate::from_base::migration_from_base_and_back target = phd_tests::migrate::from_base
2812026-10-20T15:29:17.751ZDEBGphd-runner: [TEST - EVENT] Verified artifact already exists file = phd-tests/framework/src/artifacts/store.rs line = 45 path = /phd-artifacts/740187046a7267d0de72d3455070333547dbc0ea023531471fb2b2a61effa448/OVMF_CODE.fd target = phd_framework::artifacts::store
2822026-10-20T15:29:17.751ZDEBGphd-runner: [TEST - EVENT] Verified artifact already exists file = phd-tests/framework/src/artifacts/store.rs line = 45 path = /phd-artifacts/ba8007f74f9b54fbae3b2520da577831b4834778a498d732f091260c61aa7ca1/alpine.iso target = phd_framework::artifacts::store
2832026-10-20T15:29:17.751ZDEBGphd-runner: [TEST - EVENT] Verified artifact already exists file = phd-tests/framework/src/artifacts/store.rs line = 45 path = /phd-artifacts/ba8007f74f9b54fbae3b2520da577831b4834778a498d732f091260c61aa7ca1/alpine.iso target = phd_framework::artifacts::store
2842026-10-20T15:29:17.752ZDEBGphd-runner: [TEST - EVENT] executing ZFS command args = ["/phd-artifacts/ba8007f74f9b54fbae3b2520da577831b4834778a498d732f091260c61aa7ca1/alpine.iso"] file = phd-tests/framework/src/zfs.rs line = 304 path = phd_tests::migrate::from_base::migration_from_base_and_back target = phd_framework::zfs verb = list
2852026-10-20T15:29:17.762ZDEBGphd-runner: [TEST - EVENT] parsing zfs list output file = phd-tests/framework/src/zfs.rs line = 238 path = phd_tests::migrate::from_base::migration_from_base_and_back stdout = NAME USED AVAIL REFER MOUNTPOINT\nphd-artifacts 1.31G 25.3T 1.31G /phd-artifacts\n target = phd_framework::zfs
2862026-10-20T15:29:17.762ZDEBGphd-runner: [TEST - EVENT] executing ZFS command args = ["phd-artifacts@phd-cd945336-2758-4461-81bd-fc71defd57ae"] file = phd-tests/framework/src/zfs.rs line = 304 path = phd_tests::migrate::from_base::migration_from_base_and_back target = phd_framework::zfs verb = snapshot
2872026-10-20T15:29:17.779ZDEBGphd-runner: [TEST - EVENT] executing ZFS command args = ["phd-artifacts@phd-cd945336-2758-4461-81bd-fc71defd57ae", "phd-artifacts/phd-clone-f85b5936-58d2-4111-837d-e05c11dfee78"] file = phd-tests/framework/src/zfs.rs line = 304 path = phd_tests::migrate::from_base::migration_from_base_and_back target = phd_framework::zfs verb = clone
2882026-10-20T15:29:17.798ZDEBGphd-runner: [TEST - EVENT] executing ZFS command args = ["phd-artifacts/phd-clone-f85b5936-58d2-4111-837d-e05c11dfee78"] file = phd-tests/framework/src/zfs.rs line = 304 path = phd_tests::migrate::from_base::migration_from_base_and_back target = phd_framework::zfs verb = list
2892026-10-20T15:29:17.810ZDEBGphd-runner: [TEST - EVENT] parsing zfs list output file = phd-tests/framework/src/zfs.rs line = 238 path = phd_tests::migrate::from_base::migration_from_base_and_back stdout = NAME USED AVAIL REFER MOUNTPOINT\nphd-artifacts/phd-clone-f85b5936-58d2-4111-837d-e05c11dfee78 0B 25.3T 1.31G /phd-artifacts/phd-clone-f85b5936-58d2-4111-837d-e05c11dfee78\n target = phd_framework::zfs
2902026-10-20T15:29:17.811ZINFOphd-runner: [NEW - START] file = phd-tests/framework/src/test_vm/mod.rs line = 300 path = phd_tests::migrate::from_base::migration_from_base_and_back target = phd_framework::test_vm
2912026-10-20T15:29:17.811ZINFOphd-runner: [NEW - EVENT] phd_framework::test_vm environment = EnvironmentSpec { location: Local, propolis_artifact: "__BASE_PROPOLIS", metrics: None } file = phd-tests/framework/src/test_vm/mod.rs guest_os_kind = Alpine line = 318 path = phd_tests::migrate::from_base::migration_from_base_and_back target = phd_framework::test_vm vm_name = migration_from_base_and_back
2922026-10-20T15:29:17.811ZDEBGphd-runner: [NEW - EVENT] Verified artifact already exists file = phd-tests/framework/src/artifacts/store.rs line = 45 path = /phd-artifacts/739eeb04a4728b2e7609b038a587b5de0d939c2a02cf61882a60d42a6ba676e1/propolis-server target = phd_framework::artifacts::store
2932026-10-20T15:29:17.811ZINFOphd-runner: [NEW - EVENT] Launching Propolis server bootrom_path = "/phd-artifacts/740187046a7267d0de72d3455070333547dbc0ea023531471fb2b2a61effa448/OVMF_CODE.fd" file = phd-tests/framework/src/test_vm/server.rs line = 66 path = phd_tests::migrate::from_base::migration_from_base_and_back server_addr = 127.0.0.1:9000 server_path = "/phd-artifacts/739eeb04a4728b2e7609b038a587b5de0d939c2a02cf61882a60d42a6ba676e1/propolis-server" target = phd_framework::test_vm::server
2942026-10-20T15:29:17.811ZINFOphd-runner: [NEW - EVENT] Opening server log files file = phd-tests/framework/src/log_config.rs line = 84 path = phd_tests::migrate::from_base::migration_from_base_and_back stderr_path = "/tmp/propolis-phd/phd_tests::migrate::from_base::migration_from_base_and_back/migration_from_base_and_back.stderr.log" stdout_path = "/tmp/propolis-phd/phd_tests::migrate::from_base::migration_from_base_and_back/migration_from_base_and_back.stdout.log" target = phd_framework::log_config
2952026-10-20T15:29:17.861ZINFOphd-runner: [NEW - EVENT] Launched server with pid 937 file = phd-tests/framework/src/test_vm/server.rs line = 127 path = phd_tests::migrate::from_base::migration_from_base_and_back target = phd_framework::test_vm::server
2962026-10-20T15:29:17.875ZINFOphd-runner: [NEW - END] elapsed_milliseconds = 64 file = phd-tests/framework/src/test_vm/mod.rs line = 300 path = phd_tests::migrate::from_base::migration_from_base_and_back target = phd_framework::test_vm
2972026-10-20T15:29:17.875ZINFOphd-runner: [INSTANCE_ENSURE_INTERNAL - START] file = phd-tests/framework/src/test_vm/mod.rs line = 412 path = phd_tests::migrate::from_base::migration_from_base_and_back target = phd_framework::test_vm vm = migration_from_base_and_back vm_id = 7c833161-a5da-44aa-a2f8-fddb86362450
2982026-10-20T15:29:17.876ZINFOphd-runner: [INSTANCE_ENSURE_INTERNAL - EVENT] retriable error from instance_spec_ensure e = Communication Error: error sending request for url (http://127.0.0.1:9000/instance) file = phd-tests/framework/src/test_vm/mod.rs line = 455 path = phd_tests::migrate::from_base::migration_from_base_and_back target = phd_framework::test_vm vm = migration_from_base_and_back vm_id = 7c833161-a5da-44aa-a2f8-fddb86362450
2992026-10-20T15:29:18.518ZINFOphd-runner: [SERIAL CONSOLE TASK - START] file = phd-tests/framework/src/serial/mod.rs line = 200 target = phd_framework::serial
3002026-10-20T15:29:18.520ZINFOphd-runner: [INSTANCE_ENSURE_INTERNAL - EVENT] Started instance file = phd-tests/framework/src/test_vm/mod.rs instance_description.instance = Instance { properties: InstanceProperties { id: 7c833161-a5da-44aa-a2f8-fddb86362450, name: "phd-vm-7c833161-a5da-44aa-a2f8-fddb86362450", description: "Pheidippides-managed VM", metadata: InstanceMetadata { silo_id: e79dd49b-58e4-4636-970a-03ba1e8d0df1, project_id: 348533e9-c339-403f-962d-7b9251e70fcc, sled_id: b39628b1-15a1-4eb4-89b0-154c82cba0cf, sled_serial: "b39628b1-15a1-4eb4-89b0-154c82cba0cf", sled_revision: 1, sled_model: "pheidippes" } }, state: Creating } line = 514 path = phd_tests::migrate::from_base::migration_from_base_and_back target = phd_framework::test_vm vm = migration_from_base_and_back vm_id = 7c833161-a5da-44aa-a2f8-fddb86362450
3012026-10-20T15:29:18.520ZINFOphd-runner: [PUT_INSTANCE_STATE - START] file = phd-tests/framework/src/test_vm/mod.rs line = 575 path = phd_tests::migrate::from_base::migration_from_base_and_back target = phd_framework::test_vm vm = migration_from_base_and_back vm_id = 7c833161-a5da-44aa-a2f8-fddb86362450
3022026-10-20T15:29:18.520ZINFOphd-runner: [PUT_INSTANCE_STATE - EVENT] Requesting instance state change file = phd-tests/framework/src/test_vm/mod.rs line = 580 path = phd_tests::migrate::from_base::migration_from_base_and_back state = Run target = phd_framework::test_vm vm = migration_from_base_and_back vm_id = 7c833161-a5da-44aa-a2f8-fddb86362450
3032026-10-20T15:29:18.521ZINFOphd-runner: [PUT_INSTANCE_STATE - END] elapsed_milliseconds = 1 file = phd-tests/framework/src/test_vm/mod.rs line = 575 path = phd_tests::migrate::from_base::migration_from_base_and_back target = phd_framework::test_vm vm = migration_from_base_and_back vm_id = 7c833161-a5da-44aa-a2f8-fddb86362450
3042026-10-20T15:29:18.521ZINFOphd-runner: [WAIT_TO_BOOT - START] file = phd-tests/framework/src/test_vm/mod.rs line = 890 path = phd_tests::migrate::from_base::migration_from_base_and_back target = phd_framework::test_vm
3052026-10-20T15:29:18.521ZINFOphd-runner: [WAIT_TO_BOOT - EVENT] waiting for guest to boot file = phd-tests/framework/src/test_vm/mod.rs line = 839 path = phd_tests::migrate::from_base::migration_from_base_and_back target = phd_framework::test_vm timeout_duration = 300s vm = migration_from_base_and_back vm_id = 7c833161-a5da-44aa-a2f8-fddb86362450
3062026-10-20T15:29:18.521ZDEBGphd-runner: [WAIT_TO_BOOT - EVENT] executing command in boot sequence file = phd-tests/framework/src/test_vm/mod.rs line = 847 path = phd_tests::migrate::from_base::migration_from_base_and_back step = WaitFor("localhost login: ") target = phd_framework::test_vm
3072026-10-20T15:29:18.521ZINFOphd-runner: [WAIT_FOR_SERIAL_OUTPUT - START] file = phd-tests/framework/src/test_vm/mod.rs line = 913 path = phd_tests::migrate::from_base::migration_from_base_and_back target = phd_framework::test_vm vm = migration_from_base_and_back vm_id = 7c833161-a5da-44aa-a2f8-fddb86362450
3082026-10-20T15:29:18.521ZINFOphd-runner: [WAIT_FOR_SERIAL_OUTPUT - EVENT] Waiting for output on serial console file = phd-tests/framework/src/test_vm/mod.rs line = 920 path = phd_tests::migrate::from_base::migration_from_base_and_back target = phd_framework::test_vm timeout_duration = CallerTimeout vm = migration_from_base_and_back vm_id = 7c833161-a5da-44aa-a2f8-fddb86362450
3092026-10-20T15:29:23.034ZINFOphd-runner: [WAIT_FOR_SERIAL_OUTPUT - END] elapsed_milliseconds = 4512 file = phd-tests/framework/src/test_vm/mod.rs line = 913 path = phd_tests::migrate::from_base::migration_from_base_and_back target = phd_framework::test_vm vm = migration_from_base_and_back vm_id = 7c833161-a5da-44aa-a2f8-fddb86362450
3102026-10-20T15:29:23.034ZDEBGphd-runner: [WAIT_TO_BOOT - EVENT] executing command in boot sequence file = phd-tests/framework/src/test_vm/mod.rs line = 847 path = phd_tests::migrate::from_base::migration_from_base_and_back step = WriteStr("root") target = phd_framework::test_vm
3112026-10-20T15:29:23.035ZDEBGphd-runner: [WAIT_TO_BOOT - EVENT] executing command in boot sequence file = phd-tests/framework/src/test_vm/mod.rs line = 847 path = phd_tests::migrate::from_base::migration_from_base_and_back step = WaitFor("localhost:~#") target = phd_framework::test_vm
3122026-10-20T15:29:23.035ZINFOphd-runner: [WAIT_FOR_SERIAL_OUTPUT - START] file = phd-tests/framework/src/test_vm/mod.rs line = 913 path = phd_tests::migrate::from_base::migration_from_base_and_back target = phd_framework::test_vm vm = migration_from_base_and_back vm_id = 7c833161-a5da-44aa-a2f8-fddb86362450
3132026-10-20T15:29:23.035ZINFOphd-runner: [WAIT_FOR_SERIAL_OUTPUT - EVENT] Waiting for output on serial console file = phd-tests/framework/src/test_vm/mod.rs line = 920 path = phd_tests::migrate::from_base::migration_from_base_and_back target = phd_framework::test_vm timeout_duration = CallerTimeout vm = migration_from_base_and_back vm_id = 7c833161-a5da-44aa-a2f8-fddb86362450
3142026-10-20T15:29:23.053ZINFOphd-runner: [WAIT_FOR_SERIAL_OUTPUT - END] elapsed_milliseconds = 18 file = phd-tests/framework/src/test_vm/mod.rs line = 913 path = phd_tests::migrate::from_base::migration_from_base_and_back target = phd_framework::test_vm vm = migration_from_base_and_back vm_id = 7c833161-a5da-44aa-a2f8-fddb86362450
3152026-10-20T15:29:23.053ZDEBGphd-runner: [WAIT_TO_BOOT - EVENT] executing command in boot sequence file = phd-tests/framework/src/test_vm/mod.rs line = 847 path = phd_tests::migrate::from_base::migration_from_base_and_back step = WriteStr("stty -F `tty` cols 9999") target = phd_framework::test_vm
3162026-10-20T15:29:23.054ZDEBGphd-runner: [WAIT_TO_BOOT - EVENT] executing command in boot sequence file = phd-tests/framework/src/test_vm/mod.rs line = 847 path = phd_tests::migrate::from_base::migration_from_base_and_back step = WaitFor("localhost:~#") target = phd_framework::test_vm
3172026-10-20T15:29:23.054ZINFOphd-runner: [WAIT_FOR_SERIAL_OUTPUT - START] file = phd-tests/framework/src/test_vm/mod.rs line = 913 path = phd_tests::migrate::from_base::migration_from_base_and_back target = phd_framework::test_vm vm = migration_from_base_and_back vm_id = 7c833161-a5da-44aa-a2f8-fddb86362450
3182026-10-20T15:29:23.054ZINFOphd-runner: [WAIT_FOR_SERIAL_OUTPUT - EVENT] Waiting for output on serial console file = phd-tests/framework/src/test_vm/mod.rs line = 920 path = phd_tests::migrate::from_base::migration_from_base_and_back target = phd_framework::test_vm timeout_duration = CallerTimeout vm = migration_from_base_and_back vm_id = 7c833161-a5da-44aa-a2f8-fddb86362450
3192026-10-20T15:29:23.087ZINFOphd-runner: [WAIT_FOR_SERIAL_OUTPUT - END] elapsed_milliseconds = 33 file = phd-tests/framework/src/test_vm/mod.rs line = 913 path = phd_tests::migrate::from_base::migration_from_base_and_back target = phd_framework::test_vm vm = migration_from_base_and_back vm_id = 7c833161-a5da-44aa-a2f8-fddb86362450
3202026-10-20T15:29:23.087ZINFOphd-runner: [WAIT_TO_BOOT - EVENT] Guest has booted file = phd-tests/framework/src/test_vm/mod.rs line = 887 path = phd_tests::migrate::from_base::migration_from_base_and_back target = phd_framework::test_vm
3212026-10-20T15:29:23.087ZINFOphd-runner: [WAIT_TO_BOOT - END] elapsed_milliseconds = 4565 file = phd-tests/framework/src/test_vm/mod.rs line = 890 path = phd_tests::migrate::from_base::migration_from_base_and_back target = phd_framework::test_vm
3222026-10-20T15:29:23.087ZINFOphd-runner: [WAIT_FOR_SERIAL_OUTPUT - START] file = phd-tests/framework/src/test_vm/mod.rs line = 913 path = phd_tests::migrate::from_base::migration_from_base_and_back target = phd_framework::test_vm vm = migration_from_base_and_back vm_id = 7c833161-a5da-44aa-a2f8-fddb86362450
3232026-10-20T15:29:23.087ZINFOphd-runner: [WAIT_FOR_SERIAL_OUTPUT - EVENT] Waiting for output on serial console file = phd-tests/framework/src/test_vm/mod.rs line = 920 path = phd_tests::migrate::from_base::migration_from_base_and_back target = phd_framework::test_vm timeout_duration = Explicit(15s) vm = migration_from_base_and_back vm_id = 7c833161-a5da-44aa-a2f8-fddb86362450
3242026-10-20T15:29:23.098ZINFOphd-runner: [WAIT_FOR_SERIAL_OUTPUT - END] elapsed_milliseconds = 10 file = phd-tests/framework/src/test_vm/mod.rs line = 913 path = phd_tests::migrate::from_base::migration_from_base_and_back target = phd_framework::test_vm vm = migration_from_base_and_back vm_id = 7c833161-a5da-44aa-a2f8-fddb86362450
3252026-10-20T15:29:23.098ZINFOphd-runner: [WAIT_FOR_SERIAL_OUTPUT - START] file = phd-tests/framework/src/test_vm/mod.rs line = 913 path = phd_tests::migrate::from_base::migration_from_base_and_back target = phd_framework::test_vm vm = migration_from_base_and_back vm_id = 7c833161-a5da-44aa-a2f8-fddb86362450
3262026-10-20T15:29:23.098ZINFOphd-runner: [WAIT_FOR_SERIAL_OUTPUT - EVENT] Waiting for output on serial console file = phd-tests/framework/src/test_vm/mod.rs line = 920 path = phd_tests::migrate::from_base::migration_from_base_and_back target = phd_framework::test_vm timeout_duration = Explicit(300s) vm = migration_from_base_and_back vm_id = 7c833161-a5da-44aa-a2f8-fddb86362450
3272026-10-20T15:29:23.131ZINFOphd-runner: [WAIT_FOR_SERIAL_OUTPUT - END] elapsed_milliseconds = 33 file = phd-tests/framework/src/test_vm/mod.rs line = 913 path = phd_tests::migrate::from_base::migration_from_base_and_back target = phd_framework::test_vm vm = migration_from_base_and_back vm_id = 7c833161-a5da-44aa-a2f8-fddb86362450
3282026-10-20T15:29:23.132ZINFOphd-runner: [WAIT_FOR_SERIAL_OUTPUT - START] file = phd-tests/framework/src/test_vm/mod.rs line = 913 path = phd_tests::migrate::from_base::migration_from_base_and_back target = phd_framework::test_vm vm = migration_from_base_and_back vm_id = 7c833161-a5da-44aa-a2f8-fddb86362450
3292026-10-20T15:29:23.132ZINFOphd-runner: [WAIT_FOR_SERIAL_OUTPUT - EVENT] Waiting for output on serial console file = phd-tests/framework/src/test_vm/mod.rs line = 920 path = phd_tests::migrate::from_base::migration_from_base_and_back target = phd_framework::test_vm timeout_duration = Explicit(15s) vm = migration_from_base_and_back vm_id = 7c833161-a5da-44aa-a2f8-fddb86362450
3302026-10-20T15:29:23.142ZINFOphd-runner: [WAIT_FOR_SERIAL_OUTPUT - END] elapsed_milliseconds = 10 file = phd-tests/framework/src/test_vm/mod.rs line = 913 path = phd_tests::migrate::from_base::migration_from_base_and_back target = phd_framework::test_vm vm = migration_from_base_and_back vm_id = 7c833161-a5da-44aa-a2f8-fddb86362450
3312026-10-20T15:29:23.142ZINFOphd-runner: [WAIT_FOR_SERIAL_OUTPUT - START] file = phd-tests/framework/src/test_vm/mod.rs line = 913 path = phd_tests::migrate::from_base::migration_from_base_and_back target = phd_framework::test_vm vm = migration_from_base_and_back vm_id = 7c833161-a5da-44aa-a2f8-fddb86362450
3322026-10-20T15:29:23.142ZINFOphd-runner: [WAIT_FOR_SERIAL_OUTPUT - EVENT] Waiting for output on serial console file = phd-tests/framework/src/test_vm/mod.rs line = 920 path = phd_tests::migrate::from_base::migration_from_base_and_back target = phd_framework::test_vm timeout_duration = Explicit(300s) vm = migration_from_base_and_back vm_id = 7c833161-a5da-44aa-a2f8-fddb86362450
3332026-10-20T15:29:23.176ZINFOphd-runner: [WAIT_FOR_SERIAL_OUTPUT - END] elapsed_milliseconds = 33 file = phd-tests/framework/src/test_vm/mod.rs line = 913 path = phd_tests::migrate::from_base::migration_from_base_and_back target = phd_framework::test_vm vm = migration_from_base_and_back vm_id = 7c833161-a5da-44aa-a2f8-fddb86362450
3342026-10-20T15:29:23.176ZINFOphd-runner: [WAIT_FOR_SERIAL_OUTPUT - START] file = phd-tests/framework/src/test_vm/mod.rs line = 913 path = phd_tests::migrate::from_base::migration_from_base_and_back target = phd_framework::test_vm vm = migration_from_base_and_back vm_id = 7c833161-a5da-44aa-a2f8-fddb86362450
3352026-10-20T15:29:23.176ZINFOphd-runner: [WAIT_FOR_SERIAL_OUTPUT - EVENT] Waiting for output on serial console file = phd-tests/framework/src/test_vm/mod.rs line = 920 path = phd_tests::migrate::from_base::migration_from_base_and_back target = phd_framework::test_vm timeout_duration = Explicit(15s) vm = migration_from_base_and_back vm_id = 7c833161-a5da-44aa-a2f8-fddb86362450
3362026-10-20T15:29:23.187ZINFOphd-runner: [WAIT_FOR_SERIAL_OUTPUT - END] elapsed_milliseconds = 10 file = phd-tests/framework/src/test_vm/mod.rs line = 913 path = phd_tests::migrate::from_base::migration_from_base_and_back target = phd_framework::test_vm vm = migration_from_base_and_back vm_id = 7c833161-a5da-44aa-a2f8-fddb86362450
3372026-10-20T15:29:23.187ZINFOphd-runner: [WAIT_FOR_SERIAL_OUTPUT - START] file = phd-tests/framework/src/test_vm/mod.rs line = 913 path = phd_tests::migrate::from_base::migration_from_base_and_back target = phd_framework::test_vm vm = migration_from_base_and_back vm_id = 7c833161-a5da-44aa-a2f8-fddb86362450
3382026-10-20T15:29:23.187ZINFOphd-runner: [WAIT_FOR_SERIAL_OUTPUT - EVENT] Waiting for output on serial console file = phd-tests/framework/src/test_vm/mod.rs line = 920 path = phd_tests::migrate::from_base::migration_from_base_and_back target = phd_framework::test_vm timeout_duration = Explicit(300s) vm = migration_from_base_and_back vm_id = 7c833161-a5da-44aa-a2f8-fddb86362450
3392026-10-20T15:29:23.219ZINFOphd-runner: [WAIT_FOR_SERIAL_OUTPUT - END] elapsed_milliseconds = 32 file = phd-tests/framework/src/test_vm/mod.rs line = 913 path = phd_tests::migrate::from_base::migration_from_base_and_back target = phd_framework::test_vm vm = migration_from_base_and_back vm_id = 7c833161-a5da-44aa-a2f8-fddb86362450
3402026-10-20T15:29:23.220ZINFOphd-runner: [WAIT_FOR_SERIAL_OUTPUT - START] file = phd-tests/framework/src/test_vm/mod.rs line = 913 path = phd_tests::migrate::from_base::migration_from_base_and_back target = phd_framework::test_vm vm = migration_from_base_and_back vm_id = 7c833161-a5da-44aa-a2f8-fddb86362450
3412026-10-20T15:29:23.220ZINFOphd-runner: [WAIT_FOR_SERIAL_OUTPUT - EVENT] Waiting for output on serial console file = phd-tests/framework/src/test_vm/mod.rs line = 920 path = phd_tests::migrate::from_base::migration_from_base_and_back target = phd_framework::test_vm timeout_duration = Explicit(15s) vm = migration_from_base_and_back vm_id = 7c833161-a5da-44aa-a2f8-fddb86362450
3422026-10-20T15:29:23.230ZINFOphd-runner: [WAIT_FOR_SERIAL_OUTPUT - END] elapsed_milliseconds = 10 file = phd-tests/framework/src/test_vm/mod.rs line = 913 path = phd_tests::migrate::from_base::migration_from_base_and_back target = phd_framework::test_vm vm = migration_from_base_and_back vm_id = 7c833161-a5da-44aa-a2f8-fddb86362450
3432026-10-20T15:29:23.230ZINFOphd-runner: [WAIT_FOR_SERIAL_OUTPUT - START] file = phd-tests/framework/src/test_vm/mod.rs line = 913 path = phd_tests::migrate::from_base::migration_from_base_and_back target = phd_framework::test_vm vm = migration_from_base_and_back vm_id = 7c833161-a5da-44aa-a2f8-fddb86362450
3442026-10-20T15:29:23.230ZINFOphd-runner: [WAIT_FOR_SERIAL_OUTPUT - EVENT] Waiting for output on serial console file = phd-tests/framework/src/test_vm/mod.rs line = 920 path = phd_tests::migrate::from_base::migration_from_base_and_back target = phd_framework::test_vm timeout_duration = Explicit(300s) vm = migration_from_base_and_back vm_id = 7c833161-a5da-44aa-a2f8-fddb86362450
3452026-10-20T15:29:23.264ZINFOphd-runner: [WAIT_FOR_SERIAL_OUTPUT - END] elapsed_milliseconds = 33 file = phd-tests/framework/src/test_vm/mod.rs line = 913 path = phd_tests::migrate::from_base::migration_from_base_and_back target = phd_framework::test_vm vm = migration_from_base_and_back vm_id = 7c833161-a5da-44aa-a2f8-fddb86362450
3462026-10-20T15:29:23.264ZINFOphd-runner: [WAIT_FOR_SERIAL_OUTPUT - START] file = phd-tests/framework/src/test_vm/mod.rs line = 913 path = phd_tests::migrate::from_base::migration_from_base_and_back target = phd_framework::test_vm vm = migration_from_base_and_back vm_id = 7c833161-a5da-44aa-a2f8-fddb86362450
3472026-10-20T15:29:23.264ZINFOphd-runner: [WAIT_FOR_SERIAL_OUTPUT - EVENT] Waiting for output on serial console file = phd-tests/framework/src/test_vm/mod.rs line = 920 path = phd_tests::migrate::from_base::migration_from_base_and_back target = phd_framework::test_vm timeout_duration = Explicit(15s) vm = migration_from_base_and_back vm_id = 7c833161-a5da-44aa-a2f8-fddb86362450
3482026-10-20T15:29:23.276ZINFOphd-runner: [WAIT_FOR_SERIAL_OUTPUT - END] elapsed_milliseconds = 11 file = phd-tests/framework/src/test_vm/mod.rs line = 913 path = phd_tests::migrate::from_base::migration_from_base_and_back target = phd_framework::test_vm vm = migration_from_base_and_back vm_id = 7c833161-a5da-44aa-a2f8-fddb86362450
3492026-10-20T15:29:23.276ZINFOphd-runner: [WAIT_FOR_SERIAL_OUTPUT - START] file = phd-tests/framework/src/test_vm/mod.rs line = 913 path = phd_tests::migrate::from_base::migration_from_base_and_back target = phd_framework::test_vm vm = migration_from_base_and_back vm_id = 7c833161-a5da-44aa-a2f8-fddb86362450
3502026-10-20T15:29:23.276ZINFOphd-runner: [WAIT_FOR_SERIAL_OUTPUT - EVENT] Waiting for output on serial console file = phd-tests/framework/src/test_vm/mod.rs line = 920 path = phd_tests::migrate::from_base::migration_from_base_and_back target = phd_framework::test_vm timeout_duration = Explicit(300s) vm = migration_from_base_and_back vm_id = 7c833161-a5da-44aa-a2f8-fddb86362450
3512026-10-20T15:29:23.310ZINFOphd-runner: [WAIT_FOR_SERIAL_OUTPUT - END] elapsed_milliseconds = 34 file = phd-tests/framework/src/test_vm/mod.rs line = 913 path = phd_tests::migrate::from_base::migration_from_base_and_back target = phd_framework::test_vm vm = migration_from_base_and_back vm_id = 7c833161-a5da-44aa-a2f8-fddb86362450
3522026-10-20T15:29:23.310ZINFOphd-runner: [WAIT_FOR_SERIAL_OUTPUT - START] file = phd-tests/framework/src/test_vm/mod.rs line = 913 path = phd_tests::migrate::from_base::migration_from_base_and_back target = phd_framework::test_vm vm = migration_from_base_and_back vm_id = 7c833161-a5da-44aa-a2f8-fddb86362450
3532026-10-20T15:29:23.310ZINFOphd-runner: [WAIT_FOR_SERIAL_OUTPUT - EVENT] Waiting for output on serial console file = phd-tests/framework/src/test_vm/mod.rs line = 920 path = phd_tests::migrate::from_base::migration_from_base_and_back target = phd_framework::test_vm timeout_duration = Explicit(15s) vm = migration_from_base_and_back vm_id = 7c833161-a5da-44aa-a2f8-fddb86362450
3542026-10-20T15:29:23.321ZINFOphd-runner: [WAIT_FOR_SERIAL_OUTPUT - END] elapsed_milliseconds = 10 file = phd-tests/framework/src/test_vm/mod.rs line = 913 path = phd_tests::migrate::from_base::migration_from_base_and_back target = phd_framework::test_vm vm = migration_from_base_and_back vm_id = 7c833161-a5da-44aa-a2f8-fddb86362450
3552026-10-20T15:29:23.321ZINFOphd-runner: [WAIT_FOR_SERIAL_OUTPUT - START] file = phd-tests/framework/src/test_vm/mod.rs line = 913 path = phd_tests::migrate::from_base::migration_from_base_and_back target = phd_framework::test_vm vm = migration_from_base_and_back vm_id = 7c833161-a5da-44aa-a2f8-fddb86362450
3562026-10-20T15:29:23.321ZINFOphd-runner: [WAIT_FOR_SERIAL_OUTPUT - EVENT] Waiting for output on serial console file = phd-tests/framework/src/test_vm/mod.rs line = 920 path = phd_tests::migrate::from_base::migration_from_base_and_back target = phd_framework::test_vm timeout_duration = Explicit(300s) vm = migration_from_base_and_back vm_id = 7c833161-a5da-44aa-a2f8-fddb86362450
3572026-10-20T15:29:23.355ZINFOphd-runner: [WAIT_FOR_SERIAL_OUTPUT - END] elapsed_milliseconds = 33 file = phd-tests/framework/src/test_vm/mod.rs line = 913 path = phd_tests::migrate::from_base::migration_from_base_and_back target = phd_framework::test_vm vm = migration_from_base_and_back vm_id = 7c833161-a5da-44aa-a2f8-fddb86362450
3582026-10-20T15:29:23.355ZINFOphd-runner: [TEST - EVENT] migrating to new Propolis artifact for lifecycle test file = phd-tests/framework/src/lifecycle.rs line = 73 path = phd_tests::migrate::from_base::migration_from_base_and_back propolis_artifact = __DEFAULT_PROPOLIS target = phd_framework::lifecycle vm_name = migration_from_base_and_back
3592026-10-20T15:29:23.355ZINFOphd-runner: [NEW - START] file = phd-tests/framework/src/test_vm/mod.rs line = 300 path = phd_tests::migrate::from_base::migration_from_base_and_back target = phd_framework::test_vm
3602026-10-20T15:29:23.355ZINFOphd-runner: [NEW - EVENT] phd_framework::test_vm environment = EnvironmentSpec { location: Local, propolis_artifact: "__DEFAULT_PROPOLIS", metrics: None } file = phd-tests/framework/src/test_vm/mod.rs guest_os_kind = Alpine line = 318 path = phd_tests::migrate::from_base::migration_from_base_and_back target = phd_framework::test_vm vm_name = migration_from_base_and_back_lifecycle_0
3612026-10-20T15:29:23.355ZDEBGphd-runner: [NEW - EVENT] Verified artifact already exists file = phd-tests/framework/src/artifacts/store.rs line = 45 path = /work/phd-test/propolis-server target = phd_framework::artifacts::store
3622026-10-20T15:29:23.355ZINFOphd-runner: [NEW - EVENT] Launching Propolis server bootrom_path = "/phd-artifacts/740187046a7267d0de72d3455070333547dbc0ea023531471fb2b2a61effa448/OVMF_CODE.fd" file = phd-tests/framework/src/test_vm/server.rs line = 66 path = phd_tests::migrate::from_base::migration_from_base_and_back server_addr = 127.0.0.1:9002 server_path = "/work/phd-test/propolis-server" target = phd_framework::test_vm::server
3632026-10-20T15:29:23.355ZINFOphd-runner: [NEW - EVENT] Opening server log files file = phd-tests/framework/src/log_config.rs line = 84 path = phd_tests::migrate::from_base::migration_from_base_and_back stderr_path = "/tmp/propolis-phd/phd_tests::migrate::from_base::migration_from_base_and_back/migration_from_base_and_back_lifecycle_0.stderr.log" stdout_path = "/tmp/propolis-phd/phd_tests::migrate::from_base::migration_from_base_and_back/migration_from_base_and_back_lifecycle_0.stdout.log" target = phd_framework::log_config
3642026-10-20T15:29:23.401ZINFOphd-runner: [NEW - EVENT] Launched server with pid 938 file = phd-tests/framework/src/test_vm/server.rs line = 127 path = phd_tests::migrate::from_base::migration_from_base_and_back target = phd_framework::test_vm::server
3652026-10-20T15:29:23.414ZINFOphd-runner: [NEW - END] elapsed_milliseconds = 58 file = phd-tests/framework/src/test_vm/mod.rs line = 300 path = phd_tests::migrate::from_base::migration_from_base_and_back target = phd_framework::test_vm
3662026-10-20T15:29:23.414ZINFOphd-runner: [MIGRATE_FROM - START] file = phd-tests/framework/src/test_vm/mod.rs line = 609 path = phd_tests::migrate::from_base::migration_from_base_and_back source = migration_from_base_and_back source_id = 7c833161-a5da-44aa-a2f8-fddb86362450 target = phd_framework::test_vm target_id = db8188d2-361a-4f27-80e3-5066c3a8c621
3672026-10-20T15:29:23.414ZINFOphd-runner: [MIGRATE_FROM - EVENT] Migrating from source at address 127.0.0.1:9000 file = phd-tests/framework/src/test_vm/mod.rs line = 642 migration_id = e4f08c23-8b11-496b-8ce3-d5b419a2b515 path = phd_tests::migrate::from_base::migration_from_base_and_back source = migration_from_base_and_back source_id = 7c833161-a5da-44aa-a2f8-fddb86362450 target = phd_framework::test_vm target_id = db8188d2-361a-4f27-80e3-5066c3a8c621 timeout_duration = 45s
3682026-10-20T15:29:23.414ZINFOphd-runner: [INSTANCE_ENSURE_INTERNAL - START] file = phd-tests/framework/src/test_vm/mod.rs line = 412 path = phd_tests::migrate::from_base::migration_from_base_and_back source = migration_from_base_and_back source_id = 7c833161-a5da-44aa-a2f8-fddb86362450 target = phd_framework::test_vm target_id = db8188d2-361a-4f27-80e3-5066c3a8c621 vm = migration_from_base_and_back_lifecycle_0 vm_id = db8188d2-361a-4f27-80e3-5066c3a8c621
3692026-10-20T15:29:23.414ZINFOphd-runner: [INSTANCE_ENSURE_INTERNAL - EVENT] retriable error from instance_spec_ensure e = Communication Error: error sending request for url (http://127.0.0.1:9002/instance) file = phd-tests/framework/src/test_vm/mod.rs line = 455 path = phd_tests::migrate::from_base::migration_from_base_and_back source = migration_from_base_and_back source_id = 7c833161-a5da-44aa-a2f8-fddb86362450 target = phd_framework::test_vm target_id = db8188d2-361a-4f27-80e3-5066c3a8c621 vm = migration_from_base_and_back_lifecycle_0 vm_id = db8188d2-361a-4f27-80e3-5066c3a8c621
3702026-10-20T15:29:24.100ZINFOphd-runner: [INSTANCE_ENSURE_INTERNAL - EVENT] Started instance file = phd-tests/framework/src/test_vm/mod.rs instance_description.instance = Instance { properties: InstanceProperties { id: db8188d2-361a-4f27-80e3-5066c3a8c621, name: "phd-vm-db8188d2-361a-4f27-80e3-5066c3a8c621", description: "Pheidippides-managed VM", metadata: InstanceMetadata { silo_id: e79dd49b-58e4-4636-970a-03ba1e8d0df1, project_id: 348533e9-c339-403f-962d-7b9251e70fcc, sled_id: 5e5341d8-f985-4e3a-b47d-e7f3f8dd5bba, sled_serial: "5e5341d8-f985-4e3a-b47d-e7f3f8dd5bba", sled_revision: 1, sled_model: "pheidippes" } }, state: Migrating } line = 514 path = phd_tests::migrate::from_base::migration_from_base_and_back source = migration_from_base_and_back source_id = 7c833161-a5da-44aa-a2f8-fddb86362450 target = phd_framework::test_vm target_id = db8188d2-361a-4f27-80e3-5066c3a8c621 vm = migration_from_base_and_back_lifecycle_0 vm_id = db8188d2-361a-4f27-80e3-5066c3a8c621
3712026-10-20T15:29:24.100ZINFOphd-runner: [MIGRATE - START] file = phd-tests/framework/src/test_vm/mod.rs line = 663 migration_id = e4f08c23-8b11-496b-8ce3-d5b419a2b515 path = phd_tests::migrate::from_base::migration_from_base_and_back source = migration_from_base_and_back source_id = 7c833161-a5da-44aa-a2f8-fddb86362450 target = phd_framework::test_vm target_id = db8188d2-361a-4f27-80e3-5066c3a8c621
3722026-10-20T15:29:26.609ZINFOphd-runner: [SERIAL CONSOLE TASK - EVENT] serial socket control message file = phd-tests/framework/src/serial/mod.rs line = 275 s = {"Migrating":{"destination":"127.0.0.1:9002","from_start":7847}} target = phd_framework::serial
3732026-10-20T15:29:26.951ZINFOphd-runner: [MIGRATE_FROM - EVENT] Migration completed successfully file = phd-tests/framework/src/test_vm/mod.rs line = 676 path = phd_tests::migrate::from_base::migration_from_base_and_back source = migration_from_base_and_back source_id = 7c833161-a5da-44aa-a2f8-fddb86362450 target = phd_framework::test_vm target_id = db8188d2-361a-4f27-80e3-5066c3a8c621
3742026-10-20T15:29:26.951ZINFOphd-runner: [MIGRATE - END] elapsed_milliseconds = 2851 file = phd-tests/framework/src/test_vm/mod.rs line = 663 migration_id = e4f08c23-8b11-496b-8ce3-d5b419a2b515 path = phd_tests::migrate::from_base::migration_from_base_and_back source = migration_from_base_and_back source_id = 7c833161-a5da-44aa-a2f8-fddb86362450 target = phd_framework::test_vm target_id = db8188d2-361a-4f27-80e3-5066c3a8c621
3752026-10-20T15:29:26.955ZINFOphd-runner: [VM CLEANUP - START] file = phd-tests/framework/src/test_vm/mod.rs line = 1172 path = phd_tests::migrate::from_base::migration_from_base_and_back target = phd_framework::test_vm vm = migration_from_base_and_back vm_id = 7c833161-a5da-44aa-a2f8-fddb86362450
3762026-10-20T15:29:26.955ZINFOphd-runner: [WAIT_FOR_SERIAL_OUTPUT - START] file = phd-tests/framework/src/test_vm/mod.rs line = 913 path = phd_tests::migrate::from_base::migration_from_base_and_back target = phd_framework::test_vm vm = migration_from_base_and_back_lifecycle_0 vm_id = db8188d2-361a-4f27-80e3-5066c3a8c621
3772026-10-20T15:29:26.955ZINFOphd-runner: [WAIT_FOR_SERIAL_OUTPUT - EVENT] Waiting for output on serial console file = phd-tests/framework/src/test_vm/mod.rs line = 920 path = phd_tests::migrate::from_base::migration_from_base_and_back target = phd_framework::test_vm timeout_duration = Explicit(15s) vm = migration_from_base_and_back_lifecycle_0 vm_id = db8188d2-361a-4f27-80e3-5066c3a8c621
3782026-10-20T15:29:26.956ZDEBGphd-runner: [VM CLEANUP - EVENT] Killing Propolis server process file = phd-tests/framework/src/test_vm/server.rs line = 177 path = phd_tests::migrate::from_base::migration_from_base_and_back self.address = 127.0.0.1:9000 target = phd_framework::test_vm::server vm = migration_from_base_and_back vm_id = 7c833161-a5da-44aa-a2f8-fddb86362450
3792026-10-20T15:29:27.034ZINFOphd-runner: [VM CLEANUP - END] elapsed_milliseconds = 79 file = phd-tests/framework/src/test_vm/mod.rs line = 1172 path = phd_tests::migrate::from_base::migration_from_base_and_back target = phd_framework::test_vm vm = migration_from_base_and_back vm_id = 7c833161-a5da-44aa-a2f8-fddb86362450
3802026-10-20T15:29:27.035ZINFOphd-runner: [INSTANCE_ENSURE_INTERNAL - END] elapsed_milliseconds = 9159 file = phd-tests/framework/src/test_vm/mod.rs line = 412 path = phd_tests::migrate::from_base::migration_from_base_and_back target = phd_framework::test_vm vm = migration_from_base_and_back vm_id = 7c833161-a5da-44aa-a2f8-fddb86362450
3812026-10-20T15:29:27.035ZINFOphd-runner: [WAIT_FOR_SERIAL_OUTPUT - END] elapsed_milliseconds = 79 file = phd-tests/framework/src/test_vm/mod.rs line = 913 path = phd_tests::migrate::from_base::migration_from_base_and_back target = phd_framework::test_vm vm = migration_from_base_and_back_lifecycle_0 vm_id = db8188d2-361a-4f27-80e3-5066c3a8c621
3822026-10-20T15:29:27.035ZINFOphd-runner: [WAIT_FOR_SERIAL_OUTPUT - START] file = phd-tests/framework/src/test_vm/mod.rs line = 913 path = phd_tests::migrate::from_base::migration_from_base_and_back target = phd_framework::test_vm vm = migration_from_base_and_back_lifecycle_0 vm_id = db8188d2-361a-4f27-80e3-5066c3a8c621
3832026-10-20T15:29:27.035ZINFOphd-runner: [WAIT_FOR_SERIAL_OUTPUT - EVENT] Waiting for output on serial console file = phd-tests/framework/src/test_vm/mod.rs line = 920 path = phd_tests::migrate::from_base::migration_from_base_and_back target = phd_framework::test_vm timeout_duration = Explicit(300s) vm = migration_from_base_and_back_lifecycle_0 vm_id = db8188d2-361a-4f27-80e3-5066c3a8c621
3842026-10-20T15:29:27.066ZINFOphd-runner: [WAIT_FOR_SERIAL_OUTPUT - END] elapsed_milliseconds = 30 file = phd-tests/framework/src/test_vm/mod.rs line = 913 path = phd_tests::migrate::from_base::migration_from_base_and_back target = phd_framework::test_vm vm = migration_from_base_and_back_lifecycle_0 vm_id = db8188d2-361a-4f27-80e3-5066c3a8c621
3852026-10-20T15:29:27.066ZINFOphd-runner: [TEST - EVENT] migrating to new Propolis artifact for lifecycle test file = phd-tests/framework/src/lifecycle.rs line = 73 path = phd_tests::migrate::from_base::migration_from_base_and_back propolis_artifact = __BASE_PROPOLIS target = phd_framework::lifecycle vm_name = migration_from_base_and_back
3862026-10-20T15:29:27.066ZINFOphd-runner: [NEW - START] file = phd-tests/framework/src/test_vm/mod.rs line = 300 path = phd_tests::migrate::from_base::migration_from_base_and_back target = phd_framework::test_vm
3872026-10-20T15:29:27.066ZINFOphd-runner: [NEW - EVENT] phd_framework::test_vm environment = EnvironmentSpec { location: Local, propolis_artifact: "__BASE_PROPOLIS", metrics: None } file = phd-tests/framework/src/test_vm/mod.rs guest_os_kind = Alpine line = 318 path = phd_tests::migrate::from_base::migration_from_base_and_back target = phd_framework::test_vm vm_name = migration_from_base_and_back_lifecycle_1
3882026-10-20T15:29:27.066ZDEBGphd-runner: [NEW - EVENT] Verified artifact already exists file = phd-tests/framework/src/artifacts/store.rs line = 45 path = /phd-artifacts/739eeb04a4728b2e7609b038a587b5de0d939c2a02cf61882a60d42a6ba676e1/propolis-server target = phd_framework::artifacts::store
3892026-10-20T15:29:27.066ZINFOphd-runner: [NEW - EVENT] Launching Propolis server bootrom_path = "/phd-artifacts/740187046a7267d0de72d3455070333547dbc0ea023531471fb2b2a61effa448/OVMF_CODE.fd" file = phd-tests/framework/src/test_vm/server.rs line = 66 path = phd_tests::migrate::from_base::migration_from_base_and_back server_addr = 127.0.0.1:9004 server_path = "/phd-artifacts/739eeb04a4728b2e7609b038a587b5de0d939c2a02cf61882a60d42a6ba676e1/propolis-server" target = phd_framework::test_vm::server
3902026-10-20T15:29:27.066ZINFOphd-runner: [NEW - EVENT] Opening server log files file = phd-tests/framework/src/log_config.rs line = 84 path = phd_tests::migrate::from_base::migration_from_base_and_back stderr_path = "/tmp/propolis-phd/phd_tests::migrate::from_base::migration_from_base_and_back/migration_from_base_and_back_lifecycle_1.stderr.log" stdout_path = "/tmp/propolis-phd/phd_tests::migrate::from_base::migration_from_base_and_back/migration_from_base_and_back_lifecycle_1.stdout.log" target = phd_framework::log_config
3912026-10-20T15:29:27.117ZINFOphd-runner: [NEW - EVENT] Launched server with pid 940 file = phd-tests/framework/src/test_vm/server.rs line = 127 path = phd_tests::migrate::from_base::migration_from_base_and_back target = phd_framework::test_vm::server
3922026-10-20T15:29:27.130ZINFOphd-runner: [NEW - END] elapsed_milliseconds = 64 file = phd-tests/framework/src/test_vm/mod.rs line = 300 path = phd_tests::migrate::from_base::migration_from_base_and_back target = phd_framework::test_vm
3932026-10-20T15:29:27.130ZINFOphd-runner: [MIGRATE_FROM - START] file = phd-tests/framework/src/test_vm/mod.rs line = 609 path = phd_tests::migrate::from_base::migration_from_base_and_back source = migration_from_base_and_back_lifecycle_0 source_id = db8188d2-361a-4f27-80e3-5066c3a8c621 target = phd_framework::test_vm target_id = 7122b6ac-e33d-4164-9d24-df6d90e02209
3942026-10-20T15:29:27.131ZINFOphd-runner: [MIGRATE_FROM - EVENT] Migrating from source at address 127.0.0.1:9002 file = phd-tests/framework/src/test_vm/mod.rs line = 642 migration_id = ec5eb483-9bde-4737-be2b-ac8cc24c2c00 path = phd_tests::migrate::from_base::migration_from_base_and_back source = migration_from_base_and_back_lifecycle_0 source_id = db8188d2-361a-4f27-80e3-5066c3a8c621 target = phd_framework::test_vm target_id = 7122b6ac-e33d-4164-9d24-df6d90e02209 timeout_duration = 45s
3952026-10-20T15:29:27.131ZINFOphd-runner: [INSTANCE_ENSURE_INTERNAL - START] file = phd-tests/framework/src/test_vm/mod.rs line = 412 path = phd_tests::migrate::from_base::migration_from_base_and_back source = migration_from_base_and_back_lifecycle_0 source_id = db8188d2-361a-4f27-80e3-5066c3a8c621 target = phd_framework::test_vm target_id = 7122b6ac-e33d-4164-9d24-df6d90e02209 vm = migration_from_base_and_back_lifecycle_1 vm_id = 7122b6ac-e33d-4164-9d24-df6d90e02209
3962026-10-20T15:29:27.131ZINFOphd-runner: [INSTANCE_ENSURE_INTERNAL - EVENT] retriable error from instance_spec_ensure e = Communication Error: error sending request for url (http://127.0.0.1:9004/instance) file = phd-tests/framework/src/test_vm/mod.rs line = 455 path = phd_tests::migrate::from_base::migration_from_base_and_back source = migration_from_base_and_back_lifecycle_0 source_id = db8188d2-361a-4f27-80e3-5066c3a8c621 target = phd_framework::test_vm target_id = 7122b6ac-e33d-4164-9d24-df6d90e02209 vm = migration_from_base_and_back_lifecycle_1 vm_id = 7122b6ac-e33d-4164-9d24-df6d90e02209
3972026-10-20T15:29:27.715ZINFOphd-runner: [INSTANCE_ENSURE_INTERNAL - EVENT] Started instance file = phd-tests/framework/src/test_vm/mod.rs instance_description.instance = Instance { properties: InstanceProperties { id: 7122b6ac-e33d-4164-9d24-df6d90e02209, name: "phd-vm-7122b6ac-e33d-4164-9d24-df6d90e02209", description: "Pheidippides-managed VM", metadata: InstanceMetadata { silo_id: e79dd49b-58e4-4636-970a-03ba1e8d0df1, project_id: 348533e9-c339-403f-962d-7b9251e70fcc, sled_id: 0464cfa9-344c-4ff1-afc3-b304964ebf44, sled_serial: "0464cfa9-344c-4ff1-afc3-b304964ebf44", sled_revision: 1, sled_model: "pheidippes" } }, state: Migrating } line = 514 path = phd_tests::migrate::from_base::migration_from_base_and_back source = migration_from_base_and_back_lifecycle_0 source_id = db8188d2-361a-4f27-80e3-5066c3a8c621 target = phd_framework::test_vm target_id = 7122b6ac-e33d-4164-9d24-df6d90e02209 vm = migration_from_base_and_back_lifecycle_1 vm_id = 7122b6ac-e33d-4164-9d24-df6d90e02209
3982026-10-20T15:29:27.716ZINFOphd-runner: [MIGRATE - START] file = phd-tests/framework/src/test_vm/mod.rs line = 663 migration_id = ec5eb483-9bde-4737-be2b-ac8cc24c2c00 path = phd_tests::migrate::from_base::migration_from_base_and_back source = migration_from_base_and_back_lifecycle_0 source_id = db8188d2-361a-4f27-80e3-5066c3a8c621 target = phd_framework::test_vm target_id = 7122b6ac-e33d-4164-9d24-df6d90e02209
3992026-10-20T15:29:30.194ZINFOphd-runner: [SERIAL CONSOLE TASK - EVENT] serial socket control message file = phd-tests/framework/src/serial/mod.rs line = 275 s = {"Migrating":{"destination":"127.0.0.1:9004","from_start":7894}} target = phd_framework::serial
4002026-10-20T15:29:30.655ZINFOphd-runner: [MIGRATE_FROM - EVENT] Migration completed successfully file = phd-tests/framework/src/test_vm/mod.rs line = 676 path = phd_tests::migrate::from_base::migration_from_base_and_back source = migration_from_base_and_back_lifecycle_0 source_id = db8188d2-361a-4f27-80e3-5066c3a8c621 target = phd_framework::test_vm target_id = 7122b6ac-e33d-4164-9d24-df6d90e02209
4012026-10-20T15:29:30.655ZINFOphd-runner: [MIGRATE - END] elapsed_milliseconds = 2938 file = phd-tests/framework/src/test_vm/mod.rs line = 663 migration_id = ec5eb483-9bde-4737-be2b-ac8cc24c2c00 path = phd_tests::migrate::from_base::migration_from_base_and_back source = migration_from_base_and_back_lifecycle_0 source_id = db8188d2-361a-4f27-80e3-5066c3a8c621 target = phd_framework::test_vm target_id = 7122b6ac-e33d-4164-9d24-df6d90e02209
4022026-10-20T15:29:30.657ZINFOphd-runner: [VM CLEANUP - START] file = phd-tests/framework/src/test_vm/mod.rs line = 1172 path = phd_tests::migrate::from_base::migration_from_base_and_back target = phd_framework::test_vm vm = migration_from_base_and_back_lifecycle_0 vm_id = db8188d2-361a-4f27-80e3-5066c3a8c621
4032026-10-20T15:29:30.657ZINFOphd-runner: [WAIT_FOR_SERIAL_OUTPUT - START] file = phd-tests/framework/src/test_vm/mod.rs line = 913 path = phd_tests::migrate::from_base::migration_from_base_and_back target = phd_framework::test_vm vm = migration_from_base_and_back_lifecycle_1 vm_id = 7122b6ac-e33d-4164-9d24-df6d90e02209
4042026-10-20T15:29:30.657ZINFOphd-runner: [WAIT_FOR_SERIAL_OUTPUT - EVENT] Waiting for output on serial console file = phd-tests/framework/src/test_vm/mod.rs line = 920 path = phd_tests::migrate::from_base::migration_from_base_and_back target = phd_framework::test_vm timeout_duration = Explicit(15s) vm = migration_from_base_and_back_lifecycle_1 vm_id = 7122b6ac-e33d-4164-9d24-df6d90e02209
4052026-10-20T15:29:30.659ZDEBGphd-runner: [VM CLEANUP - EVENT] Killing Propolis server process file = phd-tests/framework/src/test_vm/server.rs line = 177 path = phd_tests::migrate::from_base::migration_from_base_and_back self.address = 127.0.0.1:9002 target = phd_framework::test_vm::server vm = migration_from_base_and_back_lifecycle_0 vm_id = db8188d2-361a-4f27-80e3-5066c3a8c621
4062026-10-20T15:29:30.744ZINFOphd-runner: [VM CLEANUP - END] elapsed_milliseconds = 86 file = phd-tests/framework/src/test_vm/mod.rs line = 1172 path = phd_tests::migrate::from_base::migration_from_base_and_back target = phd_framework::test_vm vm = migration_from_base_and_back_lifecycle_0 vm_id = db8188d2-361a-4f27-80e3-5066c3a8c621
4072026-10-20T15:29:30.744ZINFOphd-runner: [INSTANCE_ENSURE_INTERNAL - END] elapsed_milliseconds = 7330 file = phd-tests/framework/src/test_vm/mod.rs line = 412 path = phd_tests::migrate::from_base::migration_from_base_and_back source = migration_from_base_and_back source_id = 7c833161-a5da-44aa-a2f8-fddb86362450 target = phd_framework::test_vm target_id = db8188d2-361a-4f27-80e3-5066c3a8c621 vm = migration_from_base_and_back_lifecycle_0 vm_id = db8188d2-361a-4f27-80e3-5066c3a8c621
4082026-10-20T15:29:30.744ZINFOphd-runner: [MIGRATE_FROM - END] elapsed_milliseconds = 7330 file = phd-tests/framework/src/test_vm/mod.rs line = 609 path = phd_tests::migrate::from_base::migration_from_base_and_back source = migration_from_base_and_back source_id = 7c833161-a5da-44aa-a2f8-fddb86362450 target = phd_framework::test_vm target_id = db8188d2-361a-4f27-80e3-5066c3a8c621
4092026-10-20T15:29:30.744ZINFOphd-runner: [WAIT_FOR_SERIAL_OUTPUT - END] elapsed_milliseconds = 87 file = phd-tests/framework/src/test_vm/mod.rs line = 913 path = phd_tests::migrate::from_base::migration_from_base_and_back target = phd_framework::test_vm vm = migration_from_base_and_back_lifecycle_1 vm_id = 7122b6ac-e33d-4164-9d24-df6d90e02209
4102026-10-20T15:29:30.745ZINFOphd-runner: [WAIT_FOR_SERIAL_OUTPUT - START] file = phd-tests/framework/src/test_vm/mod.rs line = 913 path = phd_tests::migrate::from_base::migration_from_base_and_back target = phd_framework::test_vm vm = migration_from_base_and_back_lifecycle_1 vm_id = 7122b6ac-e33d-4164-9d24-df6d90e02209
4112026-10-20T15:29:30.745ZINFOphd-runner: [WAIT_FOR_SERIAL_OUTPUT - EVENT] Waiting for output on serial console file = phd-tests/framework/src/test_vm/mod.rs line = 920 path = phd_tests::migrate::from_base::migration_from_base_and_back target = phd_framework::test_vm timeout_duration = Explicit(300s) vm = migration_from_base_and_back_lifecycle_1 vm_id = 7122b6ac-e33d-4164-9d24-df6d90e02209
4122026-10-20T15:29:30.769ZINFOphd-runner: [WAIT_FOR_SERIAL_OUTPUT - END] elapsed_milliseconds = 24 file = phd-tests/framework/src/test_vm/mod.rs line = 913 path = phd_tests::migrate::from_base::migration_from_base_and_back target = phd_framework::test_vm vm = migration_from_base_and_back_lifecycle_1 vm_id = 7122b6ac-e33d-4164-9d24-df6d90e02209
4132026-10-20T15:29:30.769ZINFOphd-runner: [TEST - EVENT] migrating to new Propolis artifact for lifecycle test file = phd-tests/framework/src/lifecycle.rs line = 73 path = phd_tests::migrate::from_base::migration_from_base_and_back propolis_artifact = __DEFAULT_PROPOLIS target = phd_framework::lifecycle vm_name = migration_from_base_and_back
4142026-10-20T15:29:30.769ZINFOphd-runner: [NEW - START] file = phd-tests/framework/src/test_vm/mod.rs line = 300 path = phd_tests::migrate::from_base::migration_from_base_and_back target = phd_framework::test_vm
4152026-10-20T15:29:30.769ZINFOphd-runner: [NEW - EVENT] phd_framework::test_vm environment = EnvironmentSpec { location: Local, propolis_artifact: "__DEFAULT_PROPOLIS", metrics: None } file = phd-tests/framework/src/test_vm/mod.rs guest_os_kind = Alpine line = 318 path = phd_tests::migrate::from_base::migration_from_base_and_back target = phd_framework::test_vm vm_name = migration_from_base_and_back_lifecycle_2
4162026-10-20T15:29:30.769ZDEBGphd-runner: [NEW - EVENT] Verified artifact already exists file = phd-tests/framework/src/artifacts/store.rs line = 45 path = /work/phd-test/propolis-server target = phd_framework::artifacts::store
4172026-10-20T15:29:30.769ZINFOphd-runner: [NEW - EVENT] Launching Propolis server bootrom_path = "/phd-artifacts/740187046a7267d0de72d3455070333547dbc0ea023531471fb2b2a61effa448/OVMF_CODE.fd" file = phd-tests/framework/src/test_vm/server.rs line = 66 path = phd_tests::migrate::from_base::migration_from_base_and_back server_addr = 127.0.0.1:9006 server_path = "/work/phd-test/propolis-server" target = phd_framework::test_vm::server
4182026-10-20T15:29:30.770ZINFOphd-runner: [NEW - EVENT] Opening server log files file = phd-tests/framework/src/log_config.rs line = 84 path = phd_tests::migrate::from_base::migration_from_base_and_back stderr_path = "/tmp/propolis-phd/phd_tests::migrate::from_base::migration_from_base_and_back/migration_from_base_and_back_lifecycle_2.stderr.log" stdout_path = "/tmp/propolis-phd/phd_tests::migrate::from_base::migration_from_base_and_back/migration_from_base_and_back_lifecycle_2.stdout.log" target = phd_framework::log_config
4192026-10-20T15:29:30.816ZINFOphd-runner: [NEW - EVENT] Launched server with pid 942 file = phd-tests/framework/src/test_vm/server.rs line = 127 path = phd_tests::migrate::from_base::migration_from_base_and_back target = phd_framework::test_vm::server
4202026-10-20T15:29:30.830ZINFOphd-runner: [NEW - END] elapsed_milliseconds = 60 file = phd-tests/framework/src/test_vm/mod.rs line = 300 path = phd_tests::migrate::from_base::migration_from_base_and_back target = phd_framework::test_vm
4212026-10-20T15:29:30.830ZINFOphd-runner: [MIGRATE_FROM - START] file = phd-tests/framework/src/test_vm/mod.rs line = 609 path = phd_tests::migrate::from_base::migration_from_base_and_back source = migration_from_base_and_back_lifecycle_1 source_id = 7122b6ac-e33d-4164-9d24-df6d90e02209 target = phd_framework::test_vm target_id = 3d6af4cb-62f1-42ac-8b9a-e7f72413ed63
4222026-10-20T15:29:30.830ZINFOphd-runner: [MIGRATE_FROM - EVENT] Migrating from source at address 127.0.0.1:9004 file = phd-tests/framework/src/test_vm/mod.rs line = 642 migration_id = 88a6a950-f680-47a3-afcf-ec35aa9f0258 path = phd_tests::migrate::from_base::migration_from_base_and_back source = migration_from_base_and_back_lifecycle_1 source_id = 7122b6ac-e33d-4164-9d24-df6d90e02209 target = phd_framework::test_vm target_id = 3d6af4cb-62f1-42ac-8b9a-e7f72413ed63 timeout_duration = 45s
4232026-10-20T15:29:30.830ZINFOphd-runner: [INSTANCE_ENSURE_INTERNAL - START] file = phd-tests/framework/src/test_vm/mod.rs line = 412 path = phd_tests::migrate::from_base::migration_from_base_and_back source = migration_from_base_and_back_lifecycle_1 source_id = 7122b6ac-e33d-4164-9d24-df6d90e02209 target = phd_framework::test_vm target_id = 3d6af4cb-62f1-42ac-8b9a-e7f72413ed63 vm = migration_from_base_and_back_lifecycle_2 vm_id = 3d6af4cb-62f1-42ac-8b9a-e7f72413ed63
4242026-10-20T15:29:30.831ZINFOphd-runner: [INSTANCE_ENSURE_INTERNAL - EVENT] retriable error from instance_spec_ensure e = Communication Error: error sending request for url (http://127.0.0.1:9006/instance) file = phd-tests/framework/src/test_vm/mod.rs line = 455 path = phd_tests::migrate::from_base::migration_from_base_and_back source = migration_from_base_and_back_lifecycle_1 source_id = 7122b6ac-e33d-4164-9d24-df6d90e02209 target = phd_framework::test_vm target_id = 3d6af4cb-62f1-42ac-8b9a-e7f72413ed63 vm = migration_from_base_and_back_lifecycle_2 vm_id = 3d6af4cb-62f1-42ac-8b9a-e7f72413ed63
4252026-10-20T15:29:31.382ZINFOphd-runner: [INSTANCE_ENSURE_INTERNAL - EVENT] Started instance file = phd-tests/framework/src/test_vm/mod.rs instance_description.instance = Instance { properties: InstanceProperties { id: 3d6af4cb-62f1-42ac-8b9a-e7f72413ed63, name: "phd-vm-3d6af4cb-62f1-42ac-8b9a-e7f72413ed63", description: "Pheidippides-managed VM", metadata: InstanceMetadata { silo_id: e79dd49b-58e4-4636-970a-03ba1e8d0df1, project_id: 348533e9-c339-403f-962d-7b9251e70fcc, sled_id: 939cb2fd-6030-4d7d-aa23-cc114310135a, sled_serial: "939cb2fd-6030-4d7d-aa23-cc114310135a", sled_revision: 1, sled_model: "pheidippes" } }, state: Migrating } line = 514 path = phd_tests::migrate::from_base::migration_from_base_and_back source = migration_from_base_and_back_lifecycle_1 source_id = 7122b6ac-e33d-4164-9d24-df6d90e02209 target = phd_framework::test_vm target_id = 3d6af4cb-62f1-42ac-8b9a-e7f72413ed63 vm = migration_from_base_and_back_lifecycle_2 vm_id = 3d6af4cb-62f1-42ac-8b9a-e7f72413ed63
4262026-10-20T15:29:31.382ZINFOphd-runner: [MIGRATE - START] file = phd-tests/framework/src/test_vm/mod.rs line = 663 migration_id = 88a6a950-f680-47a3-afcf-ec35aa9f0258 path = phd_tests::migrate::from_base::migration_from_base_and_back source = migration_from_base_and_back_lifecycle_1 source_id = 7122b6ac-e33d-4164-9d24-df6d90e02209 target = phd_framework::test_vm target_id = 3d6af4cb-62f1-42ac-8b9a-e7f72413ed63
4272026-10-20T15:29:33.878ZINFOphd-runner: [SERIAL CONSOLE TASK - EVENT] serial socket control message file = phd-tests/framework/src/serial/mod.rs line = 275 s = {"Migrating":{"destination":"127.0.0.1:9006","from_start":7941}} target = phd_framework::serial
4282026-10-20T15:29:35.514ZINFOphd-runner: [MIGRATE_FROM - EVENT] Migration completed successfully file = phd-tests/framework/src/test_vm/mod.rs line = 676 path = phd_tests::migrate::from_base::migration_from_base_and_back source = migration_from_base_and_back_lifecycle_1 source_id = 7122b6ac-e33d-4164-9d24-df6d90e02209 target = phd_framework::test_vm target_id = 3d6af4cb-62f1-42ac-8b9a-e7f72413ed63
4292026-10-20T15:29:35.514ZINFOphd-runner: [MIGRATE - END] elapsed_milliseconds = 4132 file = phd-tests/framework/src/test_vm/mod.rs line = 663 migration_id = 88a6a950-f680-47a3-afcf-ec35aa9f0258 path = phd_tests::migrate::from_base::migration_from_base_and_back source = migration_from_base_and_back_lifecycle_1 source_id = 7122b6ac-e33d-4164-9d24-df6d90e02209 target = phd_framework::test_vm target_id = 3d6af4cb-62f1-42ac-8b9a-e7f72413ed63
4302026-10-20T15:29:35.518ZINFOphd-runner: [VM CLEANUP - START] file = phd-tests/framework/src/test_vm/mod.rs line = 1172 path = phd_tests::migrate::from_base::migration_from_base_and_back target = phd_framework::test_vm vm = migration_from_base_and_back_lifecycle_1 vm_id = 7122b6ac-e33d-4164-9d24-df6d90e02209
4312026-10-20T15:29:35.518ZINFOphd-runner: [WAIT_FOR_SERIAL_OUTPUT - START] file = phd-tests/framework/src/test_vm/mod.rs line = 913 path = phd_tests::migrate::from_base::migration_from_base_and_back target = phd_framework::test_vm vm = migration_from_base_and_back_lifecycle_2 vm_id = 3d6af4cb-62f1-42ac-8b9a-e7f72413ed63
4322026-10-20T15:29:35.518ZINFOphd-runner: [WAIT_FOR_SERIAL_OUTPUT - EVENT] Waiting for output on serial console file = phd-tests/framework/src/test_vm/mod.rs line = 920 path = phd_tests::migrate::from_base::migration_from_base_and_back target = phd_framework::test_vm timeout_duration = Explicit(15s) vm = migration_from_base_and_back_lifecycle_2 vm_id = 3d6af4cb-62f1-42ac-8b9a-e7f72413ed63
4332026-10-20T15:29:35.520ZDEBGphd-runner: [VM CLEANUP - EVENT] Killing Propolis server process file = phd-tests/framework/src/test_vm/server.rs line = 177 path = phd_tests::migrate::from_base::migration_from_base_and_back self.address = 127.0.0.1:9004 target = phd_framework::test_vm::server vm = migration_from_base_and_back_lifecycle_1 vm_id = 7122b6ac-e33d-4164-9d24-df6d90e02209
4342026-10-20T15:29:35.598ZINFOphd-runner: [VM CLEANUP - END] elapsed_milliseconds = 80 file = phd-tests/framework/src/test_vm/mod.rs line = 1172 path = phd_tests::migrate::from_base::migration_from_base_and_back target = phd_framework::test_vm vm = migration_from_base_and_back_lifecycle_1 vm_id = 7122b6ac-e33d-4164-9d24-df6d90e02209
4352026-10-20T15:29:35.598ZINFOphd-runner: [INSTANCE_ENSURE_INTERNAL - END] elapsed_milliseconds = 8467 file = phd-tests/framework/src/test_vm/mod.rs line = 412 path = phd_tests::migrate::from_base::migration_from_base_and_back source = migration_from_base_and_back_lifecycle_0 source_id = db8188d2-361a-4f27-80e3-5066c3a8c621 target = phd_framework::test_vm target_id = 7122b6ac-e33d-4164-9d24-df6d90e02209 vm = migration_from_base_and_back_lifecycle_1 vm_id = 7122b6ac-e33d-4164-9d24-df6d90e02209
4362026-10-20T15:29:35.599ZINFOphd-runner: [MIGRATE_FROM - END] elapsed_milliseconds = 8468 file = phd-tests/framework/src/test_vm/mod.rs line = 609 path = phd_tests::migrate::from_base::migration_from_base_and_back source = migration_from_base_and_back_lifecycle_0 source_id = db8188d2-361a-4f27-80e3-5066c3a8c621 target = phd_framework::test_vm target_id = 7122b6ac-e33d-4164-9d24-df6d90e02209
4372026-10-20T15:29:35.599ZINFOphd-runner: [WAIT_FOR_SERIAL_OUTPUT - END] elapsed_milliseconds = 80 file = phd-tests/framework/src/test_vm/mod.rs line = 913 path = phd_tests::migrate::from_base::migration_from_base_and_back target = phd_framework::test_vm vm = migration_from_base_and_back_lifecycle_2 vm_id = 3d6af4cb-62f1-42ac-8b9a-e7f72413ed63
4382026-10-20T15:29:35.599ZINFOphd-runner: [WAIT_FOR_SERIAL_OUTPUT - START] file = phd-tests/framework/src/test_vm/mod.rs line = 913 path = phd_tests::migrate::from_base::migration_from_base_and_back target = phd_framework::test_vm vm = migration_from_base_and_back_lifecycle_2 vm_id = 3d6af4cb-62f1-42ac-8b9a-e7f72413ed63
4392026-10-20T15:29:35.599ZINFOphd-runner: [WAIT_FOR_SERIAL_OUTPUT - EVENT] Waiting for output on serial console file = phd-tests/framework/src/test_vm/mod.rs line = 920 path = phd_tests::migrate::from_base::migration_from_base_and_back target = phd_framework::test_vm timeout_duration = Explicit(300s) vm = migration_from_base_and_back_lifecycle_2 vm_id = 3d6af4cb-62f1-42ac-8b9a-e7f72413ed63
4402026-10-20T15:29:35.630ZINFOphd-runner: [WAIT_FOR_SERIAL_OUTPUT - END] elapsed_milliseconds = 30 file = phd-tests/framework/src/test_vm/mod.rs line = 913 path = phd_tests::migrate::from_base::migration_from_base_and_back target = phd_framework::test_vm vm = migration_from_base_and_back_lifecycle_2 vm_id = 3d6af4cb-62f1-42ac-8b9a-e7f72413ed63
4412026-10-20T15:29:35.630ZINFOphd-runner: [VM CLEANUP - START] file = phd-tests/framework/src/test_vm/mod.rs line = 1172 path = phd_tests::migrate::from_base::migration_from_base_and_back target = phd_framework::test_vm vm = migration_from_base_and_back_lifecycle_2 vm_id = 3d6af4cb-62f1-42ac-8b9a-e7f72413ed63
4422026-10-20T15:29:35.630ZDEBGphd-runner: [SERIAL CONSOLE TASK - EVENT] serial console command channel was closed file = phd-tests/framework/src/serial/mod.rs line = 213 target = phd_framework::serial
4432026-10-20T15:29:35.630ZINFOphd-runner: [SERIAL CONSOLE TASK - END] elapsed_milliseconds = 17111 file = phd-tests/framework/src/serial/mod.rs line = 200 target = phd_framework::serial
4442026-10-20T15:29:35.630ZINFOphd-runner: test phd_tests::migrate::from_base::migration_from_base_and_back ... ok file = phd-tests/runner/src/execute.rs line = 141 target = phd_runner::execute
4452026-10-20T15:29:35.631ZINFOphd-runner: [TEST_CLEANUP - START] file = phd-tests/runner/src/fixtures.rs line = 51 target = phd_runner::fixtures
4462026-10-20T15:29:35.632ZDEBGphd-runner: [VM CLEANUP - EVENT] trying to ensure Propolis server VM is destroyed file = phd-tests/framework/src/test_vm/mod.rs line = 1195 path = phd_tests::migrate::from_base::migration_from_base_and_back target = phd_framework::test_vm vm = migration_from_base_and_back_lifecycle_2 vm_id = 3d6af4cb-62f1-42ac-8b9a-e7f72413ed63
4472026-10-20T15:29:36.307ZDEBGphd-runner: [VM CLEANUP - EVENT] Killing Propolis server process file = phd-tests/framework/src/test_vm/server.rs line = 177 path = phd_tests::migrate::from_base::migration_from_base_and_back self.address = 127.0.0.1:9006 target = phd_framework::test_vm::server vm = migration_from_base_and_back_lifecycle_2 vm_id = 3d6af4cb-62f1-42ac-8b9a-e7f72413ed63
4482026-10-20T15:29:36.393ZDEBGphd-runner: [VM CLEANUP - EVENT] zfs clone dropped file = phd-tests/framework/src/zfs.rs line = 83 path = phd_tests::migrate::from_base::migration_from_base_and_back target = phd_framework::zfs vm = migration_from_base_and_back_lifecycle_2 vm_id = 3d6af4cb-62f1-42ac-8b9a-e7f72413ed63
4492026-10-20T15:29:36.394ZDEBGphd-runner: [VM CLEANUP - EVENT] executing ZFS command args = ["phd-artifacts/phd-clone-f85b5936-58d2-4111-837d-e05c11dfee78"] file = phd-tests/framework/src/zfs.rs line = 304 path = phd_tests::migrate::from_base::migration_from_base_and_back target = phd_framework::zfs verb = destroy vm = migration_from_base_and_back_lifecycle_2 vm_id = 3d6af4cb-62f1-42ac-8b9a-e7f72413ed63
4502026-10-20T15:29:36.419ZDEBGphd-runner: [VM CLEANUP - EVENT] zfs snapshot dropped file = phd-tests/framework/src/zfs.rs line = 57 path = phd_tests::migrate::from_base::migration_from_base_and_back target = phd_framework::zfs vm = migration_from_base_and_back_lifecycle_2 vm_id = 3d6af4cb-62f1-42ac-8b9a-e7f72413ed63
4512026-10-20T15:29:36.419ZDEBGphd-runner: [VM CLEANUP - EVENT] executing ZFS command args = ["phd-artifacts@phd-cd945336-2758-4461-81bd-fc71defd57ae"] file = phd-tests/framework/src/zfs.rs line = 304 path = phd_tests::migrate::from_base::migration_from_base_and_back target = phd_framework::zfs verb = destroy vm = migration_from_base_and_back_lifecycle_2 vm_id = 3d6af4cb-62f1-42ac-8b9a-e7f72413ed63
4522026-10-20T15:29:36.438ZINFOphd-runner: [VM CLEANUP - END] elapsed_milliseconds = 807 file = phd-tests/framework/src/test_vm/mod.rs line = 1172 path = phd_tests::migrate::from_base::migration_from_base_and_back target = phd_framework::test_vm vm = migration_from_base_and_back_lifecycle_2 vm_id = 3d6af4cb-62f1-42ac-8b9a-e7f72413ed63
4532026-10-20T15:29:36.438ZINFOphd-runner: [INSTANCE_ENSURE_INTERNAL - END] elapsed_milliseconds = 5607 file = phd-tests/framework/src/test_vm/mod.rs line = 412 path = phd_tests::migrate::from_base::migration_from_base_and_back source = migration_from_base_and_back_lifecycle_1 source_id = 7122b6ac-e33d-4164-9d24-df6d90e02209 target = phd_framework::test_vm target_id = 3d6af4cb-62f1-42ac-8b9a-e7f72413ed63 vm = migration_from_base_and_back_lifecycle_2 vm_id = 3d6af4cb-62f1-42ac-8b9a-e7f72413ed63
4542026-10-20T15:29:36.438ZINFOphd-runner: [MIGRATE_FROM - END] elapsed_milliseconds = 5608 file = phd-tests/framework/src/test_vm/mod.rs line = 609 path = phd_tests::migrate::from_base::migration_from_base_and_back source = migration_from_base_and_back_lifecycle_1 source_id = 7122b6ac-e33d-4164-9d24-df6d90e02209 target = phd_framework::test_vm target_id = 3d6af4cb-62f1-42ac-8b9a-e7f72413ed63
4552026-10-20T15:29:36.438ZINFOphd-runner: [TEST_CLEANUP - END] elapsed_milliseconds = 807 file = phd-tests/runner/src/fixtures.rs line = 51 target = phd_runner::fixtures
4562026-10-20T15:29:36.438ZINFOphd-runner: [TEST - END] elapsed_milliseconds = 18686 file = phd-tests/tests/src/migrate.rs line = 52 path = phd_tests::migrate::from_base::migration_from_base_and_back target = phd_tests::migrate::from_base
4572026-10-20T15:29:36.438ZINFOphd-runner: [EXECUTION_CLEANUP - START] file = phd-tests/runner/src/fixtures.rs line = 35 target = phd_runner::fixtures
4582026-10-20T15:29:36.438ZINFOphd-runner: [EXECUTION_CLEANUP - END] elapsed_milliseconds = 0 file = phd-tests/runner/src/fixtures.rs line = 35 target = phd_runner::fixtures
459 test result: ok. 3 passed; 0 failed; 0 skipped; 0 not run; finished in 92.07s
460 
4612026-10-20T15:29:36.438ZDEBGphd-runner: phd_runner exit_code = 0 file = phd-tests/runner/src/main.rs line = 41 target = phd_runner