|
|
|
| 1 | 2026-09-22T23:03:49.708Z | job dependencies complete; ready to run (waiting for 11 m 39 s) |
| 2 | 2026-09-22T23:37:31.251Z | job assigned to worker 01M35QGJGMBFNQPKPN8GCWPG2H [factory edgar, gimlet/BRM42220010/1576] (queued for 33 m 41 s) |
| 3 | 2026-09-22T23:37:31.807Z | downloading input: /input/phd-build/out/phd-run-with-args.sh |
| 4 | 2026-09-22T23:37:31.832Z | downloaded input: /input/phd-build/out/phd-run-with-args.sh |
| 5 | 2026-09-22T23:37:31.832Z | downloading input: /input/phd-build/out/phd-runner.sha256.txt |
| 6 | 2026-09-22T23:37:31.874Z | downloaded input: /input/phd-build/out/phd-runner.sha256.txt |
| 7 | 2026-09-22T23:37:31.874Z | downloading input: /input/phd-build/out/phd-runner.tar.gz |
| 8 | 2026-09-22T23:37:40.899Z | downloaded input: /input/phd-build/out/phd-runner.tar.gz |
| 9 | 2026-09-22T23:37:40.899Z | downloading input: /input/phd-build/out/propolis-server-debug.sha256.txt |
| 10 | 2026-09-22T23:37:40.954Z | downloaded input: /input/phd-build/out/propolis-server-debug.sha256.txt |
| 11 | 2026-09-22T23:37:40.954Z | downloading input: /input/phd-build/out/propolis-server-debug.tar.gz |
| 12 | 2026-09-22T23:37:53.791Z | downloaded input: /input/phd-build/out/propolis-server-debug.tar.gz |
| 13 | 2026-09-22T23:37:53.791Z | downloading input: /input/phd-build/out/propolis-tests-debug.tar.gz |
| 14 | 2026-09-22T23:38:15.699Z | downloaded input: /input/phd-build/out/propolis-tests-debug.tar.gz |
| |
| 15 | 2026-09-22T23:38:15.699Z | starting task 0: "setup" |
| 16 | 2026-09-22T23:38:15.724Z | ++ uname -s |
| 17 | 2026-09-22T23:38:15.724Z | + kern=SunOS |
| 18 | 2026-09-22T23:38:15.725Z | + build_user=build |
| 19 | 2026-09-22T23:38:15.725Z | + build_uid=12345 |
| 20 | 2026-09-22T23:38:15.725Z | + work_dir=/work |
| 21 | 2026-09-22T23:38:15.725Z | + input_dir=/input |
| 22 | 2026-09-22T23:38:15.725Z | + [[ 0 == 12345 ]] |
| 23 | 2026-09-22T23:38:15.725Z | + case "$kern" in |
| 24 | 2026-09-22T23:38:15.725Z | + groupadd -g 12345 build |
| 25 | 2026-09-22T23:38:15.750Z | + useradd -u 12345 -g build -d /home/build -s /bin/bash -c build -P 'Primary Administrator' build |
| 26 | 2026-09-22T23:38:17.735Z | + zfs create -o mountpoint=/work rpool/work |
| 27 | 2026-09-22T23:38:17.777Z | ++ awk '$2 == "/home" { print $3 }' /etc/mnttab |
| 28 | 2026-09-22T23:38:17.802Z | + home_fs= |
| 29 | 2026-09-22T23:38:17.802Z | + [[ '' == autofs ]] |
| 30 | 2026-09-22T23:38:17.802Z | + mkdir -p /home/build |
| 31 | 2026-09-22T23:38:17.802Z | + chown build:build /home/build /work |
| 32 | 2026-09-22T23:38:19.790Z | + chmod 0700 /home/build /work |
| 33 | 2026-09-22T23:38:19.814Z | process exited: duration 4096 ms, exit code 0 |
| |
| 34 | 2026-09-22T23:38:19.863Z | starting task 1: "authentication" |
| 35 | 2026-09-22T23:38:19.933Z | process exited: duration 70 ms, exit code 0 |
| |
| 36 | 2026-09-22T23:38:19.982Z | starting task 2: "build" |
| 37 | 2026-09-22T23:38:20.006Z | + banner prepare |
| 38 | 2026-09-22T23:38:20.006Z | |
| 39 | 2026-09-22T23:38:20.006Z | ##### ##### ###### ##### ## ##### ###### |
| 40 | 2026-09-22T23:38:20.007Z | # # # # # # # # # # # # |
| 41 | 2026-09-22T23:38:20.007Z | # # # # ##### # # # # # # ##### |
| 42 | 2026-09-22T23:38:20.007Z | ##### ##### # ##### ###### ##### # |
| 43 | 2026-09-22T23:38:20.007Z | # # # # # # # # # # |
| 44 | 2026-09-22T23:38:20.007Z | # # # ###### # # # # # ###### |
| 45 | 2026-09-22T23:38:20.007Z | |
| 46 | 2026-09-22T23:38:20.007Z | + TEST_TAR=propolis-tests-debug.tar.gz |
| 47 | 2026-09-22T23:38:20.007Z | + cp /input/phd-build/out/propolis-tests-debug.tar.gz . |
| 48 | 2026-09-22T23:38:20.190Z | + tar xvf propolis-tests-debug.tar.gz |
| 49 | 2026-09-22T23:38:34.221Z | Decompressing 'propolis-tests-debug.tar.gz' with '/usr/bin/gzcat'... |
| 50 | 2026-09-22T23:38:34.221Z | x target/debug/deps/propolis-16accc46ec7fe886, 918881248 bytes, 1794690 tape blocks |
| 51 | 2026-09-22T23:38:34.246Z | + banner test-propolis |
| 52 | 2026-09-22T23:38:34.246Z | |
| 53 | 2026-09-22T23:38:34.246Z | ##### ###### #### ##### ##### ##### #### ##### #### |
| 54 | 2026-09-22T23:38:34.246Z | # # # # # # # # # # # # # # |
| 55 | 2026-09-22T23:38:34.246Z | # ##### #### # ##### # # # # # # # # # # |
| 56 | 2026-09-22T23:38:34.246Z | # # # # ##### ##### # # ##### # # |
| 57 | 2026-09-22T23:38:34.246Z | # # # # # # # # # # # # # |
| 58 | 2026-09-22T23:38:34.246Z | # ###### #### # # # # #### # #### |
| 59 | 2026-09-22T23:38:34.246Z | |
| 60 | 2026-09-22T23:38:34.246Z | + TEST_DEV=prop_viona_test0 |
| 61 | 2026-09-22T23:38:34.246Z | + pfexec dladm create-etherstub prop_viona_test0 |
| 62 | 2026-09-22T23:38:34.246Z | + for testbin in ./target/debug/deps/propolis-* |
| 63 | 2026-09-22T23:38:34.246Z | + VIONA_TEST_NIC=prop_viona_test0 |
| 64 | 2026-09-22T23:38:34.246Z | + pfexec ptime -m ./target/debug/deps/propolis-16accc46ec7fe886 |
| 65 | 2026-09-22T23:38:34.270Z | |
| 66 | 2026-09-22T23:38:34.270Z | running 195 tests |
| 67 | 2026-09-22T23:38:34.316Z | test block::crucible::test::block_calc_ok ... ok |
| 68 | 2026-09-22T23:38:34.316Z | test accessors::test::adopt_nonroot - should panic ... ok |
| 69 | 2026-09-22T23:38:34.316Z | test accessors::test::adopt_self - should panic ... ok |
| 70 | 2026-09-22T23:38:34.316Z | test accessors::test::only_root_can_remove_resource - should panic ... ok |
| 71 | 2026-09-22T23:38:34.316Z | test accessors::test::simple_orphan ... ok |
| 72 | 2026-09-22T23:38:34.316Z | test block::crucible::test::err_on_bad_size ... ok |
| 73 | 2026-09-22T23:38:34.316Z | test accessors::test::orphan_sibling ... ok |
| 74 | 2026-09-22T23:38:34.316Z | test block::crucible::test::ok_for_valid ... ok |
| 75 | 2026-09-22T23:38:34.316Z | test accessors::test::simple_depth ... ok |
| 76 | 2026-09-22T23:38:34.316Z | test accessors::test::orphan_split ... ok |
| 77 | 2026-09-22T23:38:34.316Z | test accessors::test::tree_root ... ok |
| 78 | 2026-09-22T23:38:34.316Z | test accessors::test::print_names ... ok |
| 79 | 2026-09-22T23:38:34.316Z | test block::crucible::test::err_on_bad_offset ... ok |
| 80 | 2026-09-22T23:38:34.316Z | test chardev::pollers::test_copy_and_consume_one_u8 ... ok |
| 81 | 2026-09-22T23:38:34.316Z | test chardev::pollers::test_copy_and_consume_1 ... ok |
| 82 | 2026-09-22T23:38:34.316Z | test common::test::readop_base_size ... ok |
| 83 | 2026-09-22T23:38:34.316Z | test common::test::readop_oversize - should panic ... ok |
| 84 | 2026-09-22T23:38:34.316Z | test common::device_metadata_test::device_metadata_test ... ok |
| 85 | 2026-09-22T23:38:34.316Z | test common::test::readop_short ... ok |
| 86 | 2026-09-22T23:38:34.316Z | test common::test::writeop_base_size ... ok |
| 87 | 2026-09-22T23:38:34.316Z | test common::test::writeop_short ... ok |
| 88 | 2026-09-22T23:38:34.316Z | test common::test::writeop_oversize - should panic ... ok |
| 89 | 2026-09-22T23:38:34.316Z | test chardev::pollers::test::read_empty_returns_zero_bytes ... ok |
| 90 | 2026-09-22T23:38:34.316Z | test chardev::pollers::test::write_empty_fills_zero_bytes ... ok |
| 91 | 2026-09-22T23:38:34.316Z | test chardev::pollers::test::write_bytes ... ok |
| 92 | 2026-09-22T23:38:34.316Z | test chardev::pollers::test::read_byte ... ok |
| 93 | 2026-09-22T23:38:34.316Z | test chardev::pollers::test::write_bytes_beyond_internal_buffer_size ... ok |
| 94 | 2026-09-22T23:38:34.316Z | test chardev::pollers::test::read_bytes ... ok |
| 95 | 2026-09-22T23:38:34.316Z | test chardev::pollers::test::write_byte ... ok |
| 96 | 2026-09-22T23:38:34.316Z | test enlightenment::hyperv::overlay::test::basic_add ... ok |
| 97 | 2026-09-22T23:38:34.316Z | test enlightenment::hyperv::overlay::test::out_of_bounds_pfn ... ok |
| 98 | 2026-09-22T23:38:34.316Z | test enlightenment::hyperv::overlay::test::basic_move ... ok |
| 99 | 2026-09-22T23:38:34.317Z | test enlightenment::hyperv::overlay::test::multiple_overlays ... ok |
| 100 | 2026-09-22T23:38:34.317Z | test firmware::acpi::dsdt::test::field_references ... ok |
| 101 | 2026-09-22T23:38:34.317Z | test enlightenment::hyperv::overlay::test::duplicate_kind_at_pfn ... ok |
| 102 | 2026-09-22T23:38:34.317Z | test firmware::acpi::dsdt::test::dsdt_generator_aml ... ok |
| 103 | 2026-09-22T23:38:34.317Z | test firmware::acpi::fadt::test::field_references ... ok |
| 104 | 2026-09-22T23:38:34.317Z | test firmware::acpi::rsdp::test::field_references ... ok |
| 105 | 2026-09-22T23:38:34.317Z | test firmware::acpi::dsdt::test::panic_if_generator_not_called - should panic ... ok |
| 106 | 2026-09-22T23:38:34.317Z | test firmware::smbios::bits::test::baseboard_information ... ok |
| 107 | 2026-09-22T23:38:34.317Z | test firmware::acpi::ssdt_edk2::test::field_references ... ok |
| 108 | 2026-09-22T23:38:34.317Z | test firmware::smbios::bits::test::bios_information ... ok |
| 109 | 2026-09-22T23:38:34.317Z | test enlightenment::hyperv::overlay::test::remove_nonexistent_overlay ... ok |
| 110 | 2026-09-22T23:38:34.317Z | test firmware::smbios::bits::test::entry_point ... ok |
| 111 | 2026-09-22T23:38:34.317Z | test firmware::acpi::dsdt::test::dsdt_valid_aml ... ok |
| 112 | 2026-09-22T23:38:34.317Z | test firmware::smbios::bits::test::memory_device ... ok |
| 113 | 2026-09-22T23:38:34.317Z | test chardev::sock::test::abort_wait_for_connect ... ok |
| 114 | 2026-09-22T23:38:34.317Z | test firmware::smbios::bits::test::physical_memory_array ... ok |
| 115 | 2026-09-22T23:38:34.317Z | test enlightenment::hyperv::overlay::test::underlay_restored_after_drop ... ok |
| 116 | 2026-09-22T23:38:34.317Z | test firmware::smbios::bits::test::processor_information ... ok |
| 117 | 2026-09-22T23:38:34.317Z | test firmware::smbios::bits::test::struct_header ... ok |
| 118 | 2026-09-22T23:38:34.317Z | test firmware::smbios::bits::test::system_boot_information ... ok |
| 119 | 2026-09-22T23:38:34.317Z | test firmware::smbios::bits::test::system_information ... ok |
| 120 | 2026-09-22T23:38:34.317Z | test firmware::smbios::bits::test::system_enclosure ... ok |
| 121 | 2026-09-22T23:38:34.317Z | test chardev::sock::test::bail_on_shutdown_sock ... ok |
| 122 | 2026-09-22T23:38:34.317Z | test firmware::smbios::table::type4::test::proc_type_serde_roundtrip ... ok |
| 123 | 2026-09-22T23:38:34.317Z | test firmware::smbios::table::type16::test::array_use_serde_roundtrip ... ok |
| 124 | 2026-09-22T23:38:34.317Z | test firmware::smbios::table::type4::test::proc_status_serde_roundtrip ... ok |
| 125 | 2026-09-22T23:38:34.342Z | test firmware::smbios::table::type16::test::error_correction_serde_roundtrip ... ok |
| 126 | 2026-09-22T23:38:34.342Z | test firmware::smbios::table::type4::test::proc_type_deserialize ... ok |
| 127 | 2026-09-22T23:38:34.342Z | test firmware::smbios::table::type16::test::error_correction_deserialize ... ok |
| 128 | 2026-09-22T23:38:34.342Z | test firmware::smbios::table::type16::test::array_use_deserialize ... ok |
| 129 | 2026-09-22T23:38:34.342Z | test firmware::smbios::table::type4::test::proc_status_deserialize ... ok |
| 130 | 2026-09-22T23:38:34.342Z | test firmware::smbios::table::type16::test::location_deserialize ... ok |
| 131 | 2026-09-22T23:38:34.342Z | test firmware::smbios::table::type1::test::wake_up_type_serde_roundtrip ... ok |
| 132 | 2026-09-22T23:38:34.342Z | test hw::nvme::bits::test::entry_sizing ... ok |
| 133 | 2026-09-22T23:38:34.342Z | test firmware::smbios::table::type1::test::wake_up_type_deserialize ... ok |
| 134 | 2026-09-22T23:38:34.342Z | test hw::nvme::cmds::test::test_dsmgmt_ranges ... ok |
| 135 | 2026-09-22T23:38:34.342Z | test firmware::smbios::table::type16::test::location_serde_roundtrip ... ok |
| 136 | 2026-09-22T23:38:34.342Z | test hw::chipset::i440fx::test::lpc_pci_cfg_write ... ok |
| 137 | 2026-09-22T23:38:34.342Z | test hw::chipset::i440fx::test::hb_pci_cfg_read ... ok |
| 138 | 2026-09-22T23:38:34.342Z | test hw::chipset::i440fx::test::lpc_pci_cfg_read ... ok |
| 139 | 2026-09-22T23:38:34.342Z | test hw::chipset::i440fx::test::hb_pci_cfg_write ... ok |
| 140 | 2026-09-22T23:38:34.343Z | test hw::nvme::cmds::test::test_dsmgmt_ranges_bad_dual ... ok |
| 141 | 2026-09-22T23:38:34.343Z | test hw::nvme::cmds::test::test_dsmgmt_ranges_bad_address ... ok |
| 142 | 2026-09-22T23:38:34.343Z | test hw::chipset::i440fx::test::pm_pci_cfg_read ... ok |
| 143 | 2026-09-22T23:38:34.343Z | test hw::chipset::i440fx::test::pm_pci_cfg_write ... ok |
| 144 | 2026-09-22T23:38:34.343Z | test hw::pci::bar::test::limits ... ok |
| 145 | 2026-09-22T23:38:34.343Z | test hw::pci::bar::test::init ... ok |
| 146 | 2026-09-22T23:38:34.343Z | test hw::nvme::cmds::test::test_dsmgmt_ranges_dual ... ok |
| 147 | 2026-09-22T23:38:34.343Z | test hw::nvme::cmds::test::test_prp_single ... ok |
| 148 | 2026-09-22T23:38:34.343Z | test hw::nvme::cmds::test::test_prp_multiple ... ok |
| 149 | 2026-09-22T23:38:34.343Z | test hw::pci::bus::test::empty ... ok |
| 150 | 2026-09-22T23:38:34.343Z | test hw::nvme::cmds::test::test_prp_dual ... ok |
| 151 | 2026-09-22T23:38:34.343Z | test hw::pci::bus::test::set_multifunc ... ok |
| 152 | 2026-09-22T23:38:34.343Z | test hw::pci::bar::test::write_place ... ok |
| 153 | 2026-09-22T23:38:34.343Z | test hw::pci::bar::test::read_type ... ok |
| 154 | 2026-09-22T23:38:34.343Z | test hw::pci::test::pcie_decoder_access_spans_multiple_devs ... ok |
| 155 | 2026-09-22T23:38:34.343Z | test hw::pci::test::pcie_decoder_min_buses ... ok |
| 156 | 2026-09-22T23:38:34.343Z | test chardev::pollers::test::read_bytes_blocking ... ok |
| 157 | 2026-09-22T23:38:34.343Z | test hw::pci::device::test::msix_cfg_too_big - should panic ... ok |
| 158 | 2026-09-22T23:38:34.343Z | test hw::pci::device::test::msix_cfg_zero - should panic ... ok |
| 159 | 2026-09-22T23:38:34.343Z | test hw::pci::test::pcie_decoder_multiple_bdfs ... ok |
| 160 | 2026-09-22T23:38:34.343Z | test hw::pci::test::pcie_decoder ... ok |
| 161 | 2026-09-22T23:38:34.343Z | test hw::pci::bridge::test::bridge_properties ... ok |
| 162 | 2026-09-22T23:38:34.343Z | test hw::pci::topology::test::builder_bus_zero_reserved ... ok |
| 163 | 2026-09-22T23:38:34.343Z | test hw::pci::topology::test::builder_conflicts ... ok |
| 164 | 2026-09-22T23:38:34.343Z | test hw::nvme::cmds::test::test_prp_list ... ok |
| 165 | 2026-09-22T23:38:34.343Z | test hw::nvme::cmds::test::test_prp_list_offset_last ... ok |
| 166 | 2026-09-22T23:38:34.343Z | test hw::pci::bridge::test::bridge_routing ... ok |
| 167 | 2026-09-22T23:38:34.343Z | test hw::pci::topology::test::cfg_read ... ok |
| 168 | 2026-09-22T23:38:34.343Z | test hw::pci::topology::test::build_without_bridges ... ok |
| 169 | 2026-09-22T23:38:34.343Z | test hw::qemu::fwcfg::test::pio_read_basic ... ok |
| 170 | 2026-09-22T23:38:34.343Z | test hw::qemu::fwcfg::formats::test_bootorder::basic ... ok |
| 171 | 2026-09-22T23:38:34.343Z | test hw::qemu::fwcfg::formats::test_pci_window::basic ... ok |
| 172 | 2026-09-22T23:38:34.343Z | test hw::qemu::fwcfg::formats::test_table_loader::basic ... ok |
| 173 | 2026-09-22T23:38:34.343Z | test hw::pci::topology::test::build_with_bridges ... ok |
| 174 | 2026-09-22T23:38:34.343Z | test hw::qemu::fwcfg::test::read_version ... ok |
| 175 | 2026-09-22T23:38:34.343Z | test hw::qemu::fwcfg::formats::test_e820::basic ... ok |
| 176 | 2026-09-22T23:38:34.343Z | test hw::pci::topology::test::created_bridges ... ok |
| 177 | 2026-09-22T23:38:34.343Z | test hw::qemu::fwcfg::formats::test_e820::entry_size_is_correct ... ok |
| 178 | 2026-09-22T23:38:34.343Z | test hw::uart::uart16550::test::safe_read_write_all ... ok |
| 179 | 2026-09-22T23:38:34.344Z | test hw::uart::uart16550::test::interrupt_codes ... ok |
| 180 | 2026-09-22T23:38:34.344Z | test hw::qemu::fwcfg::test::dma_read_basic ... ok |
| 181 | 2026-09-22T23:38:34.344Z | test hw::qemu::ramfb::test::config_reg_size ... ok |
| 182 | 2026-09-22T23:38:34.344Z | test hw::qemu::fwcfg::test::pio_read_missing ... ok |
| 183 | 2026-09-22T23:38:34.344Z | test hw::uart::uart16550::test::intr_dr_on_incoming ... ok |
| 184 | 2026-09-22T23:38:34.344Z | test hw::uart::uart16550::test::intr_thre_on_etbei_toggle ... ok |
| 185 | 2026-09-22T23:38:34.344Z | test hw::uart::uart16550::test::reset_state ... ok |
| 186 | 2026-09-22T23:38:34.344Z | test hw::qemu::fwcfg::test::struct_sizing ... ok |
| 187 | 2026-09-22T23:38:34.344Z | test hw::uart::uart16550::test::intr_thre_on_outgoing ... ok |
| 188 | 2026-09-22T23:38:34.344Z | test hw::virtio::testutil::test::empty_avail_ring_returns_none ... ok |
| 189 | 2026-09-22T23:38:34.344Z | test hw::qemu::fwcfg::test::state_cleared_on_reset ... ok |
| 190 | 2026-09-22T23:38:34.344Z | test test::print_version ... ok |
| 191 | 2026-09-22T23:38:34.344Z | test util::aspace::test::inverse_iterator_alloc_ends ... ok |
| 192 | 2026-09-22T23:38:34.344Z | test hw::virtio::testutil::test::smoke_chained_descriptors ... ok |
| 193 | 2026-09-22T23:38:34.344Z | test hw::virtio::testutil::test::multi_queue_smoke ... ok |
| 194 | 2026-09-22T23:38:34.344Z | test hw::virtio::viona::test::test_common_cfg_size_is_right ... ok |
| 195 | 2026-09-22T23:38:34.344Z | test util::aspace::test::create_normal ... ok |
| 196 | 2026-09-22T23:38:34.344Z | test hw::virtio::testutil::test::smoke_mixed_chain ... ok |
| 197 | 2026-09-22T23:38:34.344Z | test util::aspace::test::inverse_iterator_alloc_middle ... ok |
| 198 | 2026-09-22T23:38:34.344Z | test util::aspace::test::create_one_elem ... ok |
| 199 | 2026-09-22T23:38:34.344Z | test util::aspace::test::inverse_iterator_full ... ok |
| 200 | 2026-09-22T23:38:34.344Z | test hw::virtio::testutil::test::smoke_pop_avail_readable ... ok |
| 201 | 2026-09-22T23:38:34.344Z | test util::aspace::test::inverse_iterator_empty ... ok |
| 202 | 2026-09-22T23:38:34.344Z | test util::aspace::test::region_at_normal ... ok |
| 203 | 2026-09-22T23:38:34.344Z | test hw::qemu::fwcfg::test::dma_read_missing ... ok |
| 204 | 2026-09-22T23:38:34.344Z | test util::aspace::test::region_at_outside ... ok |
| 205 | 2026-09-22T23:38:34.344Z | test util::aspace::test::inverse_iterator_sequential_registrations ... ok |
| 206 | 2026-09-22T23:38:34.344Z | test util::aspace::test::register_invalid ... ok |
| 207 | 2026-09-22T23:38:34.344Z | test util::aspace::test::register_outside ... ok |
| 208 | 2026-09-22T23:38:34.344Z | test util::aspace::test::create_max ... ok |
| 209 | 2026-09-22T23:38:34.344Z | test util::aspace::test::bounds_accessors ... ok |
| 210 | 2026-09-22T23:38:34.344Z | test util::aspace::test::register_overlaps ... ok |
| 211 | 2026-09-22T23:38:34.344Z | test util::aspace::test::register_plain ... ok |
| 212 | 2026-09-22T23:38:34.344Z | test vmm::mem::test::mapping_create_empty ... ok |
| 213 | 2026-09-22T23:38:34.344Z | test util::regmap::test::misaligned ... ok |
| 214 | 2026-09-22T23:38:34.344Z | test util::regmap::test::simple ... ok |
| 215 | 2026-09-22T23:38:34.344Z | test vmm::mem::test::memory_protections_match_libc ... ok |
| 216 | 2026-09-22T23:38:34.344Z | test vmm::time::test::test_calc_boot_hrtime ... ok |
| 217 | 2026-09-22T23:38:34.344Z | test vmm::mem::test::mapping_shortens_write_bytes_beyond_end ... ok |
| 218 | 2026-09-22T23:38:34.344Z | test vmm::time::test::test_calc_boot_hrtime_delta ... ok |
| 219 | 2026-09-22T23:38:34.345Z | test hw::virtio::testutil::test::queue_writer_reset_cursors ... ok |
| 220 | 2026-09-22T23:38:34.345Z | test vmm::time::test::test_calc_guest_tsc ... ok |
| 221 | 2026-09-22T23:38:34.345Z | test vmm::time::test::test_calc_guest_uptime ... ok |
| 222 | 2026-09-22T23:38:34.345Z | test vmm::mem::test::mapping_invalid_subregions ... ok |
| 223 | 2026-09-22T23:38:34.345Z | test hw::virtio::testutil::test::multiple_chains ... ok |
| 224 | 2026-09-22T23:38:34.345Z | test vmm::mem::test::mapping_valid_subregions ... ok |
| 225 | 2026-09-22T23:38:34.370Z | test vmm::time::test::test_calc_migrate_delta ... ok |
| 226 | 2026-09-22T23:38:34.370Z | test vmm::time::test::test_calc_tsc_delta ... ok |
| 227 | 2026-09-22T23:38:34.370Z | test vsock::buffer::test::test_push_less_than_capacity ... ok |
| 228 | 2026-09-22T23:38:34.370Z | test vmm::mem::test::subregion_protection ... ok |
| 229 | 2026-09-22T23:38:34.370Z | test vmm::time::test::test_invalid_hrtime ... ok |
| 230 | 2026-09-22T23:38:34.370Z | test vsock::buffer::test::test_capacity_and_len ... ok |
| 231 | 2026-09-22T23:38:34.370Z | test hw::virtio::testutil::test::smoke_pop_avail_writable ... ok |
| 232 | 2026-09-22T23:38:34.370Z | test vsock::buffer::test::test_partial_write_to ... ok |
| 233 | 2026-09-22T23:38:34.370Z | test vmm::mem::test::mapping_shortens_read_bytes_beyond_end ... ok |
| 234 | 2026-09-22T23:38:34.370Z | test vsock::buffer::test::test_push_more_than_capacity ... ok |
| 235 | 2026-09-22T23:38:34.370Z | test vsock::buffer::test::test_write_to ... ok |
| 236 | 2026-09-22T23:38:34.370Z | test vsock::buffer::test::test_wrap_around ... ok |
| 237 | 2026-09-22T23:38:34.370Z | test vmm::mem::test::mapping_denies_read_beyond_end ... ok |
| 238 | 2026-09-22T23:38:34.370Z | test util::aspace::safe_end_bounds ... ok |
| 239 | 2026-09-22T23:38:34.370Z | test vmm::mem::test::region_lookup ... ok |
| 240 | 2026-09-22T23:38:34.370Z | Sep 22 23:38:34.286 INFO vsock poller configured with, mappings: {}, component: vsock-test |
| 241 | 2026-09-22T23:38:34.370Z | Sep 22 23:38:34.286 INFO vsock poller configured with, mappings: {7000: VsockPortMapping { port: 7000, addr: 127.0.0.1:59528 }}, component: vsock-test |
| 242 | 2026-09-22T23:38:34.370Z | Sep 22 23:38:34.287 INFO vsock poller configured with, Sep 22 23:38:34.288mappings :INFOSep 22 23:38:34.288 {9300: VsockPortMapping { port: 9300, addr: 127.0.0.1:56336 }}vsock poller configured with, component, :mappings :vsock-test |
| 243 | 2026-09-22T23:38:34.370Z | {6000: VsockPortMapping { port: 6000, addr: 127.0.0.1:41089 }}, component: vsock-test |
| 244 | 2026-09-22T23:38:34.370Z | INFO vsock poller configured with, mappings: {8000: VsockPortMapping { port: 8000, addr: 127.0.0.1:40293 }}, component: vsock-test |
| 245 | 2026-09-22T23:38:34.370Z | Sep 22 23:38:34.289 INFO vsock poller configured with, mappings: {5000: VsockPortMapping { port: 5000, addr: 127.0.0.1:52193 }}, componentSep 22 23:38:34.289: INFOvsock-test |
| 246 | 2026-09-22T23:38:34.370Z | vsock poller configured with, mappings: {9000: VsockPortMapping { port: 9000, addr: 127.0.0.1:54303 }}, component: vsock-test |
| 247 | 2026-09-22T23:38:34.370Z | Sep 22 23:38:34.289 INFO vsock poller configured with, mappings: {9500: VsockPortMapping { port: 9500, addr: 127.0.0.1:41003 }}, component: vsock-test |
| 248 | 2026-09-22T23:38:34.370Z | Sep 22 23:38:34.289Sep 22 23:38:34.289 INFOINFO vsock poller configured withvsock poller configured with, , mappingsmappings:: {9400: VsockPortMapping { port: 9400, addr: 127.0.0.1:45370 }}{3000: VsockPortMapping { port: 3000, addr: 127.0.0.1:35458 }}, , componentcomponent:: vsock-testvsock-test |
| 249 | 2026-09-22T23:38:34.370Z | |
| 250 | 2026-09-22T23:38:34.370Z | Sep 22 23:38:34.286 INFO vsock poller configured with, mappings: {4000: VsockPortMapping { port: 4000, addr: 127.0.0.1:43502 }}, component: vsock-test |
| 251 | 2026-09-22T23:38:34.370Z | Sep 22 23:38:34.290 INFO vsock poller configured with, mappings: {3000: VsockPortMapping { port: 3000, addr: 127.0.0.1:43222 }}, component: vsock-test |
| 252 | 2026-09-22T23:38:34.370Z | test vsock::poller::test::halt_from_paused ... ok |
| 253 | 2026-09-22T23:38:34.370Z | test vsock::poller::test::end_to_end_guest_to_host ... ok |
| 254 | 2026-09-22T23:38:34.370Z | Sep 22 23:38:34.291 INFO vsock poller configured with, mappings: {}, component: vsock-test |
| 255 | 2026-09-22T23:38:34.371Z | Sep 22 23:38:34.292 WARN received invalid vsock packet type, packet: VsockPacket { header: VsockPacketHeader { src_cid: U64(50), dst_cid: U64(2), src_port: U32(5555), dst_port: U32(8080), len: U32(0), socket_type: U16(478), op: U16(5), flags: U32(0), buf_alloc: U32(65536), fwd_cnt: U32(0) }, data_len: 0 }, component: vsock-test |
| 256 | 2026-09-22T23:38:34.371Z | test vsock::poller::test::reset_clears_connections ... ok |
| 257 | 2026-09-22T23:38:34.371Z | test vsock::poller::test::rst_removes_established_connection ... ok |
| 258 | 2026-09-22T23:38:34.371Z | test vsock::poller::test::request_then_rw_delivers_data ... ok |
| 259 | 2026-09-22T23:38:34.371Z | test vsock::poller::test::request_receives_response ... ok |
| 260 | 2026-09-22T23:38:34.371Z | test vsock::poller::test::end_to_end_guest_to_host_closes_half_open ... ok |
| 261 | 2026-09-22T23:38:34.371Z | test vsock::poller::test::rw_with_invalid_socket_type_receives_rst ... ok |
| 262 | 2026-09-22T23:38:34.371Z | test vsock::poller::test::pause_resume_preserves_connections ... ok |
| 263 | 2026-09-22T23:38:34.371Z | test vsock::poller::test::credit_update_sent_after_flushing_half_buffer ... ok |
| 264 | 2026-09-22T23:38:34.371Z | test hw::nvme::queue::test::create_sqs ... ok |
| 265 | 2026-09-22T23:38:34.371Z | test hw::nvme::queue::test::push_failures ... ok |
| 266 | 2026-09-22T23:38:34.371Z | test hw::nvme::queue::test::cq_kicks ... ok |
| 267 | 2026-09-22T23:38:34.371Z | test hw::nvme::queue::test::create_cqs ... ok |
| 268 | 2026-09-22T23:38:34.371Z | test hw::pci::device::test::msix_cfg_sizing ... ok |
| 269 | 2026-09-22T23:38:34.429Z | test vsock::poller::test::rx_blocked_resumes_when_descriptors_available ... ok |
| 270 | 2026-09-22T23:38:35.010Z | test hw::virtio::viona::test::run_viona_tests ... ok |
| 271 | 2026-09-22T23:38:35.187Z | test hw::nvme::queue::test::push_pop ... ok |
| 272 | 2026-09-22T23:38:35.282Z | test vsock::poller::test::end_to_end_large_data ... ok |
| 273 | 2026-09-22T23:38:36.470Z | test hw::nvme::test::fuzzy ... FAILED |
| 274 | 2026-09-22T23:38:38.304Z | test vsock::poller::test::host_socket_eof_sends_shutdown ... ok |
| 275 | 2026-09-22T23:38:38.351Z | test hw::pci::propolis_types_pcipath_is_always_valid_bdf ... ok |
| 276 | 2026-09-22T23:38:38.351Z | |
| 277 | 2026-09-22T23:38:38.351Z | failures: |
| 278 | 2026-09-22T23:38:38.351Z | |
| 279 | 2026-09-22T23:38:38.351Z | ---- hw::nvme::test::fuzzy stdout ---- |
| 280 | 2026-09-22T23:38:38.351Z | fuzzing nvme from seed 0xb4f66d9acb932c52 |
| 281 | 2026-09-22T23:38:38.351Z | operation: TestAction { op: Init, result: Ok } |
| 282 | 2026-09-22T23:38:38.351Z | doing init! |
| 283 | 2026-09-22T23:38:38.351Z | controller enabled |
| 284 | 2026-09-22T23:38:38.351Z | [1, 0, 0, 0] |
| 285 | 2026-09-22T23:38:38.351Z | operation: TestAction { op: DeleteSQ(10), result: Err } |
| 286 | 2026-09-22T23:38:38.351Z | sq (10) lives another day |
| 287 | 2026-09-22T23:38:38.351Z | operation: TestAction { op: DeleteCQ(11), result: Err } |
| 288 | 2026-09-22T23:38:38.351Z | operation: TestAction { op: Migrate, result: Ok } |
| 289 | 2026-09-22T23:38:38.351Z | operation: TestAction { op: CreateCQ(8), result: Ok } |
| 290 | 2026-09-22T23:38:38.351Z | operation: TestAction { op: CreateSQ(9), result: Err } |
| 291 | 2026-09-22T23:38:38.351Z | creating sq 9 |
| 292 | 2026-09-22T23:38:38.351Z | operation: TestAction { op: DeleteSQ(7), result: Err } |
| 293 | 2026-09-22T23:38:38.351Z | sq (7) lives another day |
| 294 | 2026-09-22T23:38:38.351Z | operation: TestAction { op: DeleteSQ(9), result: Err } |
| 295 | 2026-09-22T23:38:38.351Z | sq (9) lives another day |
| 296 | 2026-09-22T23:38:38.351Z | operation: TestAction { op: Migrate, result: Ok } |
| 297 | 2026-09-22T23:38:38.351Z | operation: TestAction { op: DeleteCQ(3), result: Err } |
| 298 | 2026-09-22T23:38:38.351Z | operation: TestAction { op: CreateSQ(1), result: Err } |
| 299 | 2026-09-22T23:38:38.351Z | creating sq 1 |
| 300 | 2026-09-22T23:38:38.352Z | operation: TestAction { op: CreateCQ(6), result: Ok } |
| 301 | 2026-09-22T23:38:38.352Z | operation: TestAction { op: DeleteCQ(13), result: Err } |
| 302 | 2026-09-22T23:38:38.352Z | operation: TestAction { op: CreateCQ(8), result: Err } |
| 303 | 2026-09-22T23:38:38.352Z | operation: TestAction { op: Migrate, result: Ok } |
| 304 | 2026-09-22T23:38:38.352Z | operation: TestAction { op: DeleteSQ(15), result: Err } |
| 305 | 2026-09-22T23:38:38.352Z | sq (15) lives another day |
| 306 | 2026-09-22T23:38:38.352Z | operation: TestAction { op: Migrate, result: Ok } |
| 307 | 2026-09-22T23:38:38.352Z | operation: TestAction { op: DeleteCQ(6), result: Ok } |
| 308 | 2026-09-22T23:38:38.352Z | operation: TestAction { op: CreateCQ(2), result: Ok } |
| 309 | 2026-09-22T23:38:38.352Z | operation: TestAction { op: CreateSQ(6), result: Err } |
| 310 | 2026-09-22T23:38:38.352Z | creating sq 6 |
| 311 | 2026-09-22T23:38:38.352Z | operation: TestAction { op: DeleteSQ(11), result: Err } |
| 312 | 2026-09-22T23:38:38.352Z | sq (11) lives another day |
| 313 | 2026-09-22T23:38:38.352Z | operation: TestAction { op: CreateSQ(11), result: Err } |
| 314 | 2026-09-22T23:38:38.352Z | creating sq 11 |
| 315 | 2026-09-22T23:38:38.352Z | operation: TestAction { op: CreateSQ(15), result: Err } |
| 316 | 2026-09-22T23:38:38.352Z | creating sq 15 |
| 317 | 2026-09-22T23:38:38.352Z | operation: TestAction { op: DeleteSQ(13), result: Err } |
| 318 | 2026-09-22T23:38:38.352Z | sq (13) lives another day |
| 319 | 2026-09-22T23:38:38.352Z | operation: TestAction { op: DeleteCQ(14), result: Err } |
| 320 | 2026-09-22T23:38:38.352Z | operation: TestAction { op: Migrate, result: Ok } |
| 321 | 2026-09-22T23:38:38.352Z | operation: TestAction { op: DeleteSQ(14), result: Err } |
| 322 | 2026-09-22T23:38:38.352Z | sq (14) lives another day |
| 323 | 2026-09-22T23:38:38.352Z | operation: TestAction { op: CreateSQ(1), result: Err } |
| 324 | 2026-09-22T23:38:38.352Z | creating sq 1 |
| 325 | 2026-09-22T23:38:38.352Z | operation: TestAction { op: DeleteSQ(13), result: Err } |
| 326 | 2026-09-22T23:38:38.352Z | sq (13) lives another day |
| 327 | 2026-09-22T23:38:38.352Z | operation: TestAction { op: DeleteSQ(3), result: Err } |
| 328 | 2026-09-22T23:38:38.352Z | sq (3) lives another day |
| 329 | 2026-09-22T23:38:38.352Z | operation: TestAction { op: CreateSQ(3), result: Err } |
| 330 | 2026-09-22T23:38:38.352Z | creating sq 3 |
| 331 | 2026-09-22T23:38:38.352Z | operation: TestAction { op: DeleteCQ(8), result: Ok } |
| 332 | 2026-09-22T23:38:38.352Z | operation: TestAction { op: DeleteCQ(7), result: Err } |
| 333 | 2026-09-22T23:38:38.352Z | operation: TestAction { op: CreateCQ(3), result: Ok } |
| 334 | 2026-09-22T23:38:38.352Z | operation: TestAction { op: CreateSQ(3), result: Ok } |
| 335 | 2026-09-22T23:38:38.352Z | creating sq 3 |
| 336 | 2026-09-22T23:38:38.352Z | operation: TestAction { op: Migrate, result: Ok } |
| 337 | 2026-09-22T23:38:38.352Z | operation: TestAction { op: DeleteSQ(1), result: Err } |
| 338 | 2026-09-22T23:38:38.352Z | sq (1) lives another day |
| 339 | 2026-09-22T23:38:38.353Z | operation: TestAction { op: DeleteCQ(14), result: Err } |
| 340 | 2026-09-22T23:38:38.353Z | operation: TestAction { op: CreateCQ(6), result: Ok } |
| 341 | 2026-09-22T23:38:38.353Z | operation: TestAction { op: Migrate, result: Ok } |
| 342 | 2026-09-22T23:38:38.353Z | operation: TestAction { op: CreateCQ(9), result: Ok } |
| 343 | 2026-09-22T23:38:38.353Z | operation: TestAction { op: CreateCQ(4), result: Ok } |
| 344 | 2026-09-22T23:38:38.353Z | operation: TestAction { op: DeleteSQ(11), result: Err } |
| 345 | 2026-09-22T23:38:38.353Z | sq (11) lives another day |
| 346 | 2026-09-22T23:38:38.353Z | operation: TestAction { op: DeleteCQ(4), result: Ok } |
| 347 | 2026-09-22T23:38:38.353Z | operation: TestAction { op: CreateCQ(15), result: Ok } |
| 348 | 2026-09-22T23:38:38.353Z | operation: TestAction { op: CreateSQ(16), result: Err } |
| 349 | 2026-09-22T23:38:38.353Z | creating sq 16 |
| 350 | 2026-09-22T23:38:38.353Z | operation: TestAction { op: DeleteCQ(2), result: Ok } |
| 351 | 2026-09-22T23:38:38.353Z | operation: TestAction { op: CreateCQ(8), result: Ok } |
| 352 | 2026-09-22T23:38:38.353Z | operation: TestAction { op: Migrate, result: Ok } |
| 353 | 2026-09-22T23:38:38.353Z | operation: TestAction { op: CreateSQ(12), result: Err } |
| 354 | 2026-09-22T23:38:38.353Z | creating sq 12 |
| 355 | 2026-09-22T23:38:38.353Z | operation: TestAction { op: CreateSQ(4), result: Err } |
| 356 | 2026-09-22T23:38:38.353Z | creating sq 4 |
| 357 | 2026-09-22T23:38:38.353Z | operation: TestAction { op: CreateSQ(4), result: Err } |
| 358 | 2026-09-22T23:38:38.353Z | creating sq 4 |
| 359 | 2026-09-22T23:38:38.353Z | operation: TestAction { op: DeleteSQ(10), result: Err } |
| 360 | 2026-09-22T23:38:38.353Z | sq (10) lives another day |
| 361 | 2026-09-22T23:38:38.353Z | operation: TestAction { op: Migrate, result: Ok } |
| 362 | 2026-09-22T23:38:38.353Z | operation: TestAction { op: CreateSQ(5), result: Err } |
| 363 | 2026-09-22T23:38:38.353Z | creating sq 5 |
| 364 | 2026-09-22T23:38:38.353Z | operation: TestAction { op: DeleteSQ(2), result: Err } |
| 365 | 2026-09-22T23:38:38.353Z | sq (2) lives another day |
| 366 | 2026-09-22T23:38:38.353Z | operation: TestAction { op: Migrate, result: Ok } |
| 367 | 2026-09-22T23:38:38.353Z | operation: TestAction { op: DeleteSQ(1), result: Err } |
| 368 | 2026-09-22T23:38:38.353Z | sq (1) lives another day |
| 369 | 2026-09-22T23:38:38.353Z | operation: TestAction { op: Migrate, result: Ok } |
| 370 | 2026-09-22T23:38:38.353Z | operation: TestAction { op: CreateCQ(16), result: Ok } |
| 371 | 2026-09-22T23:38:38.353Z | operation: TestAction { op: CreateSQ(10), result: Err } |
| 372 | 2026-09-22T23:38:38.353Z | creating sq 10 |
| 373 | 2026-09-22T23:38:38.353Z | operation: TestAction { op: Migrate, result: Ok } |
| 374 | 2026-09-22T23:38:38.353Z | operation: TestAction { op: CreateSQ(15), result: Ok } |
| 375 | 2026-09-22T23:38:38.379Z | creating sq 15 |
| 376 | 2026-09-22T23:38:38.379Z | operation: TestAction { op: Migrate, result: Ok } |
| 377 | 2026-09-22T23:38:38.379Z | operation: TestAction { op: SubmitRead { queue: 3, lba: 9659, memptr: 1437696, size: 4096, fresh_cid: true }, result: Ok } |
| 378 | 2026-09-22T23:38:38.379Z | operation: TestAction { op: Migrate, result: Ok } |
| 379 | 2026-09-22T23:38:38.379Z | operation: TestAction { op: SubmitWrite { queue: 15, lba: 127, memptr: 1552384, size: 4096, fresh_cid: true }, result: Ok } |
| 380 | 2026-09-22T23:38:38.379Z | operation: TestAction { op: Migrate, result: Ok } |
| 381 | 2026-09-22T23:38:38.379Z | operation: TestAction { op: CreateCQ(4), result: Ok } |
| 382 | 2026-09-22T23:38:38.379Z | operation: TestAction { op: CreateSQ(13), result: Err } |
| 383 | 2026-09-22T23:38:38.379Z | creating sq 13 |
| 384 | 2026-09-22T23:38:38.379Z | operation: TestAction { op: CreateSQ(8), result: Ok } |
| 385 | 2026-09-22T23:38:38.379Z | creating sq 8 |
| 386 | 2026-09-22T23:38:38.379Z | operation: TestAction { op: CreateCQ(11), result: Ok } |
| 387 | 2026-09-22T23:38:38.379Z | operation: TestAction { op: DeleteSQ(16), result: Err } |
| 388 | 2026-09-22T23:38:38.379Z | sq (16) lives another day |
| 389 | 2026-09-22T23:38:38.379Z | operation: TestAction { op: WaitIO { queue: 3, cid: 65534 }, result: Ok } |
| 390 | 2026-09-22T23:38:38.379Z | reading cqe from cq slot 0, addr 1c7000 |
| 391 | 2026-09-22T23:38:38.379Z | got cqe: CompletionQueueEntry { dw0: 0, rsvd: 0, sqhd: 1, sqid: 3, cid: 65534, status_phase: 1 } |
| 392 | 2026-09-22T23:38:38.379Z | DONE with I/O 65534 on queue 3 |
| 393 | 2026-09-22T23:38:38.379Z | operation: TestAction { op: DeleteCQ(14), result: Err } |
| 394 | 2026-09-22T23:38:38.379Z | operation: TestAction { op: DeleteSQ(4), result: Err } |
| 395 | 2026-09-22T23:38:38.379Z | sq (4) lives another day |
| 396 | 2026-09-22T23:38:38.379Z | operation: TestAction { op: CreateCQ(9), result: Err } |
| 397 | 2026-09-22T23:38:38.379Z | operation: TestAction { op: DeleteSQ(5), result: Err } |
| 398 | 2026-09-22T23:38:38.379Z | sq (5) lives another day |
| 399 | 2026-09-22T23:38:38.379Z | operation: TestAction { op: CreateSQ(2), result: Err } |
| 400 | 2026-09-22T23:38:38.379Z | creating sq 2 |
| 401 | 2026-09-22T23:38:38.379Z | operation: TestAction { op: DeleteCQ(2), result: Err } |
| 402 | 2026-09-22T23:38:38.379Z | operation: TestAction { op: DeleteCQ(7), result: Err } |
| 403 | 2026-09-22T23:38:38.379Z | operation: TestAction { op: CreateCQ(6), result: Err } |
| 404 | 2026-09-22T23:38:38.379Z | operation: TestAction { op: DeleteCQ(2), result: Err } |
| 405 | 2026-09-22T23:38:38.379Z | operation: TestAction { op: DeleteSQ(13), result: Err } |
| 406 | 2026-09-22T23:38:38.379Z | sq (13) lives another day |
| 407 | 2026-09-22T23:38:38.379Z | operation: TestAction { op: CreateSQ(4), result: Ok } |
| 408 | 2026-09-22T23:38:38.379Z | creating sq 4 |
| 409 | 2026-09-22T23:38:38.379Z | operation: TestAction { op: CreateCQ(2), result: Ok } |
| 410 | 2026-09-22T23:38:38.379Z | operation: TestAction { op: DeleteCQ(5), result: Err } |
| 411 | 2026-09-22T23:38:38.379Z | operation: TestAction { op: DeleteCQ(13), result: Err } |
| 412 | 2026-09-22T23:38:38.380Z | operation: TestAction { op: CreateCQ(10), result: Ok } |
| 413 | 2026-09-22T23:38:38.380Z | operation: TestAction { op: CreateCQ(11), result: Err } |
| 414 | 2026-09-22T23:38:38.380Z | operation: TestAction { op: DeleteCQ(12), result: Err } |
| 415 | 2026-09-22T23:38:38.380Z | operation: TestAction { op: SubmitRead { queue: 8, lba: 11534, memptr: 1224704, size: 4096, fresh_cid: true }, result: Ok } |
| 416 | 2026-09-22T23:38:38.380Z | operation: TestAction { op: DeleteCQ(7), result: Err } |
| 417 | 2026-09-22T23:38:38.380Z | operation: TestAction { op: CreateCQ(9), result: Err } |
| 418 | 2026-09-22T23:38:38.380Z | operation: TestAction { op: CreateCQ(10), result: Err } |
| 419 | 2026-09-22T23:38:38.380Z | operation: TestAction { op: Migrate, result: Ok } |
| 420 | 2026-09-22T23:38:38.380Z | operation: TestAction { op: CreateSQ(10), result: Ok } |
| 421 | 2026-09-22T23:38:38.380Z | creating sq 10 |
| 422 | 2026-09-22T23:38:38.380Z | operation: TestAction { op: SubmitWrite { queue: 3, lba: 11286, memptr: 1433600, size: 4096, fresh_cid: true }, result: Ok } |
| 423 | 2026-09-22T23:38:38.380Z | operation: TestAction { op: Migrate, result: Ok } |
| 424 | 2026-09-22T23:38:38.380Z | operation: TestAction { op: Migrate, result: Ok } |
| 425 | 2026-09-22T23:38:38.380Z | operation: TestAction { op: DeleteCQ(5), result: Err } |
| 426 | 2026-09-22T23:38:38.380Z | operation: TestAction { op: CreateSQ(6), result: Ok } |
| 427 | 2026-09-22T23:38:38.380Z | creating sq 6 |
| 428 | 2026-09-22T23:38:38.380Z | operation: TestAction { op: Migrate, result: Ok } |
| 429 | 2026-09-22T23:38:38.380Z | operation: TestAction { op: SubmitWrite { queue: 10, lba: 7132, memptr: 1400832, size: 4096, fresh_cid: true }, result: Ok } |
| 430 | 2026-09-22T23:38:38.380Z | operation: TestAction { op: DeleteCQ(16), result: Ok } |
| 431 | 2026-09-22T23:38:38.380Z | operation: TestAction { op: Migrate, result: Ok } |
| 432 | 2026-09-22T23:38:38.380Z | operation: TestAction { op: SubmitRead { queue: 4, lba: 10284, memptr: 1556480, size: 4096, fresh_cid: true }, result: Ok } |
| 433 | 2026-09-22T23:38:38.380Z | operation: TestAction { op: DeleteSQ(16), result: Err } |
| 434 | 2026-09-22T23:38:38.380Z | sq (16) lives another day |
| 435 | 2026-09-22T23:38:38.380Z | operation: TestAction { op: Migrate, result: Ok } |
| 436 | 2026-09-22T23:38:38.380Z | operation: TestAction { op: DeleteSQ(1), result: Err } |
| 437 | 2026-09-22T23:38:38.380Z | sq (1) lives another day |
| 438 | 2026-09-22T23:38:38.380Z | operation: TestAction { op: Migrate, result: Ok } |
| 439 | 2026-09-22T23:38:38.380Z | operation: TestAction { op: Doorbell(8), result: Ok } |
| 440 | 2026-09-22T23:38:38.380Z | operation: TestAction { op: SubmitRead { queue: 8, lba: 2233, memptr: 1466368, size: 4096, fresh_cid: true }, result: Ok } |
| 441 | 2026-09-22T23:38:38.380Z | operation: TestAction { op: Migrate, result: Ok } |
| 442 | 2026-09-22T23:38:38.380Z | operation: TestAction { op: CreateSQ(2), result: Ok } |
| 443 | 2026-09-22T23:38:38.380Z | creating sq 2 |
| 444 | 2026-09-22T23:38:38.380Z | operation: TestAction { op: CreateSQ(1), result: Err } |
| 445 | 2026-09-22T23:38:38.380Z | creating sq 1 |
| 446 | 2026-09-22T23:38:38.380Z | operation: TestAction { op: Migrate, result: Ok } |
| 447 | 2026-09-22T23:38:38.380Z | operation: TestAction { op: SubmitRead { queue: 15, lba: 4714, memptr: 1495040, size: 4096, fresh_cid: true }, result: Ok } |
| 448 | 2026-09-22T23:38:38.380Z | operation: TestAction { op: WaitIO { queue: 4, cid: 65534 }, result: Ok } |
| 449 | 2026-09-22T23:38:38.380Z | reading cqe from cq slot 0, addr 1c9000 |
| 450 | 2026-09-22T23:38:38.381Z | got cqe: CompletionQueueEntry { dw0: 0, rsvd: 0, sqhd: 1, sqid: 4, cid: 65534, status_phase: 1 } |
| 451 | 2026-09-22T23:38:38.381Z | DONE with I/O 65534 on queue 4 |
| 452 | 2026-09-22T23:38:38.381Z | operation: TestAction { op: SubmitRead { queue: 3, lba: 4783, memptr: 1208320, size: 4096, fresh_cid: true }, result: Ok } |
| 453 | 2026-09-22T23:38:38.381Z | operation: TestAction { op: DeleteCQ(16), result: Err } |
| 454 | 2026-09-22T23:38:38.381Z | operation: TestAction { op: WaitIO { queue: 8, cid: 65533 }, result: Ok } |
| 455 | 2026-09-22T23:38:38.381Z | reading cqe from cq slot 0, addr 1d1000 |
| 456 | 2026-09-22T23:38:38.381Z | got cqe: CompletionQueueEntry { dw0: 0, rsvd: 0, sqhd: 1, sqid: 8, cid: 65534, status_phase: 1 } |
| 457 | 2026-09-22T23:38:38.381Z | reading cqe from cq slot 1, addr 1d1010 |
| 458 | 2026-09-22T23:38:38.381Z | got cqe: CompletionQueueEntry { dw0: 0, rsvd: 0, sqhd: 0, sqid: 0, cid: 0, status_phase: 0 } |
| 459 | 2026-09-22T23:38:38.381Z | reading cqe from cq slot 1, addr 1d1010 |
| 460 | 2026-09-22T23:38:38.381Z | got cqe: CompletionQueueEntry { dw0: 0, rsvd: 0, sqhd: 0, sqid: 0, cid: 0, status_phase: 0 } |
| 461 | 2026-09-22T23:38:38.381Z | reading cqe from cq slot 1, addr 1d1010 |
| 462 | 2026-09-22T23:38:38.381Z | got cqe: CompletionQueueEntry { dw0: 0, rsvd: 0, sqhd: 0, sqid: 0, cid: 0, status_phase: 0 } |
| 463 | 2026-09-22T23:38:38.381Z | reading cqe from cq slot 1, addr 1d1010 |
| 464 | 2026-09-22T23:38:38.381Z | got cqe: CompletionQueueEntry { dw0: 0, rsvd: 0, sqhd: 0, sqid: 0, cid: 0, status_phase: 0 } |
| 465 | 2026-09-22T23:38:38.381Z | reading cqe from cq slot 1, addr 1d1010 |
| 466 | 2026-09-22T23:38:38.381Z | got cqe: CompletionQueueEntry { dw0: 0, rsvd: 0, sqhd: 0, sqid: 0, cid: 0, status_phase: 0 } |
| 467 | 2026-09-22T23:38:38.381Z | reading cqe from cq slot 1, addr 1d1010 |
| 468 | 2026-09-22T23:38:38.381Z | got cqe: CompletionQueueEntry { dw0: 0, rsvd: 0, sqhd: 0, sqid: 0, cid: 0, status_phase: 0 } |
| 469 | 2026-09-22T23:38:38.381Z | reading cqe from cq slot 1, addr 1d1010 |
| 470 | 2026-09-22T23:38:38.381Z | got cqe: CompletionQueueEntry { dw0: 0, rsvd: 0, sqhd: 0, sqid: 0, cid: 0, status_phase: 0 } |
| 471 | 2026-09-22T23:38:38.381Z | reading cqe from cq slot 1, addr 1d1010 |
| 472 | 2026-09-22T23:38:38.381Z | got cqe: CompletionQueueEntry { dw0: 0, rsvd: 0, sqhd: 0, sqid: 0, cid: 0, status_phase: 0 } |
| 473 | 2026-09-22T23:38:38.381Z | reading cqe from cq slot 1, addr 1d1010 |
| 474 | 2026-09-22T23:38:38.381Z | got cqe: CompletionQueueEntry { dw0: 0, rsvd: 0, sqhd: 0, sqid: 0, cid: 0, status_phase: 0 } |
| 475 | 2026-09-22T23:38:38.406Z | reading cqe from cq slot 1, addr 1d1010 |
| 476 | 2026-09-22T23:38:38.406Z | got cqe: CompletionQueueEntry { dw0: 0, rsvd: 0, sqhd: 0, sqid: 0, cid: 0, status_phase: 0 } |
| 477 | 2026-09-22T23:38:38.406Z | reading cqe from cq slot 1, addr 1d1010 |
| 478 | 2026-09-22T23:38:38.406Z | got cqe: CompletionQueueEntry { dw0: 0, rsvd: 0, sqhd: 0, sqid: 0, cid: 0, status_phase: 0 } |
| 479 | 2026-09-22T23:38:38.406Z | reading cqe from cq slot 1, addr 1d1010 |
| 480 | 2026-09-22T23:38:38.406Z | got cqe: CompletionQueueEntry { dw0: 0, rsvd: 0, sqhd: 0, sqid: 0, cid: 0, status_phase: 0 } |
| 481 | 2026-09-22T23:38:38.406Z | reading cqe from cq slot 1, addr 1d1010 |
| 482 | 2026-09-22T23:38:38.406Z | got cqe: CompletionQueueEntry { dw0: 0, rsvd: 0, sqhd: 0, sqid: 0, cid: 0, status_phase: 0 } |
| 483 | 2026-09-22T23:38:38.406Z | reading cqe from cq slot 1, addr 1d1010 |
| 484 | 2026-09-22T23:38:38.406Z | got cqe: CompletionQueueEntry { dw0: 0, rsvd: 0, sqhd: 0, sqid: 0, cid: 0, status_phase: 0 } |
| 485 | 2026-09-22T23:38:38.406Z | reading cqe from cq slot 1, addr 1d1010 |
| 486 | 2026-09-22T23:38:38.406Z | got cqe: CompletionQueueEntry { dw0: 0, rsvd: 0, sqhd: 0, sqid: 0, cid: 0, status_phase: 0 } |
| 487 | 2026-09-22T23:38:38.406Z | reading cqe from cq slot 1, addr 1d1010 |
| 488 | 2026-09-22T23:38:38.406Z | got cqe: CompletionQueueEntry { dw0: 0, rsvd: 0, sqhd: 0, sqid: 0, cid: 0, status_phase: 0 } |
| 489 | 2026-09-22T23:38:38.406Z | reading cqe from cq slot 1, addr 1d1010 |
| 490 | 2026-09-22T23:38:38.407Z | got cqe: CompletionQueueEntry { dw0: 0, rsvd: 0, sqhd: 0, sqid: 0, cid: 0, status_phase: 0 } |
| 491 | 2026-09-22T23:38:38.407Z | reading cqe from cq slot 1, addr 1d1010 |
| 492 | 2026-09-22T23:38:38.407Z | got cqe: CompletionQueueEntry { dw0: 0, rsvd: 0, sqhd: 0, sqid: 0, cid: 0, status_phase: 0 } |
| 493 | 2026-09-22T23:38:38.407Z | reading cqe from cq slot 1, addr 1d1010 |
| 494 | 2026-09-22T23:38:38.407Z | got cqe: CompletionQueueEntry { dw0: 0, rsvd: 0, sqhd: 0, sqid: 0, cid: 0, status_phase: 0 } |
| 495 | 2026-09-22T23:38:38.407Z | reading cqe from cq slot 1, addr 1d1010 |
| 496 | 2026-09-22T23:38:38.407Z | got cqe: CompletionQueueEntry { dw0: 0, rsvd: 0, sqhd: 0, sqid: 0, cid: 0, status_phase: 0 } |
| 497 | 2026-09-22T23:38:38.407Z | reading cqe from cq slot 1, addr 1d1010 |
| 498 | 2026-09-22T23:38:38.407Z | got cqe: CompletionQueueEntry { dw0: 0, rsvd: 0, sqhd: 0, sqid: 0, cid: 0, status_phase: 0 } |
| 499 | 2026-09-22T23:38:38.407Z | reading cqe from cq slot 1, addr 1d1010 |
| 500 | 2026-09-22T23:38:38.407Z | got cqe: CompletionQueueEntry { dw0: 0, rsvd: 0, sqhd: 0, sqid: 0, cid: 0, status_phase: 0 } |
| 501 | 2026-09-22T23:38:38.407Z | reading cqe from cq slot 1, addr 1d1010 |
| 502 | 2026-09-22T23:38:38.407Z | got cqe: CompletionQueueEntry { dw0: 0, rsvd: 0, sqhd: 0, sqid: 0, cid: 0, status_phase: 0 } |
| 503 | 2026-09-22T23:38:38.407Z | reading cqe from cq slot 1, addr 1d1010 |
| 504 | 2026-09-22T23:38:38.407Z | got cqe: CompletionQueueEntry { dw0: 0, rsvd: 0, sqhd: 0, sqid: 0, cid: 0, status_phase: 0 } |
| 505 | 2026-09-22T23:38:38.407Z | reading cqe from cq slot 1, addr 1d1010 |
| 506 | 2026-09-22T23:38:38.407Z | got cqe: CompletionQueueEntry { dw0: 0, rsvd: 0, sqhd: 0, sqid: 0, cid: 0, status_phase: 0 } |
| 507 | 2026-09-22T23:38:38.407Z | reading cqe from cq slot 1, addr 1d1010 |
| 508 | 2026-09-22T23:38:38.407Z | got cqe: CompletionQueueEntry { dw0: 0, rsvd: 0, sqhd: 0, sqid: 0, cid: 0, status_phase: 0 } |
| 509 | 2026-09-22T23:38:38.407Z | reading cqe from cq slot 1, addr 1d1010 |
| 510 | 2026-09-22T23:38:38.407Z | got cqe: CompletionQueueEntry { dw0: 0, rsvd: 0, sqhd: 0, sqid: 0, cid: 0, status_phase: 0 } |
| 511 | 2026-09-22T23:38:38.407Z | reading cqe from cq slot 1, addr 1d1010 |
| 512 | 2026-09-22T23:38:38.407Z | got cqe: CompletionQueueEntry { dw0: 0, rsvd: 0, sqhd: 0, sqid: 0, cid: 0, status_phase: 0 } |
| 513 | 2026-09-22T23:38:38.407Z | reading cqe from cq slot 1, addr 1d1010 |
| 514 | 2026-09-22T23:38:38.407Z | got cqe: CompletionQueueEntry { dw0: 0, rsvd: 0, sqhd: 0, sqid: 0, cid: 0, status_phase: 0 } |
| 515 | 2026-09-22T23:38:38.407Z | reading cqe from cq slot 1, addr 1d1010 |
| 516 | 2026-09-22T23:38:38.407Z | got cqe: CompletionQueueEntry { dw0: 0, rsvd: 0, sqhd: 0, sqid: 0, cid: 0, status_phase: 0 } |
| 517 | 2026-09-22T23:38:38.407Z | reading cqe from cq slot 1, addr 1d1010 |
| 518 | 2026-09-22T23:38:38.407Z | got cqe: CompletionQueueEntry { dw0: 0, rsvd: 0, sqhd: 0, sqid: 0, cid: 0, status_phase: 0 } |
| 519 | 2026-09-22T23:38:38.407Z | reading cqe from cq slot 1, addr 1d1010 |
| 520 | 2026-09-22T23:38:38.407Z | got cqe: CompletionQueueEntry { dw0: 0, rsvd: 0, sqhd: 0, sqid: 0, cid: 0, status_phase: 0 } |
| 521 | 2026-09-22T23:38:38.407Z | reading cqe from cq slot 1, addr 1d1010 |
| 522 | 2026-09-22T23:38:38.407Z | got cqe: CompletionQueueEntry { dw0: 0, rsvd: 0, sqhd: 0, sqid: 0, cid: 0, status_phase: 0 } |
| 523 | 2026-09-22T23:38:38.407Z | reading cqe from cq slot 1, addr 1d1010 |
| 524 | 2026-09-22T23:38:38.407Z | got cqe: CompletionQueueEntry { dw0: 0, rsvd: 0, sqhd: 0, sqid: 0, cid: 0, status_phase: 0 } |
| 525 | 2026-09-22T23:38:38.407Z | reading cqe from cq slot 1, addr 1d1010 |
| 526 | 2026-09-22T23:38:38.407Z | got cqe: CompletionQueueEntry { dw0: 0, rsvd: 0, sqhd: 0, sqid: 0, cid: 0, status_phase: 0 } |
| 527 | 2026-09-22T23:38:38.407Z | reading cqe from cq slot 1, addr 1d1010 |
| 528 | 2026-09-22T23:38:38.407Z | got cqe: CompletionQueueEntry { dw0: 0, rsvd: 0, sqhd: 0, sqid: 0, cid: 0, status_phase: 0 } |
| 529 | 2026-09-22T23:38:38.407Z | reading cqe from cq slot 1, addr 1d1010 |
| 530 | 2026-09-22T23:38:38.408Z | got cqe: CompletionQueueEntry { dw0: 0, rsvd: 0, sqhd: 0, sqid: 0, cid: 0, status_phase: 0 } |
| 531 | 2026-09-22T23:38:38.408Z | reading cqe from cq slot 1, addr 1d1010 |
| 532 | 2026-09-22T23:38:38.408Z | got cqe: CompletionQueueEntry { dw0: 0, rsvd: 0, sqhd: 0, sqid: 0, cid: 0, status_phase: 0 } |
| 533 | 2026-09-22T23:38:38.408Z | reading cqe from cq slot 1, addr 1d1010 |
| 534 | 2026-09-22T23:38:38.408Z | got cqe: CompletionQueueEntry { dw0: 0, rsvd: 0, sqhd: 0, sqid: 0, cid: 0, status_phase: 0 } |
| 535 | 2026-09-22T23:38:38.408Z | reading cqe from cq slot 1, addr 1d1010 |
| 536 | 2026-09-22T23:38:38.408Z | got cqe: CompletionQueueEntry { dw0: 0, rsvd: 0, sqhd: 0, sqid: 0, cid: 0, status_phase: 0 } |
| 537 | 2026-09-22T23:38:38.408Z | reading cqe from cq slot 1, addr 1d1010 |
| 538 | 2026-09-22T23:38:38.408Z | got cqe: CompletionQueueEntry { dw0: 0, rsvd: 0, sqhd: 0, sqid: 0, cid: 0, status_phase: 0 } |
| 539 | 2026-09-22T23:38:38.408Z | reading cqe from cq slot 1, addr 1d1010 |
| 540 | 2026-09-22T23:38:38.408Z | got cqe: CompletionQueueEntry { dw0: 0, rsvd: 0, sqhd: 0, sqid: 0, cid: 0, status_phase: 0 } |
| 541 | 2026-09-22T23:38:38.408Z | reading cqe from cq slot 1, addr 1d1010 |
| 542 | 2026-09-22T23:38:38.408Z | got cqe: CompletionQueueEntry { dw0: 0, rsvd: 0, sqhd: 0, sqid: 0, cid: 0, status_phase: 0 } |
| 543 | 2026-09-22T23:38:38.408Z | reading cqe from cq slot 1, addr 1d1010 |
| 544 | 2026-09-22T23:38:38.408Z | got cqe: CompletionQueueEntry { dw0: 0, rsvd: 0, sqhd: 0, sqid: 0, cid: 0, status_phase: 0 } |
| 545 | 2026-09-22T23:38:38.408Z | reading cqe from cq slot 1, addr 1d1010 |
| 546 | 2026-09-22T23:38:38.408Z | got cqe: CompletionQueueEntry { dw0: 0, rsvd: 0, sqhd: 0, sqid: 0, cid: 0, status_phase: 0 } |
| 547 | 2026-09-22T23:38:38.408Z | reading cqe from cq slot 1, addr 1d1010 |
| 548 | 2026-09-22T23:38:38.408Z | got cqe: CompletionQueueEntry { dw0: 0, rsvd: 0, sqhd: 0, sqid: 0, cid: 0, status_phase: 0 } |
| 549 | 2026-09-22T23:38:38.408Z | reading cqe from cq slot 1, addr 1d1010 |
| 550 | 2026-09-22T23:38:38.408Z | got cqe: CompletionQueueEntry { dw0: 0, rsvd: 0, sqhd: 0, sqid: 0, cid: 0, status_phase: 0 } |
| 551 | 2026-09-22T23:38:38.408Z | reading cqe from cq slot 1, addr 1d1010 |
| 552 | 2026-09-22T23:38:38.408Z | got cqe: CompletionQueueEntry { dw0: 0, rsvd: 0, sqhd: 0, sqid: 0, cid: 0, status_phase: 0 } |
| 553 | 2026-09-22T23:38:38.408Z | reading cqe from cq slot 1, addr 1d1010 |
| 554 | 2026-09-22T23:38:38.408Z | got cqe: CompletionQueueEntry { dw0: 0, rsvd: 0, sqhd: 0, sqid: 0, cid: 0, status_phase: 0 } |
| 555 | 2026-09-22T23:38:38.408Z | reading cqe from cq slot 1, addr 1d1010 |
| 556 | 2026-09-22T23:38:38.408Z | got cqe: CompletionQueueEntry { dw0: 0, rsvd: 0, sqhd: 0, sqid: 0, cid: 0, status_phase: 0 } |
| 557 | 2026-09-22T23:38:38.408Z | reading cqe from cq slot 1, addr 1d1010 |
| 558 | 2026-09-22T23:38:38.408Z | got cqe: CompletionQueueEntry { dw0: 0, rsvd: 0, sqhd: 0, sqid: 0, cid: 0, status_phase: 0 } |
| 559 | 2026-09-22T23:38:38.408Z | reading cqe from cq slot 1, addr 1d1010 |
| 560 | 2026-09-22T23:38:38.408Z | got cqe: CompletionQueueEntry { dw0: 0, rsvd: 0, sqhd: 0, sqid: 0, cid: 0, status_phase: 0 } |
| 561 | 2026-09-22T23:38:38.408Z | reading cqe from cq slot 1, addr 1d1010 |
| 562 | 2026-09-22T23:38:38.408Z | got cqe: CompletionQueueEntry { dw0: 0, rsvd: 0, sqhd: 0, sqid: 0, cid: 0, status_phase: 0 } |
| 563 | 2026-09-22T23:38:38.408Z | reading cqe from cq slot 1, addr 1d1010 |
| 564 | 2026-09-22T23:38:38.408Z | got cqe: CompletionQueueEntry { dw0: 0, rsvd: 0, sqhd: 0, sqid: 0, cid: 0, status_phase: 0 } |
| 565 | 2026-09-22T23:38:38.408Z | reading cqe from cq slot 1, addr 1d1010 |
| 566 | 2026-09-22T23:38:38.408Z | got cqe: CompletionQueueEntry { dw0: 0, rsvd: 0, sqhd: 0, sqid: 0, cid: 0, status_phase: 0 } |
| 567 | 2026-09-22T23:38:38.408Z | reading cqe from cq slot 1, addr 1d1010 |
| 568 | 2026-09-22T23:38:38.408Z | got cqe: CompletionQueueEntry { dw0: 0, rsvd: 0, sqhd: 0, sqid: 0, cid: 0, status_phase: 0 } |
| 569 | 2026-09-22T23:38:38.409Z | reading cqe from cq slot 1, addr 1d1010 |
| 570 | 2026-09-22T23:38:38.409Z | got cqe: CompletionQueueEntry { dw0: 0, rsvd: 0, sqhd: 0, sqid: 0, cid: 0, status_phase: 0 } |
| 571 | 2026-09-22T23:38:38.409Z | reading cqe from cq slot 1, addr 1d1010 |
| 572 | 2026-09-22T23:38:38.409Z | got cqe: CompletionQueueEntry { dw0: 0, rsvd: 0, sqhd: 0, sqid: 0, cid: 0, status_phase: 0 } |
| 573 | 2026-09-22T23:38:38.409Z | reading cqe from cq slot 1, addr 1d1010 |
| 574 | 2026-09-22T23:38:38.409Z | got cqe: CompletionQueueEntry { dw0: 0, rsvd: 0, sqhd: 0, sqid: 0, cid: 0, status_phase: 0 } |
| 575 | 2026-09-22T23:38:38.434Z | reading cqe from cq slot 1, addr 1d1010 |
| 576 | 2026-09-22T23:38:38.434Z | got cqe: CompletionQueueEntry { dw0: 0, rsvd: 0, sqhd: 0, sqid: 0, cid: 0, status_phase: 0 } |
| 577 | 2026-09-22T23:38:38.434Z | reading cqe from cq slot 1, addr 1d1010 |
| 578 | 2026-09-22T23:38:38.434Z | got cqe: CompletionQueueEntry { dw0: 0, rsvd: 0, sqhd: 0, sqid: 0, cid: 0, status_phase: 0 } |
| 579 | 2026-09-22T23:38:38.434Z | reading cqe from cq slot 1, addr 1d1010 |
| 580 | 2026-09-22T23:38:38.434Z | got cqe: CompletionQueueEntry { dw0: 0, rsvd: 0, sqhd: 0, sqid: 0, cid: 0, status_phase: 0 } |
| 581 | 2026-09-22T23:38:38.434Z | reading cqe from cq slot 1, addr 1d1010 |
| 582 | 2026-09-22T23:38:38.434Z | got cqe: CompletionQueueEntry { dw0: 0, rsvd: 0, sqhd: 0, sqid: 0, cid: 0, status_phase: 0 } |
| 583 | 2026-09-22T23:38:38.434Z | reading cqe from cq slot 1, addr 1d1010 |
| 584 | 2026-09-22T23:38:38.434Z | got cqe: CompletionQueueEntry { dw0: 0, rsvd: 0, sqhd: 0, sqid: 0, cid: 0, status_phase: 0 } |
| 585 | 2026-09-22T23:38:38.434Z | reading cqe from cq slot 1, addr 1d1010 |
| 586 | 2026-09-22T23:38:38.434Z | got cqe: CompletionQueueEntry { dw0: 0, rsvd: 0, sqhd: 0, sqid: 0, cid: 0, status_phase: 0 } |
| 587 | 2026-09-22T23:38:38.434Z | reading cqe from cq slot 1, addr 1d1010 |
| 588 | 2026-09-22T23:38:38.434Z | got cqe: CompletionQueueEntry { dw0: 0, rsvd: 0, sqhd: 0, sqid: 0, cid: 0, status_phase: 0 } |
| 589 | 2026-09-22T23:38:38.434Z | reading cqe from cq slot 1, addr 1d1010 |
| 590 | 2026-09-22T23:38:38.434Z | got cqe: CompletionQueueEntry { dw0: 0, rsvd: 0, sqhd: 0, sqid: 0, cid: 0, status_phase: 0 } |
| 591 | 2026-09-22T23:38:38.434Z | reading cqe from cq slot 1, addr 1d1010 |
| 592 | 2026-09-22T23:38:38.434Z | got cqe: CompletionQueueEntry { dw0: 0, rsvd: 0, sqhd: 0, sqid: 0, cid: 0, status_phase: 0 } |
| 593 | 2026-09-22T23:38:38.434Z | reading cqe from cq slot 1, addr 1d1010 |
| 594 | 2026-09-22T23:38:38.434Z | got cqe: CompletionQueueEntry { dw0: 0, rsvd: 0, sqhd: 0, sqid: 0, cid: 0, status_phase: 0 } |
| 595 | 2026-09-22T23:38:38.434Z | reading cqe from cq slot 1, addr 1d1010 |
| 596 | 2026-09-22T23:38:38.434Z | got cqe: CompletionQueueEntry { dw0: 0, rsvd: 0, sqhd: 0, sqid: 0, cid: 0, status_phase: 0 } |
| 597 | 2026-09-22T23:38:38.434Z | reading cqe from cq slot 1, addr 1d1010 |
| 598 | 2026-09-22T23:38:38.434Z | got cqe: CompletionQueueEntry { dw0: 0, rsvd: 0, sqhd: 0, sqid: 0, cid: 0, status_phase: 0 } |
| 599 | 2026-09-22T23:38:38.435Z | reading cqe from cq slot 1, addr 1d1010 |
| 600 | 2026-09-22T23:38:38.435Z | got cqe: CompletionQueueEntry { dw0: 0, rsvd: 0, sqhd: 0, sqid: 0, cid: 0, status_phase: 0 } |
| 601 | 2026-09-22T23:38:38.435Z | reading cqe from cq slot 1, addr 1d1010 |
| 602 | 2026-09-22T23:38:38.435Z | got cqe: CompletionQueueEntry { dw0: 0, rsvd: 0, sqhd: 0, sqid: 0, cid: 0, status_phase: 0 } |
| 603 | 2026-09-22T23:38:38.435Z | reading cqe from cq slot 1, addr 1d1010 |
| 604 | 2026-09-22T23:38:38.435Z | got cqe: CompletionQueueEntry { dw0: 0, rsvd: 0, sqhd: 0, sqid: 0, cid: 0, status_phase: 0 } |
| 605 | 2026-09-22T23:38:38.435Z | reading cqe from cq slot 1, addr 1d1010 |
| 606 | 2026-09-22T23:38:38.435Z | got cqe: CompletionQueueEntry { dw0: 0, rsvd: 0, sqhd: 0, sqid: 0, cid: 0, status_phase: 0 } |
| 607 | 2026-09-22T23:38:38.435Z | reading cqe from cq slot 1, addr 1d1010 |
| 608 | 2026-09-22T23:38:38.435Z | got cqe: CompletionQueueEntry { dw0: 0, rsvd: 0, sqhd: 0, sqid: 0, cid: 0, status_phase: 0 } |
| 609 | 2026-09-22T23:38:38.435Z | reading cqe from cq slot 1, addr 1d1010 |
| 610 | 2026-09-22T23:38:38.435Z | got cqe: CompletionQueueEntry { dw0: 0, rsvd: 0, sqhd: 0, sqid: 0, cid: 0, status_phase: 0 } |
| 611 | 2026-09-22T23:38:38.435Z | reading cqe from cq slot 1, addr 1d1010 |
| 612 | 2026-09-22T23:38:38.435Z | got cqe: CompletionQueueEntry { dw0: 0, rsvd: 0, sqhd: 0, sqid: 0, cid: 0, status_phase: 0 } |
| 613 | 2026-09-22T23:38:38.435Z | reading cqe from cq slot 1, addr 1d1010 |
| 614 | 2026-09-22T23:38:38.435Z | got cqe: CompletionQueueEntry { dw0: 0, rsvd: 0, sqhd: 0, sqid: 0, cid: 0, status_phase: 0 } |
| 615 | 2026-09-22T23:38:38.435Z | reading cqe from cq slot 1, addr 1d1010 |
| 616 | 2026-09-22T23:38:38.435Z | got cqe: CompletionQueueEntry { dw0: 0, rsvd: 0, sqhd: 0, sqid: 0, cid: 0, status_phase: 0 } |
| 617 | 2026-09-22T23:38:38.435Z | reading cqe from cq slot 1, addr 1d1010 |
| 618 | 2026-09-22T23:38:38.435Z | got cqe: CompletionQueueEntry { dw0: 0, rsvd: 0, sqhd: 0, sqid: 0, cid: 0, status_phase: 0 } |
| 619 | 2026-09-22T23:38:38.435Z | reading cqe from cq slot 1, addr 1d1010 |
| 620 | 2026-09-22T23:38:38.435Z | got cqe: CompletionQueueEntry { dw0: 0, rsvd: 0, sqhd: 0, sqid: 0, cid: 0, status_phase: 0 } |
| 621 | 2026-09-22T23:38:38.435Z | reading cqe from cq slot 1, addr 1d1010 |
| 622 | 2026-09-22T23:38:38.435Z | got cqe: CompletionQueueEntry { dw0: 0, rsvd: 0, sqhd: 0, sqid: 0, cid: 0, status_phase: 0 } |
| 623 | 2026-09-22T23:38:38.435Z | reading cqe from cq slot 1, addr 1d1010 |
| 624 | 2026-09-22T23:38:38.435Z | got cqe: CompletionQueueEntry { dw0: 0, rsvd: 0, sqhd: 0, sqid: 0, cid: 0, status_phase: 0 } |
| 625 | 2026-09-22T23:38:38.435Z | reading cqe from cq slot 1, addr 1d1010 |
| 626 | 2026-09-22T23:38:38.435Z | got cqe: CompletionQueueEntry { dw0: 0, rsvd: 0, sqhd: 0, sqid: 0, cid: 0, status_phase: 0 } |
| 627 | 2026-09-22T23:38:38.435Z | reading cqe from cq slot 1, addr 1d1010 |
| 628 | 2026-09-22T23:38:38.435Z | got cqe: CompletionQueueEntry { dw0: 0, rsvd: 0, sqhd: 0, sqid: 0, cid: 0, status_phase: 0 } |
| 629 | 2026-09-22T23:38:38.435Z | reading cqe from cq slot 1, addr 1d1010 |
| 630 | 2026-09-22T23:38:38.435Z | got cqe: CompletionQueueEntry { dw0: 0, rsvd: 0, sqhd: 0, sqid: 0, cid: 0, status_phase: 0 } |
| 631 | 2026-09-22T23:38:38.435Z | reading cqe from cq slot 1, addr 1d1010 |
| 632 | 2026-09-22T23:38:38.435Z | got cqe: CompletionQueueEntry { dw0: 0, rsvd: 0, sqhd: 0, sqid: 0, cid: 0, status_phase: 0 } |
| 633 | 2026-09-22T23:38:38.435Z | reading cqe from cq slot 1, addr 1d1010 |
| 634 | 2026-09-22T23:38:38.435Z | got cqe: CompletionQueueEntry { dw0: 0, rsvd: 0, sqhd: 0, sqid: 0, cid: 0, status_phase: 0 } |
| 635 | 2026-09-22T23:38:38.435Z | reading cqe from cq slot 1, addr 1d1010 |
| 636 | 2026-09-22T23:38:38.435Z | got cqe: CompletionQueueEntry { dw0: 0, rsvd: 0, sqhd: 0, sqid: 0, cid: 0, status_phase: 0 } |
| 637 | 2026-09-22T23:38:38.435Z | reading cqe from cq slot 1, addr 1d1010 |
| 638 | 2026-09-22T23:38:38.436Z | got cqe: CompletionQueueEntry { dw0: 0, rsvd: 0, sqhd: 0, sqid: 0, cid: 0, status_phase: 0 } |
| 639 | 2026-09-22T23:38:38.436Z | reading cqe from cq slot 1, addr 1d1010 |
| 640 | 2026-09-22T23:38:38.436Z | got cqe: CompletionQueueEntry { dw0: 0, rsvd: 0, sqhd: 0, sqid: 0, cid: 0, status_phase: 0 } |
| 641 | 2026-09-22T23:38:38.436Z | reading cqe from cq slot 1, addr 1d1010 |
| 642 | 2026-09-22T23:38:38.436Z | got cqe: CompletionQueueEntry { dw0: 0, rsvd: 0, sqhd: 0, sqid: 0, cid: 0, status_phase: 0 } |
| 643 | 2026-09-22T23:38:38.436Z | reading cqe from cq slot 1, addr 1d1010 |
| 644 | 2026-09-22T23:38:38.436Z | got cqe: CompletionQueueEntry { dw0: 0, rsvd: 0, sqhd: 0, sqid: 0, cid: 0, status_phase: 0 } |
| 645 | 2026-09-22T23:38:38.436Z | reading cqe from cq slot 1, addr 1d1010 |
| 646 | 2026-09-22T23:38:38.436Z | got cqe: CompletionQueueEntry { dw0: 0, rsvd: 0, sqhd: 0, sqid: 0, cid: 0, status_phase: 0 } |
| 647 | 2026-09-22T23:38:38.436Z | reading cqe from cq slot 1, addr 1d1010 |
| 648 | 2026-09-22T23:38:38.436Z | got cqe: CompletionQueueEntry { dw0: 0, rsvd: 0, sqhd: 0, sqid: 0, cid: 0, status_phase: 0 } |
| 649 | 2026-09-22T23:38:38.436Z | reading cqe from cq slot 1, addr 1d1010 |
| 650 | 2026-09-22T23:38:38.436Z | got cqe: CompletionQueueEntry { dw0: 0, rsvd: 0, sqhd: 0, sqid: 0, cid: 0, status_phase: 0 } |
| 651 | 2026-09-22T23:38:38.436Z | reading cqe from cq slot 1, addr 1d1010 |
| 652 | 2026-09-22T23:38:38.436Z | got cqe: CompletionQueueEntry { dw0: 0, rsvd: 0, sqhd: 0, sqid: 0, cid: 0, status_phase: 0 } |
| 653 | 2026-09-22T23:38:38.436Z | |
| 654 | 2026-09-22T23:38:38.436Z | thread 'hw::nvme::test::fuzzy' (97) panicked at lib/propolis/src/hw/nvme/test.rs:944:29: |
| 655 | 2026-09-22T23:38:38.436Z | i/o never happened |
| 656 | 2026-09-22T23:38:38.436Z | |
| 657 | 2026-09-22T23:38:38.436Z | |
| 658 | 2026-09-22T23:38:38.436Z | failures: |
| 659 | 2026-09-22T23:38:38.436Z | hw::nvme::test::fuzzy |
| 660 | 2026-09-22T23:38:38.436Z | |
| 661 | 2026-09-22T23:38:38.436Z | test result: FAILED. 194 passed; 1 failed; 0 ignored; 0 measured; 0 filtered out; finished in 4.04s |
| 662 | 2026-09-22T23:38:38.436Z | |
| 663 | 2026-09-22T23:38:38.436Z | |
| 664 | 2026-09-22T23:38:38.436Z | real 4.064855838 |
| 665 | 2026-09-22T23:38:38.436Z | user 6.085072850 |
| 666 | 2026-09-22T23:38:38.436Z | sys 5.559887993 |
| 667 | 2026-09-22T23:38:38.436Z | trap 0.126076981 |
| 668 | 2026-09-22T23:38:38.436Z | tflt 0.009476234 |
| 669 | 2026-09-22T23:38:38.436Z | dflt 0.017345473 |
| 670 | 2026-09-22T23:38:38.436Z | kflt 0.000013565 |
| 671 | 2026-09-22T23:38:38.436Z | lock 2:15.875114221 |
| 672 | 2026-09-22T23:38:38.436Z | slp 13.688650126 |
| 673 | 2026-09-22T23:38:38.436Z | lat 0.355600855 |
| 674 | 2026-09-22T23:38:38.436Z | stop 8.233092243 |
| 675 | 2026-09-22T23:38:38.461Z | process exited: duration 18352 ms, exit code 101 |
| |
| 676 | 2026-09-22T23:38:38.511Z | found 0 output files |